{"text_format":"1","workbook":"xlsx","n_sheets":3,"sheets":["2025 Order Form","Data","PFA Direct"],"not_rendered":{"charts":0,"images":80,"macros":0,"external_links":0,"defined_names":3,"comments":0,"pivot_tables":0},"unopened":[],"bounds":{"document_bytes":16777216,"sheet_cells":100000,"rows_first":2000,"rows_last":500,"rows_between":2000,"halvings":0,"cell_chars":16384,"cell_head_chars":4096},"cells_cut":0,"cells_raw":0,"read":"whole","date_system":"1900"}

{"sheet":"2025 Order Form","index":0,"n_rows":601,"n_cols":15,"rows_kept":601,"cut":false,"hidden":false,"merged":[[15,6,15,10],[16,1,16,10],[17,0,17,10],[18,0,18,10],[14,0,14,2],[14,3,14,5],[14,6,14,7],[14,8,14,9],[15,0,15,1],[15,3,15,5],[7,0,7,2],[8,0,8,3],[8,4,8,10],[9,0,9,3],[9,4,9,10],[13,0,13,2],[13,3,13,5],[13,6,13,7],[13,8,13,9],[10,0,10,3],[10,4,10,10],[11,0,11,3],[11,4,11,10],[12,0,12,2],[12,3,12,7],[12,8,12,10]]}
[null,null,"Sunstar Industries"]
[null,null,"PO Box 3037"]
[null,null,"Cerritos, CA  90703"]
[null,null,"Ph: (657) 239-0196"]
[null,null,"order@sunstargifts.com"]
[]
[]
[" "]
[]
[]
[]
[]
[]
[]
[null,null,null,null,null,null,"PFA",null,"show",null,20]
[]
[]
[null,null,null,null,null,null,null,null,null,null,null,null,null,null,"Running Total:"]
[null,null,null,null,null,null,null,null,null,null,null,null,null,null,{"$f":"K601","v":0}]
[]
["Qty","Item #","Description","UPC #","Ct","Pg","Whsl","DC","PRG","Cost","TOTAL","PRG","Case Qty","Total Cases","Status"]
[null,null,{"$f":"IF($B22=\"\",\"\",VLOOKUP($B22,Data!$A$4:$T$727,2,FALSE))","v":""},{"$f":"IF($B22=\"\",\"\",VLOOKUP($B22,Data!$A$4:$T$727,10,FALSE))","v":""},{"$f":"IF($B22=\"\",\"\",VLOOKUP($B22,Data!$A$4:$T$727,4,FALSE))","v":""},{"$f":"IF($B22=\"\",\"\",VLOOKUP($B22,Data!$A$4:$T$727,5,FALSE))","v":""},{"$f":"IF($B22=\"\",\"\",VLOOKUP($B22,Data!$A$4:$T$727,7,FALSE))","v":""},{"$f":"IF($B22=\"\",\"\",IF($K$15=\"\",\"\",ROUND($G22*(1-($K$15*0.01)),2)))","v":""},{"$f":"IF($B22=\"\",\"\",IF($G22=$L22,\"\",L22))","v":""},{"$f":"IF($B22=\"\",\"\",IF($H22<$L22,$H22,$L22))","v":""},{"$f":"IF(A22=\"\",\"\",J22*A22)","v":""},{"$f":"IF($I$15=\"Show\",VLOOKUP($B22,Data!$A$4:$T$727,9,FALSE),VLOOKUP($B22,Data!$A$4:$T$727,7,FALSE))","v":{"$error":"#N/A"}},{"$f":"IF($B22=\"\",\"\",VLOOKUP($B22,Data!$A$4:$T$727,6,FALSE))","v":""},{"$f":"IF($A22=\"\",\"\",$A22/$M22)","v":""},{"$f":"IF($B22=\"\",\"\",IF(VLOOKUP($B22,Data!$A$4:$T$727,11,FALSE)<1,\"\",VLOOKUP(B22,Data!$A$4:$T$727,11,FALSE)))","v":""}]
[null,null,{"$f":"IF($B23=\"\",\"\",VLOOKUP($B23,Data!$A$4:$T$727,2,FALSE))","v":""},{"$f":"IF($B23=\"\",\"\",VLOOKUP($B23,Data!$A$4:$T$727,10,FALSE))","v":""},{"$f":"IF($B23=\"\",\"\",VLOOKUP($B23,Data!$A$4:$T$727,4,FALSE))","v":""},{"$f":"IF($B23=\"\",\"\",VLOOKUP($B23,Data!$A$4:$T$727,5,FALSE))","v":""},{"$f":"IF($B23=\"\",\"\",VLOOKUP($B23,Data!$A$4:$T$727,7,FALSE))","v":""},{"$f":"IF($B23=\"\",\"\",IF($K$15=\"\",\"\",ROUND($G23*(1-($K$15*0.01)),2)))","v":""},{"$f":"IF($B23=\"\",\"\",IF($G23=$L23,\"\",L23))","v":""},{"$f":"IF($B23=\"\",\"\",IF($H23<$L23,$H23,$L23))","v":""},"",{"$f":"IF($I$15=\"Show\",VLOOKUP($B23,Data!$A$4:$T$727,9,FALSE),VLOOKUP($B23,Data!$A$4:$T$727,7,FALSE))","v":{"$error":"#N/A"}},{"$f":"IF($B23=\"\",\"\",VLOOKUP($B23,Data!$A$4:$T$727,6,FALSE))","v":""},"",{"$f":"IF($B23=\"\",\"\",IF(VLOOKUP($B23,Data!$A$4:$T$727,11,FALSE)<1,\"\",VLOOKUP(B23,Data!$A$4:$T$727,11,FALSE)))","v":""}]
[null,null,{"$f":"IF($B24=\"\",\"\",VLOOKUP($B24,Data!$A$4:$T$727,2,FALSE))","v":""},{"$f":"IF($B24=\"\",\"\",VLOOKUP($B24,Data!$A$4:$T$727,10,FALSE))","v":""},{"$f":"IF($B24=\"\",\"\",VLOOKUP($B24,Data!$A$4:$T$727,4,FALSE))","v":""},{"$f":"IF($B24=\"\",\"\",VLOOKUP($B24,Data!$A$4:$T$727,5,FALSE))","v":""},{"$f":"IF($B24=\"\",\"\",VLOOKUP($B24,Data!$A$4:$T$727,7,FALSE))","v":""},{"$f":"IF($B24=\"\",\"\",IF($K$15=\"\",\"\",ROUND($G24*(1-($K$15*0.01)),2)))","v":""},{"$f":"IF($B24=\"\",\"\",IF($G24=$L24,\"\",L24))","v":""},{"$f":"IF($B24=\"\",\"\",IF($H24<$L24,$H24,$L24))","v":""},"",{"$f":"IF($I$15=\"Show\",VLOOKUP($B24,Data!$A$4:$T$727,9,FALSE),VLOOKUP($B24,Data!$A$4:$T$727,7,FALSE))","v":{"$error":"#N/A"}},{"$f":"IF($B24=\"\",\"\",VLOOKUP($B24,Data!$A$4:$T$727,6,FALSE))","v":""},"",{"$f":"IF($B24=\"\",\"\",IF(VLOOKUP($B24,Data!$A$4:$T$727,11,FALSE)<1,\"\",VLOOKUP(B24,Data!$A$4:$T$727,11,FALSE)))","v":""}]
[null,null,{"$f":"IF($B25=\"\",\"\",VLOOKUP($B25,Data!$A$4:$T$727,2,FALSE))","v":""},{"$f":"IF($B25=\"\",\"\",VLOOKUP($B25,Data!$A$4:$T$727,10,FALSE))","v":""},{"$f":"IF($B25=\"\",\"\",VLOOKUP($B25,Data!$A$4:$T$727,4,FALSE))","v":""},{"$f":"IF($B25=\"\",\"\",VLOOKUP($B25,Data!$A$4:$T$727,5,FALSE))","v":""},{"$f":"IF($B25=\"\",\"\",VLOOKUP($B25,Data!$A$4:$T$727,7,FALSE))","v":""},"","","","",{"$f":"IF($I$15=\"Show\",VLOOKUP($B25,Data!$A$4:$T$727,9,FALSE),VLOOKUP($B25,Data!$A$4:$T$727,7,FALSE))","v":{"$error":"#N/A"}},{"$f":"IF($B25=\"\",\"\",VLOOKUP($B25,Data!$A$4:$T$727,6,FALSE))","v":""},"",{"$f":"IF($B25=\"\",\"\",IF(VLOOKUP($B25,Data!$A$4:$T$727,11,FALSE)<1,\"\",VLOOKUP(B25,Data!$A$4:$T$727,11,FALSE)))","v":""}]
[null,null,{"$f":"IF($B26=\"\",\"\",VLOOKUP($B26,Data!$A$4:$T$727,2,FALSE))","v":""},{"$f":"IF($B26=\"\",\"\",VLOOKUP($B26,Data!$A$4:$T$727,10,FALSE))","v":""},{"$f":"IF($B26=\"\",\"\",VLOOKUP($B26,Data!$A$4:$T$727,4,FALSE))","v":""},{"$f":"IF($B26=\"\",\"\",VLOOKUP($B26,Data!$A$4:$T$727,5,FALSE))","v":""},{"$f":"IF($B26=\"\",\"\",VLOOKUP($B26,Data!$A$4:$T$727,7,FALSE))","v":""},"","","","",{"$f":"IF($I$15=\"Show\",VLOOKUP($B26,Data!$A$4:$T$727,9,FALSE),VLOOKUP($B26,Data!$A$4:$T$727,7,FALSE))","v":{"$error":"#N/A"}},{"$f":"IF($B26=\"\",\"\",VLOOKUP($B26,Data!$A$4:$T$727,6,FALSE))","v":""},"",{"$f":"IF($B26=\"\",\"\",IF(VLOOKUP($B26,Data!$A$4:$T$727,11,FALSE)<1,\"\",VLOOKUP(B26,Data!$A$4:$T$727,11,FALSE)))","v":""}]
[null,null,{"$f":"IF($B27=\"\",\"\",VLOOKUP($B27,Data!$A$4:$T$727,2,FALSE))","v":""},{"$f":"IF($B27=\"\",\"\",VLOOKUP($B27,Data!$A$4:$T$727,10,FALSE))","v":""},{"$f":"IF($B27=\"\",\"\",VLOOKUP($B27,Data!$A$4:$T$727,4,FALSE))","v":""},{"$f":"IF($B27=\"\",\"\",VLOOKUP($B27,Data!$A$4:$T$727,5,FALSE))","v":""},{"$f":"IF($B27=\"\",\"\",VLOOKUP($B27,Data!$A$4:$T$727,7,FALSE))","v":""},"","","","",{"$f":"IF($I$15=\"Show\",VLOOKUP($B27,Data!$A$4:$T$727,9,FALSE),VLOOKUP($B27,Data!$A$4:$T$727,7,FALSE))","v":{"$error":"#N/A"}},{"$f":"IF($B27=\"\",\"\",VLOOKUP($B27,Data!$A$4:$T$727,6,FALSE))","v":""},"",{"$f":"IF($B27=\"\",\"\",IF(VLOOKUP($B27,Data!$A$4:$T$727,11,FALSE)<1,\"\",VLOOKUP(B27,Data!$A$4:$T$727,11,FALSE)))","v":""}]
[null,null,{"$f":"IF($B28=\"\",\"\",VLOOKUP($B28,Data!$A$4:$T$727,2,FALSE))","v":""},{"$f":"IF($B28=\"\",\"\",VLOOKUP($B28,Data!$A$4:$T$727,10,FALSE))","v":""},{"$f":"IF($B28=\"\",\"\",VLOOKUP($B28,Data!$A$4:$T$727,4,FALSE))","v":""},{"$f":"IF($B28=\"\",\"\",VLOOKUP($B28,Data!$A$4:$T$727,5,FALSE))","v":""},{"$f":"IF($B28=\"\",\"\",VLOOKUP($B28,Data!$A$4:$T$727,7,FALSE))","v":""},"","","","",{"$f":"IF($I$15=\"Show\",VLOOKUP($B28,Data!$A$4:$T$727,9,FALSE),VLOOKUP($B28,Data!$A$4:$T$727,7,FALSE))","v":{"$error":"#N/A"}},{"$f":"IF($B28=\"\",\"\",VLOOKUP($B28,Data!$A$4:$T$727,6,FALSE))","v":""},"",{"$f":"IF($B28=\"\",\"\",IF(VLOOKUP($B28,Data!$A$4:$T$727,11,FALSE)<1,\"\",VLOOKUP(B28,Data!$A$4:$T$727,11,FALSE)))","v":""}]
[null,null,{"$f":"IF($B29=\"\",\"\",VLOOKUP($B29,Data!$A$4:$T$727,2,FALSE))","v":""},{"$f":"IF($B29=\"\",\"\",VLOOKUP($B29,Data!$A$4:$T$727,10,FALSE))","v":""},{"$f":"IF($B29=\"\",\"\",VLOOKUP($B29,Data!$A$4:$T$727,4,FALSE))","v":""},{"$f":"IF($B29=\"\",\"\",VLOOKUP($B29,Data!$A$4:$T$727,5,FALSE))","v":""},{"$f":"IF($B29=\"\",\"\",VLOOKUP($B29,Data!$A$4:$T$727,7,FALSE))","v":""},"","","","",{"$f":"IF($I$15=\"Show\",VLOOKUP($B29,Data!$A$4:$T$727,9,FALSE),VLOOKUP($B29,Data!$A$4:$T$727,7,FALSE))","v":{"$error":"#N/A"}},{"$f":"IF($B29=\"\",\"\",VLOOKUP($B29,Data!$A$4:$T$727,6,FALSE))","v":""},"",{"$f":"IF($B29=\"\",\"\",IF(VLOOKUP($B29,Data!$A$4:$T$727,11,FALSE)<1,\"\",VLOOKUP(B29,Data!$A$4:$T$727,11,FALSE)))","v":""}]
[null,null,{"$f":"IF($B30=\"\",\"\",VLOOKUP($B30,Data!$A$4:$T$727,2,FALSE))","v":""},{"$f":"IF($B30=\"\",\"\",VLOOKUP($B30,Data!$A$4:$T$727,10,FALSE))","v":""},{"$f":"IF($B30=\"\",\"\",VLOOKUP($B30,Data!$A$4:$T$727,4,FALSE))","v":""},{"$f":"IF($B30=\"\",\"\",VLOOKUP($B30,Data!$A$4:$T$727,5,FALSE))","v":""},{"$f":"IF($B30=\"\",\"\",VLOOKUP($B30,Data!$A$4:$T$727,7,FALSE))","v":""},"","","","",{"$f":"IF($I$15=\"Show\",VLOOKUP($B30,Data!$A$4:$T$727,9,FALSE),VLOOKUP($B30,Data!$A$4:$T$727,7,FALSE))","v":{"$error":"#N/A"}},{"$f":"IF($B30=\"\",\"\",VLOOKUP($B30,Data!$A$4:$T$727,6,FALSE))","v":""},"",{"$f":"IF($B30=\"\",\"\",IF(VLOOKUP($B30,Data!$A$4:$T$727,11,FALSE)<1,\"\",VLOOKUP(B30,Data!$A$4:$T$727,11,FALSE)))","v":""}]
[null,null,{"$f":"IF($B31=\"\",\"\",VLOOKUP($B31,Data!$A$4:$T$727,2,FALSE))","v":""},{"$f":"IF($B31=\"\",\"\",VLOOKUP($B31,Data!$A$4:$T$727,10,FALSE))","v":""},{"$f":"IF($B31=\"\",\"\",VLOOKUP($B31,Data!$A$4:$T$727,4,FALSE))","v":""},{"$f":"IF($B31=\"\",\"\",VLOOKUP($B31,Data!$A$4:$T$727,5,FALSE))","v":""},{"$f":"IF($B31=\"\",\"\",VLOOKUP($B31,Data!$A$4:$T$727,7,FALSE))","v":""},"","","","",{"$f":"IF($I$15=\"Show\",VLOOKUP($B31,Data!$A$4:$T$727,9,FALSE),VLOOKUP($B31,Data!$A$4:$T$727,7,FALSE))","v":{"$error":"#N/A"}},{"$f":"IF($B31=\"\",\"\",VLOOKUP($B31,Data!$A$4:$T$727,6,FALSE))","v":""},"",{"$f":"IF($B31=\"\",\"\",IF(VLOOKUP($B31,Data!$A$4:$T$727,11,FALSE)<1,\"\",VLOOKUP(B31,Data!$A$4:$T$727,11,FALSE)))","v":""}]
[null,null,{"$f":"IF($B32=\"\",\"\",VLOOKUP($B32,Data!$A$4:$T$727,2,FALSE))","v":""},{"$f":"IF($B32=\"\",\"\",VLOOKUP($B32,Data!$A$4:$T$727,10,FALSE))","v":""},{"$f":"IF($B32=\"\",\"\",VLOOKUP($B32,Data!$A$4:$T$727,4,FALSE))","v":""},{"$f":"IF($B32=\"\",\"\",VLOOKUP($B32,Data!$A$4:$T$727,5,FALSE))","v":""},{"$f":"IF($B32=\"\",\"\",VLOOKUP($B32,Data!$A$4:$T$727,7,FALSE))","v":""},"","","","",{"$f":"IF($I$15=\"Show\",VLOOKUP($B32,Data!$A$4:$T$727,9,FALSE),VLOOKUP($B32,Data!$A$4:$T$727,7,FALSE))","v":{"$error":"#N/A"}},{"$f":"IF($B32=\"\",\"\",VLOOKUP($B32,Data!$A$4:$T$727,6,FALSE))","v":""},"",{"$f":"IF($B32=\"\",\"\",IF(VLOOKUP($B32,Data!$A$4:$T$727,11,FALSE)<1,\"\",VLOOKUP(B32,Data!$A$4:$T$727,11,FALSE)))","v":""}]
[null,null,{"$f":"IF($B33=\"\",\"\",VLOOKUP($B33,Data!$A$4:$T$727,2,FALSE))","v":""},{"$f":"IF($B33=\"\",\"\",VLOOKUP($B33,Data!$A$4:$T$727,10,FALSE))","v":""},{"$f":"IF($B33=\"\",\"\",VLOOKUP($B33,Data!$A$4:$T$727,4,FALSE))","v":""},{"$f":"IF($B33=\"\",\"\",VLOOKUP($B33,Data!$A$4:$T$727,5,FALSE))","v":""},{"$f":"IF($B33=\"\",\"\",VLOOKUP($B33,Data!$A$4:$T$727,7,FALSE))","v":""},"","","","",{"$f":"IF($I$15=\"Show\",VLOOKUP($B33,Data!$A$4:$T$727,9,FALSE),VLOOKUP($B33,Data!$A$4:$T$727,7,FALSE))","v":{"$error":"#N/A"}},{"$f":"IF($B33=\"\",\"\",VLOOKUP($B33,Data!$A$4:$T$727,6,FALSE))","v":""},"",{"$f":"IF($B33=\"\",\"\",IF(VLOOKUP($B33,Data!$A$4:$T$727,11,FALSE)<1,\"\",VLOOKUP(B33,Data!$A$4:$T$727,11,FALSE)))","v":""}]
[null,null,{"$f":"IF($B34=\"\",\"\",VLOOKUP($B34,Data!$A$4:$T$727,2,FALSE))","v":""},{"$f":"IF($B34=\"\",\"\",VLOOKUP($B34,Data!$A$4:$T$727,10,FALSE))","v":""},{"$f":"IF($B34=\"\",\"\",VLOOKUP($B34,Data!$A$4:$T$727,4,FALSE))","v":""},{"$f":"IF($B34=\"\",\"\",VLOOKUP($B34,Data!$A$4:$T$727,5,FALSE))","v":""},{"$f":"IF($B34=\"\",\"\",VLOOKUP($B34,Data!$A$4:$T$727,7,FALSE))","v":""},"","","","",{"$f":"IF($I$15=\"Show\",VLOOKUP($B34,Data!$A$4:$T$727,9,FALSE),VLOOKUP($B34,Data!$A$4:$T$727,7,FALSE))","v":{"$error":"#N/A"}},{"$f":"IF($B34=\"\",\"\",VLOOKUP($B34,Data!$A$4:$T$727,6,FALSE))","v":""},"",{"$f":"IF($B34=\"\",\"\",IF(VLOOKUP($B34,Data!$A$4:$T$727,11,FALSE)<1,\"\",VLOOKUP(B34,Data!$A$4:$T$727,11,FALSE)))","v":""}]
[null,null,{"$f":"IF($B35=\"\",\"\",VLOOKUP($B35,Data!$A$4:$T$727,2,FALSE))","v":""},{"$f":"IF($B35=\"\",\"\",VLOOKUP($B35,Data!$A$4:$T$727,10,FALSE))","v":""},{"$f":"IF($B35=\"\",\"\",VLOOKUP($B35,Data!$A$4:$T$727,4,FALSE))","v":""},{"$f":"IF($B35=\"\",\"\",VLOOKUP($B35,Data!$A$4:$T$727,5,FALSE))","v":""},{"$f":"IF($B35=\"\",\"\",VLOOKUP($B35,Data!$A$4:$T$727,7,FALSE))","v":""},"","","","",{"$f":"IF($I$15=\"Show\",VLOOKUP($B35,Data!$A$4:$T$727,9,FALSE),VLOOKUP($B35,Data!$A$4:$T$727,7,FALSE))","v":{"$error":"#N/A"}},{"$f":"IF($B35=\"\",\"\",VLOOKUP($B35,Data!$A$4:$T$727,6,FALSE))","v":""},"",{"$f":"IF($B35=\"\",\"\",IF(VLOOKUP($B35,Data!$A$4:$T$727,11,FALSE)<1,\"\",VLOOKUP(B35,Data!$A$4:$T$727,11,FALSE)))","v":""}]
[null,null,{"$f":"IF($B36=\"\",\"\",VLOOKUP($B36,Data!$A$4:$T$727,2,FALSE))","v":""},{"$f":"IF($B36=\"\",\"\",VLOOKUP($B36,Data!$A$4:$T$727,10,FALSE))","v":""},{"$f":"IF($B36=\"\",\"\",VLOOKUP($B36,Data!$A$4:$T$727,4,FALSE))","v":""},{"$f":"IF($B36=\"\",\"\",VLOOKUP($B36,Data!$A$4:$T$727,5,FALSE))","v":""},{"$f":"IF($B36=\"\",\"\",VLOOKUP($B36,Data!$A$4:$T$727,7,FALSE))","v":""},"","","","",{"$f":"IF($I$15=\"Show\",VLOOKUP($B36,Data!$A$4:$T$727,9,FALSE),VLOOKUP($B36,Data!$A$4:$T$727,7,FALSE))","v":{"$error":"#N/A"}},{"$f":"IF($B36=\"\",\"\",VLOOKUP($B36,Data!$A$4:$T$727,6,FALSE))","v":""},"",{"$f":"IF($B36=\"\",\"\",IF(VLOOKUP($B36,Data!$A$4:$T$727,11,FALSE)<1,\"\",VLOOKUP(B36,Data!$A$4:$T$727,11,FALSE)))","v":""}]
[null,null,{"$f":"IF($B37=\"\",\"\",VLOOKUP($B37,Data!$A$4:$T$727,2,FALSE))","v":""},{"$f":"IF($B37=\"\",\"\",VLOOKUP($B37,Data!$A$4:$T$727,10,FALSE))","v":""},{"$f":"IF($B37=\"\",\"\",VLOOKUP($B37,Data!$A$4:$T$727,4,FALSE))","v":""},{"$f":"IF($B37=\"\",\"\",VLOOKUP($B37,Data!$A$4:$T$727,5,FALSE))","v":""},{"$f":"IF($B37=\"\",\"\",VLOOKUP($B37,Data!$A$4:$T$727,7,FALSE))","v":""},"","","","",{"$f":"IF($I$15=\"Show\",VLOOKUP($B37,Data!$A$4:$T$727,9,FALSE),VLOOKUP($B37,Data!$A$4:$T$727,7,FALSE))","v":{"$error":"#N/A"}},{"$f":"IF($B37=\"\",\"\",VLOOKUP($B37,Data!$A$4:$T$727,6,FALSE))","v":""},"",{"$f":"IF($B37=\"\",\"\",IF(VLOOKUP($B37,Data!$A$4:$T$727,11,FALSE)<1,\"\",VLOOKUP(B37,Data!$A$4:$T$727,11,FALSE)))","v":""}]
[null,null,{"$f":"IF($B38=\"\",\"\",VLOOKUP($B38,Data!$A$4:$T$727,2,FALSE))","v":""},{"$f":"IF($B38=\"\",\"\",VLOOKUP($B38,Data!$A$4:$T$727,10,FALSE))","v":""},{"$f":"IF($B38=\"\",\"\",VLOOKUP($B38,Data!$A$4:$T$727,4,FALSE))","v":""},{"$f":"IF($B38=\"\",\"\",VLOOKUP($B38,Data!$A$4:$T$727,5,FALSE))","v":""},{"$f":"IF($B38=\"\",\"\",VLOOKUP($B38,Data!$A$4:$T$727,7,FALSE))","v":""},"","","","",{"$f":"IF($I$15=\"Show\",VLOOKUP($B38,Data!$A$4:$T$727,9,FALSE),VLOOKUP($B38,Data!$A$4:$T$727,7,FALSE))","v":{"$error":"#N/A"}},{"$f":"IF($B38=\"\",\"\",VLOOKUP($B38,Data!$A$4:$T$727,6,FALSE))","v":""},"",{"$f":"IF($B38=\"\",\"\",IF(VLOOKUP($B38,Data!$A$4:$T$727,11,FALSE)<1,\"\",VLOOKUP(B38,Data!$A$4:$T$727,11,FALSE)))","v":""}]
[null,null,{"$f":"IF($B39=\"\",\"\",VLOOKUP($B39,Data!$A$4:$T$727,2,FALSE))","v":""},{"$f":"IF($B39=\"\",\"\",VLOOKUP($B39,Data!$A$4:$T$727,10,FALSE))","v":""},{"$f":"IF($B39=\"\",\"\",VLOOKUP($B39,Data!$A$4:$T$727,4,FALSE))","v":""},{"$f":"IF($B39=\"\",\"\",VLOOKUP($B39,Data!$A$4:$T$727,5,FALSE))","v":""},{"$f":"IF($B39=\"\",\"\",VLOOKUP($B39,Data!$A$4:$T$727,7,FALSE))","v":""},"","","","",{"$f":"IF($I$15=\"Show\",VLOOKUP($B39,Data!$A$4:$T$727,9,FALSE),VLOOKUP($B39,Data!$A$4:$T$727,7,FALSE))","v":{"$error":"#N/A"}},{"$f":"IF($B39=\"\",\"\",VLOOKUP($B39,Data!$A$4:$T$727,6,FALSE))","v":""},"",{"$f":"IF($B39=\"\",\"\",IF(VLOOKUP($B39,Data!$A$4:$T$727,11,FALSE)<1,\"\",VLOOKUP(B39,Data!$A$4:$T$727,11,FALSE)))","v":""}]
[null,null,{"$f":"IF($B40=\"\",\"\",VLOOKUP($B40,Data!$A$4:$T$727,2,FALSE))","v":""},{"$f":"IF($B40=\"\",\"\",VLOOKUP($B40,Data!$A$4:$T$727,10,FALSE))","v":""},{"$f":"IF($B40=\"\",\"\",VLOOKUP($B40,Data!$A$4:$T$727,4,FALSE))","v":""},{"$f":"IF($B40=\"\",\"\",VLOOKUP($B40,Data!$A$4:$T$727,5,FALSE))","v":""},{"$f":"IF($B40=\"\",\"\",VLOOKUP($B40,Data!$A$4:$T$727,7,FALSE))","v":""},"","","","",{"$f":"IF($I$15=\"Show\",VLOOKUP($B40,Data!$A$4:$T$727,9,FALSE),VLOOKUP($B40,Data!$A$4:$T$727,7,FALSE))","v":{"$error":"#N/A"}},{"$f":"IF($B40=\"\",\"\",VLOOKUP($B40,Data!$A$4:$T$727,6,FALSE))","v":""},"",{"$f":"IF($B40=\"\",\"\",IF(VLOOKUP($B40,Data!$A$4:$T$727,11,FALSE)<1,\"\",VLOOKUP(B40,Data!$A$4:$T$727,11,FALSE)))","v":""}]
[null,null,{"$f":"IF($B41=\"\",\"\",VLOOKUP($B41,Data!$A$4:$T$727,2,FALSE))","v":""},{"$f":"IF($B41=\"\",\"\",VLOOKUP($B41,Data!$A$4:$T$727,10,FALSE))","v":""},{"$f":"IF($B41=\"\",\"\",VLOOKUP($B41,Data!$A$4:$T$727,4,FALSE))","v":""},{"$f":"IF($B41=\"\",\"\",VLOOKUP($B41,Data!$A$4:$T$727,5,FALSE))","v":""},{"$f":"IF($B41=\"\",\"\",VLOOKUP($B41,Data!$A$4:$T$727,7,FALSE))","v":""},"","","","",{"$f":"IF($I$15=\"Show\",VLOOKUP($B41,Data!$A$4:$T$727,9,FALSE),VLOOKUP($B41,Data!$A$4:$T$727,7,FALSE))","v":{"$error":"#N/A"}},{"$f":"IF($B41=\"\",\"\",VLOOKUP($B41,Data!$A$4:$T$727,6,FALSE))","v":""},"",{"$f":"IF($B41=\"\",\"\",IF(VLOOKUP($B41,Data!$A$4:$T$727,11,FALSE)<1,\"\",VLOOKUP(B41,Data!$A$4:$T$727,11,FALSE)))","v":""}]
[null,null,{"$f":"IF($B42=\"\",\"\",VLOOKUP($B42,Data!$A$4:$T$727,2,FALSE))","v":""},{"$f":"IF($B42=\"\",\"\",VLOOKUP($B42,Data!$A$4:$T$727,10,FALSE))","v":""},{"$f":"IF($B42=\"\",\"\",VLOOKUP($B42,Data!$A$4:$T$727,4,FALSE))","v":""},{"$f":"IF($B42=\"\",\"\",VLOOKUP($B42,Data!$A$4:$T$727,5,FALSE))","v":""},{"$f":"IF($B42=\"\",\"\",VLOOKUP($B42,Data!$A$4:$T$727,7,FALSE))","v":""},"","","","",{"$f":"IF($I$15=\"Show\",VLOOKUP($B42,Data!$A$4:$T$727,9,FALSE),VLOOKUP($B42,Data!$A$4:$T$727,7,FALSE))","v":{"$error":"#N/A"}},{"$f":"IF($B42=\"\",\"\",VLOOKUP($B42,Data!$A$4:$T$727,6,FALSE))","v":""},"",{"$f":"IF($B42=\"\",\"\",IF(VLOOKUP($B42,Data!$A$4:$T$727,11,FALSE)<1,\"\",VLOOKUP(B42,Data!$A$4:$T$727,11,FALSE)))","v":""}]
[null,null,{"$f":"IF($B43=\"\",\"\",VLOOKUP($B43,Data!$A$4:$T$727,2,FALSE))","v":""},{"$f":"IF($B43=\"\",\"\",VLOOKUP($B43,Data!$A$4:$T$727,10,FALSE))","v":""},{"$f":"IF($B43=\"\",\"\",VLOOKUP($B43,Data!$A$4:$T$727,4,FALSE))","v":""},{"$f":"IF($B43=\"\",\"\",VLOOKUP($B43,Data!$A$4:$T$727,5,FALSE))","v":""},{"$f":"IF($B43=\"\",\"\",VLOOKUP($B43,Data!$A$4:$T$727,7,FALSE))","v":""},"","","","",{"$f":"IF($I$15=\"Show\",VLOOKUP($B43,Data!$A$4:$T$727,9,FALSE),VLOOKUP($B43,Data!$A$4:$T$727,7,FALSE))","v":{"$error":"#N/A"}},{"$f":"IF($B43=\"\",\"\",VLOOKUP($B43,Data!$A$4:$T$727,6,FALSE))","v":""},"",{"$f":"IF($B43=\"\",\"\",IF(VLOOKUP($B43,Data!$A$4:$T$727,11,FALSE)<1,\"\",VLOOKUP(B43,Data!$A$4:$T$727,11,FALSE)))","v":""}]
[null,null,{"$f":"IF($B44=\"\",\"\",VLOOKUP($B44,Data!$A$4:$T$727,2,FALSE))","v":""},{"$f":"IF($B44=\"\",\"\",VLOOKUP($B44,Data!$A$4:$T$727,10,FALSE))","v":""},{"$f":"IF($B44=\"\",\"\",VLOOKUP($B44,Data!$A$4:$T$727,4,FALSE))","v":""},{"$f":"IF($B44=\"\",\"\",VLOOKUP($B44,Data!$A$4:$T$727,5,FALSE))","v":""},{"$f":"IF($B44=\"\",\"\",VLOOKUP($B44,Data!$A$4:$T$727,7,FALSE))","v":""},"","","","",{"$f":"IF($I$15=\"Show\",VLOOKUP($B44,Data!$A$4:$T$727,9,FALSE),VLOOKUP($B44,Data!$A$4:$T$727,7,FALSE))","v":{"$error":"#N/A"}},{"$f":"IF($B44=\"\",\"\",VLOOKUP($B44,Data!$A$4:$T$727,6,FALSE))","v":""},"",{"$f":"IF($B44=\"\",\"\",IF(VLOOKUP($B44,Data!$A$4:$T$727,11,FALSE)<1,\"\",VLOOKUP(B44,Data!$A$4:$T$727,11,FALSE)))","v":""}]
[null,null,{"$f":"IF($B45=\"\",\"\",VLOOKUP($B45,Data!$A$4:$T$727,2,FALSE))","v":""},{"$f":"IF($B45=\"\",\"\",VLOOKUP($B45,Data!$A$4:$T$727,10,FALSE))","v":""},{"$f":"IF($B45=\"\",\"\",VLOOKUP($B45,Data!$A$4:$T$727,4,FALSE))","v":""},{"$f":"IF($B45=\"\",\"\",VLOOKUP($B45,Data!$A$4:$T$727,5,FALSE))","v":""},{"$f":"IF($B45=\"\",\"\",VLOOKUP($B45,Data!$A$4:$T$727,7,FALSE))","v":""},"","","","",{"$f":"IF($I$15=\"Show\",VLOOKUP($B45,Data!$A$4:$T$727,9,FALSE),VLOOKUP($B45,Data!$A$4:$T$727,7,FALSE))","v":{"$error":"#N/A"}},{"$f":"IF($B45=\"\",\"\",VLOOKUP($B45,Data!$A$4:$T$727,6,FALSE))","v":""},"",{"$f":"IF($B45=\"\",\"\",IF(VLOOKUP($B45,Data!$A$4:$T$727,11,FALSE)<1,\"\",VLOOKUP(B45,Data!$A$4:$T$727,11,FALSE)))","v":""}]
[null,null,{"$f":"IF($B46=\"\",\"\",VLOOKUP($B46,Data!$A$4:$T$727,2,FALSE))","v":""},{"$f":"IF($B46=\"\",\"\",VLOOKUP($B46,Data!$A$4:$T$727,10,FALSE))","v":""},{"$f":"IF($B46=\"\",\"\",VLOOKUP($B46,Data!$A$4:$T$727,4,FALSE))","v":""},{"$f":"IF($B46=\"\",\"\",VLOOKUP($B46,Data!$A$4:$T$727,5,FALSE))","v":""},{"$f":"IF($B46=\"\",\"\",VLOOKUP($B46,Data!$A$4:$T$727,7,FALSE))","v":""},"","","","",{"$f":"IF($I$15=\"Show\",VLOOKUP($B46,Data!$A$4:$T$727,9,FALSE),VLOOKUP($B46,Data!$A$4:$T$727,7,FALSE))","v":{"$error":"#N/A"}},{"$f":"IF($B46=\"\",\"\",VLOOKUP($B46,Data!$A$4:$T$727,6,FALSE))","v":""},"",{"$f":"IF($B46=\"\",\"\",IF(VLOOKUP($B46,Data!$A$4:$T$727,11,FALSE)<1,\"\",VLOOKUP(B46,Data!$A$4:$T$727,11,FALSE)))","v":""}]
[null,null,{"$f":"IF($B47=\"\",\"\",VLOOKUP($B47,Data!$A$4:$T$727,2,FALSE))","v":""},{"$f":"IF($B47=\"\",\"\",VLOOKUP($B47,Data!$A$4:$T$727,10,FALSE))","v":""},{"$f":"IF($B47=\"\",\"\",VLOOKUP($B47,Data!$A$4:$T$727,4,FALSE))","v":""},{"$f":"IF($B47=\"\",\"\",VLOOKUP($B47,Data!$A$4:$T$727,5,FALSE))","v":""},{"$f":"IF($B47=\"\",\"\",VLOOKUP($B47,Data!$A$4:$T$727,7,FALSE))","v":""},"","","","",{"$f":"IF($I$15=\"Show\",VLOOKUP($B47,Data!$A$4:$T$727,9,FALSE),VLOOKUP($B47,Data!$A$4:$T$727,7,FALSE))","v":{"$error":"#N/A"}},{"$f":"IF($B47=\"\",\"\",VLOOKUP($B47,Data!$A$4:$T$727,6,FALSE))","v":""},"",{"$f":"IF($B47=\"\",\"\",IF(VLOOKUP($B47,Data!$A$4:$T$727,11,FALSE)<1,\"\",VLOOKUP(B47,Data!$A$4:$T$727,11,FALSE)))","v":""}]
[null,null,{"$f":"IF($B48=\"\",\"\",VLOOKUP($B48,Data!$A$4:$T$727,2,FALSE))","v":""},{"$f":"IF($B48=\"\",\"\",VLOOKUP($B48,Data!$A$4:$T$727,10,FALSE))","v":""},{"$f":"IF($B48=\"\",\"\",VLOOKUP($B48,Data!$A$4:$T$727,4,FALSE))","v":""},{"$f":"IF($B48=\"\",\"\",VLOOKUP($B48,Data!$A$4:$T$727,5,FALSE))","v":""},{"$f":"IF($B48=\"\",\"\",VLOOKUP($B48,Data!$A$4:$T$727,7,FALSE))","v":""},"","","","",{"$f":"IF($I$15=\"Show\",VLOOKUP($B48,Data!$A$4:$T$727,9,FALSE),VLOOKUP($B48,Data!$A$4:$T$727,7,FALSE))","v":{"$error":"#N/A"}},{"$f":"IF($B48=\"\",\"\",VLOOKUP($B48,Data!$A$4:$T$727,6,FALSE))","v":""},"",{"$f":"IF($B48=\"\",\"\",IF(VLOOKUP($B48,Data!$A$4:$T$727,11,FALSE)<1,\"\",VLOOKUP(B48,Data!$A$4:$T$727,11,FALSE)))","v":""}]
[null,null,{"$f":"IF($B49=\"\",\"\",VLOOKUP($B49,Data!$A$4:$T$727,2,FALSE))","v":""},{"$f":"IF($B49=\"\",\"\",VLOOKUP($B49,Data!$A$4:$T$727,10,FALSE))","v":""},{"$f":"IF($B49=\"\",\"\",VLOOKUP($B49,Data!$A$4:$T$727,4,FALSE))","v":""},{"$f":"IF($B49=\"\",\"\",VLOOKUP($B49,Data!$A$4:$T$727,5,FALSE))","v":""},{"$f":"IF($B49=\"\",\"\",VLOOKUP($B49,Data!$A$4:$T$727,7,FALSE))","v":""},"","","","",{"$f":"IF($I$15=\"Show\",VLOOKUP($B49,Data!$A$4:$T$727,9,FALSE),VLOOKUP($B49,Data!$A$4:$T$727,7,FALSE))","v":{"$error":"#N/A"}},{"$f":"IF($B49=\"\",\"\",VLOOKUP($B49,Data!$A$4:$T$727,6,FALSE))","v":""},"",{"$f":"IF($B49=\"\",\"\",IF(VLOOKUP($B49,Data!$A$4:$T$727,11,FALSE)<1,\"\",VLOOKUP(B49,Data!$A$4:$T$727,11,FALSE)))","v":""}]
[null,null,{"$f":"IF($B50=\"\",\"\",VLOOKUP($B50,Data!$A$4:$T$727,2,FALSE))","v":""},{"$f":"IF($B50=\"\",\"\",VLOOKUP($B50,Data!$A$4:$T$727,10,FALSE))","v":""},{"$f":"IF($B50=\"\",\"\",VLOOKUP($B50,Data!$A$4:$T$727,4,FALSE))","v":""},{"$f":"IF($B50=\"\",\"\",VLOOKUP($B50,Data!$A$4:$T$727,5,FALSE))","v":""},{"$f":"IF($B50=\"\",\"\",VLOOKUP($B50,Data!$A$4:$T$727,7,FALSE))","v":""},"","","","",{"$f":"IF($I$15=\"Show\",VLOOKUP($B50,Data!$A$4:$T$727,9,FALSE),VLOOKUP($B50,Data!$A$4:$T$727,7,FALSE))","v":{"$error":"#N/A"}},{"$f":"IF($B50=\"\",\"\",VLOOKUP($B50,Data!$A$4:$T$727,6,FALSE))","v":""},"",{"$f":"IF($B50=\"\",\"\",IF(VLOOKUP($B50,Data!$A$4:$T$727,11,FALSE)<1,\"\",VLOOKUP(B50,Data!$A$4:$T$727,11,FALSE)))","v":""}]
[null,null,{"$f":"IF($B51=\"\",\"\",VLOOKUP($B51,Data!$A$4:$T$727,2,FALSE))","v":""},{"$f":"IF($B51=\"\",\"\",VLOOKUP($B51,Data!$A$4:$T$727,10,FALSE))","v":""},{"$f":"IF($B51=\"\",\"\",VLOOKUP($B51,Data!$A$4:$T$727,4,FALSE))","v":""},{"$f":"IF($B51=\"\",\"\",VLOOKUP($B51,Data!$A$4:$T$727,5,FALSE))","v":""},{"$f":"IF($B51=\"\",\"\",VLOOKUP($B51,Data!$A$4:$T$727,7,FALSE))","v":""},"","","","",{"$f":"IF($I$15=\"Show\",VLOOKUP($B51,Data!$A$4:$T$727,9,FALSE),VLOOKUP($B51,Data!$A$4:$T$727,7,FALSE))","v":{"$error":"#N/A"}},{"$f":"IF($B51=\"\",\"\",VLOOKUP($B51,Data!$A$4:$T$727,6,FALSE))","v":""},"",{"$f":"IF($B51=\"\",\"\",IF(VLOOKUP($B51,Data!$A$4:$T$727,11,FALSE)<1,\"\",VLOOKUP(B51,Data!$A$4:$T$727,11,FALSE)))","v":""}]
[null,null,{"$f":"IF($B52=\"\",\"\",VLOOKUP($B52,Data!$A$4:$T$727,2,FALSE))","v":""},{"$f":"IF($B52=\"\",\"\",VLOOKUP($B52,Data!$A$4:$T$727,10,FALSE))","v":""},{"$f":"IF($B52=\"\",\"\",VLOOKUP($B52,Data!$A$4:$T$727,4,FALSE))","v":""},{"$f":"IF($B52=\"\",\"\",VLOOKUP($B52,Data!$A$4:$T$727,5,FALSE))","v":""},{"$f":"IF($B52=\"\",\"\",VLOOKUP($B52,Data!$A$4:$T$727,7,FALSE))","v":""},"","","","",{"$f":"IF($I$15=\"Show\",VLOOKUP($B52,Data!$A$4:$T$727,9,FALSE),VLOOKUP($B52,Data!$A$4:$T$727,7,FALSE))","v":{"$error":"#N/A"}},{"$f":"IF($B52=\"\",\"\",VLOOKUP($B52,Data!$A$4:$T$727,6,FALSE))","v":""},"",{"$f":"IF($B52=\"\",\"\",IF(VLOOKUP($B52,Data!$A$4:$T$727,11,FALSE)<1,\"\",VLOOKUP(B52,Data!$A$4:$T$727,11,FALSE)))","v":""}]
[null,null,{"$f":"IF($B53=\"\",\"\",VLOOKUP($B53,Data!$A$4:$T$727,2,FALSE))","v":""},{"$f":"IF($B53=\"\",\"\",VLOOKUP($B53,Data!$A$4:$T$727,10,FALSE))","v":""},{"$f":"IF($B53=\"\",\"\",VLOOKUP($B53,Data!$A$4:$T$727,4,FALSE))","v":""},{"$f":"IF($B53=\"\",\"\",VLOOKUP($B53,Data!$A$4:$T$727,5,FALSE))","v":""},{"$f":"IF($B53=\"\",\"\",VLOOKUP($B53,Data!$A$4:$T$727,7,FALSE))","v":""},"","","","",{"$f":"IF($I$15=\"Show\",VLOOKUP($B53,Data!$A$4:$T$727,9,FALSE),VLOOKUP($B53,Data!$A$4:$T$727,7,FALSE))","v":{"$error":"#N/A"}},{"$f":"IF($B53=\"\",\"\",VLOOKUP($B53,Data!$A$4:$T$727,6,FALSE))","v":""},"",{"$f":"IF($B53=\"\",\"\",IF(VLOOKUP($B53,Data!$A$4:$T$727,11,FALSE)<1,\"\",VLOOKUP(B53,Data!$A$4:$T$727,11,FALSE)))","v":""}]
[null,null,{"$f":"IF($B54=\"\",\"\",VLOOKUP($B54,Data!$A$4:$T$727,2,FALSE))","v":""},{"$f":"IF($B54=\"\",\"\",VLOOKUP($B54,Data!$A$4:$T$727,10,FALSE))","v":""},{"$f":"IF($B54=\"\",\"\",VLOOKUP($B54,Data!$A$4:$T$727,4,FALSE))","v":""},{"$f":"IF($B54=\"\",\"\",VLOOKUP($B54,Data!$A$4:$T$727,5,FALSE))","v":""},{"$f":"IF($B54=\"\",\"\",VLOOKUP($B54,Data!$A$4:$T$727,7,FALSE))","v":""},"","","","",{"$f":"IF($I$15=\"Show\",VLOOKUP($B54,Data!$A$4:$T$727,9,FALSE),VLOOKUP($B54,Data!$A$4:$T$727,7,FALSE))","v":{"$error":"#N/A"}},{"$f":"IF($B54=\"\",\"\",VLOOKUP($B54,Data!$A$4:$T$727,6,FALSE))","v":""},"",{"$f":"IF($B54=\"\",\"\",IF(VLOOKUP($B54,Data!$A$4:$T$727,11,FALSE)<1,\"\",VLOOKUP(B54,Data!$A$4:$T$727,11,FALSE)))","v":""}]
[null,null,{"$f":"IF($B55=\"\",\"\",VLOOKUP($B55,Data!$A$4:$T$727,2,FALSE))","v":""},{"$f":"IF($B55=\"\",\"\",VLOOKUP($B55,Data!$A$4:$T$727,10,FALSE))","v":""},{"$f":"IF($B55=\"\",\"\",VLOOKUP($B55,Data!$A$4:$T$727,4,FALSE))","v":""},{"$f":"IF($B55=\"\",\"\",VLOOKUP($B55,Data!$A$4:$T$727,5,FALSE))","v":""},{"$f":"IF($B55=\"\",\"\",VLOOKUP($B55,Data!$A$4:$T$727,7,FALSE))","v":""},"","","","",{"$f":"IF($I$15=\"Show\",VLOOKUP($B55,Data!$A$4:$T$727,9,FALSE),VLOOKUP($B55,Data!$A$4:$T$727,7,FALSE))","v":{"$error":"#N/A"}},{"$f":"IF($B55=\"\",\"\",VLOOKUP($B55,Data!$A$4:$T$727,6,FALSE))","v":""},"",{"$f":"IF($B55=\"\",\"\",IF(VLOOKUP($B55,Data!$A$4:$T$727,11,FALSE)<1,\"\",VLOOKUP(B55,Data!$A$4:$T$727,11,FALSE)))","v":""}]
[null,null,{"$f":"IF($B56=\"\",\"\",VLOOKUP($B56,Data!$A$4:$T$727,2,FALSE))","v":""},{"$f":"IF($B56=\"\",\"\",VLOOKUP($B56,Data!$A$4:$T$727,10,FALSE))","v":""},{"$f":"IF($B56=\"\",\"\",VLOOKUP($B56,Data!$A$4:$T$727,4,FALSE))","v":""},{"$f":"IF($B56=\"\",\"\",VLOOKUP($B56,Data!$A$4:$T$727,5,FALSE))","v":""},{"$f":"IF($B56=\"\",\"\",VLOOKUP($B56,Data!$A$4:$T$727,7,FALSE))","v":""},"","","","",{"$f":"IF($I$15=\"Show\",VLOOKUP($B56,Data!$A$4:$T$727,9,FALSE),VLOOKUP($B56,Data!$A$4:$T$727,7,FALSE))","v":{"$error":"#N/A"}},{"$f":"IF($B56=\"\",\"\",VLOOKUP($B56,Data!$A$4:$T$727,6,FALSE))","v":""},"",{"$f":"IF($B56=\"\",\"\",IF(VLOOKUP($B56,Data!$A$4:$T$727,11,FALSE)<1,\"\",VLOOKUP(B56,Data!$A$4:$T$727,11,FALSE)))","v":""}]
[null,null,{"$f":"IF($B57=\"\",\"\",VLOOKUP($B57,Data!$A$4:$T$727,2,FALSE))","v":""},{"$f":"IF($B57=\"\",\"\",VLOOKUP($B57,Data!$A$4:$T$727,10,FALSE))","v":""},{"$f":"IF($B57=\"\",\"\",VLOOKUP($B57,Data!$A$4:$T$727,4,FALSE))","v":""},{"$f":"IF($B57=\"\",\"\",VLOOKUP($B57,Data!$A$4:$T$727,5,FALSE))","v":""},{"$f":"IF($B57=\"\",\"\",VLOOKUP($B57,Data!$A$4:$T$727,7,FALSE))","v":""},"","","","",{"$f":"IF($I$15=\"Show\",VLOOKUP($B57,Data!$A$4:$T$727,9,FALSE),VLOOKUP($B57,Data!$A$4:$T$727,7,FALSE))","v":{"$error":"#N/A"}},{"$f":"IF($B57=\"\",\"\",VLOOKUP($B57,Data!$A$4:$T$727,6,FALSE))","v":""},"",{"$f":"IF($B57=\"\",\"\",IF(VLOOKUP($B57,Data!$A$4:$T$727,11,FALSE)<1,\"\",VLOOKUP(B57,Data!$A$4:$T$727,11,FALSE)))","v":""}]
[null,null,{"$f":"IF($B58=\"\",\"\",VLOOKUP($B58,Data!$A$4:$T$727,2,FALSE))","v":""},{"$f":"IF($B58=\"\",\"\",VLOOKUP($B58,Data!$A$4:$T$727,10,FALSE))","v":""},{"$f":"IF($B58=\"\",\"\",VLOOKUP($B58,Data!$A$4:$T$727,4,FALSE))","v":""},{"$f":"IF($B58=\"\",\"\",VLOOKUP($B58,Data!$A$4:$T$727,5,FALSE))","v":""},{"$f":"IF($B58=\"\",\"\",VLOOKUP($B58,Data!$A$4:$T$727,7,FALSE))","v":""},"","","","",{"$f":"IF($I$15=\"Show\",VLOOKUP($B58,Data!$A$4:$T$727,9,FALSE),VLOOKUP($B58,Data!$A$4:$T$727,7,FALSE))","v":{"$error":"#N/A"}},{"$f":"IF($B58=\"\",\"\",VLOOKUP($B58,Data!$A$4:$T$727,6,FALSE))","v":""},"",{"$f":"IF($B58=\"\",\"\",IF(VLOOKUP($B58,Data!$A$4:$T$727,11,FALSE)<1,\"\",VLOOKUP(B58,Data!$A$4:$T$727,11,FALSE)))","v":""}]
[null,null,{"$f":"IF($B59=\"\",\"\",VLOOKUP($B59,Data!$A$4:$T$727,2,FALSE))","v":""},{"$f":"IF($B59=\"\",\"\",VLOOKUP($B59,Data!$A$4:$T$727,10,FALSE))","v":""},{"$f":"IF($B59=\"\",\"\",VLOOKUP($B59,Data!$A$4:$T$727,4,FALSE))","v":""},{"$f":"IF($B59=\"\",\"\",VLOOKUP($B59,Data!$A$4:$T$727,5,FALSE))","v":""},{"$f":"IF($B59=\"\",\"\",VLOOKUP($B59,Data!$A$4:$T$727,7,FALSE))","v":""},"","","","",{"$f":"IF($I$15=\"Show\",VLOOKUP($B59,Data!$A$4:$T$727,9,FALSE),VLOOKUP($B59,Data!$A$4:$T$727,7,FALSE))","v":{"$error":"#N/A"}},{"$f":"IF($B59=\"\",\"\",VLOOKUP($B59,Data!$A$4:$T$727,6,FALSE))","v":""},"",{"$f":"IF($B59=\"\",\"\",IF(VLOOKUP($B59,Data!$A$4:$T$727,11,FALSE)<1,\"\",VLOOKUP(B59,Data!$A$4:$T$727,11,FALSE)))","v":""}]
[null,null,{"$f":"IF($B60=\"\",\"\",VLOOKUP($B60,Data!$A$4:$T$727,2,FALSE))","v":""},{"$f":"IF($B60=\"\",\"\",VLOOKUP($B60,Data!$A$4:$T$727,10,FALSE))","v":""},{"$f":"IF($B60=\"\",\"\",VLOOKUP($B60,Data!$A$4:$T$727,4,FALSE))","v":""},{"$f":"IF($B60=\"\",\"\",VLOOKUP($B60,Data!$A$4:$T$727,5,FALSE))","v":""},{"$f":"IF($B60=\"\",\"\",VLOOKUP($B60,Data!$A$4:$T$727,7,FALSE))","v":""},"","","","",{"$f":"IF($I$15=\"Show\",VLOOKUP($B60,Data!$A$4:$T$727,9,FALSE),VLOOKUP($B60,Data!$A$4:$T$727,7,FALSE))","v":{"$error":"#N/A"}},{"$f":"IF($B60=\"\",\"\",VLOOKUP($B60,Data!$A$4:$T$727,6,FALSE))","v":""},"",{"$f":"IF($B60=\"\",\"\",IF(VLOOKUP($B60,Data!$A$4:$T$727,11,FALSE)<1,\"\",VLOOKUP(B60,Data!$A$4:$T$727,11,FALSE)))","v":""}]
[null,null,{"$f":"IF($B61=\"\",\"\",VLOOKUP($B61,Data!$A$4:$T$727,2,FALSE))","v":""},{"$f":"IF($B61=\"\",\"\",VLOOKUP($B61,Data!$A$4:$T$727,10,FALSE))","v":""},{"$f":"IF($B61=\"\",\"\",VLOOKUP($B61,Data!$A$4:$T$727,4,FALSE))","v":""},{"$f":"IF($B61=\"\",\"\",VLOOKUP($B61,Data!$A$4:$T$727,5,FALSE))","v":""},{"$f":"IF($B61=\"\",\"\",VLOOKUP($B61,Data!$A$4:$T$727,7,FALSE))","v":""},"","","","",{"$f":"IF($I$15=\"Show\",VLOOKUP($B61,Data!$A$4:$T$727,9,FALSE),VLOOKUP($B61,Data!$A$4:$T$727,7,FALSE))","v":{"$error":"#N/A"}},{"$f":"IF($B61=\"\",\"\",VLOOKUP($B61,Data!$A$4:$T$727,6,FALSE))","v":""},"",{"$f":"IF($B61=\"\",\"\",IF(VLOOKUP($B61,Data!$A$4:$T$727,11,FALSE)<1,\"\",VLOOKUP(B61,Data!$A$4:$T$727,11,FALSE)))","v":""}]
[null,null,{"$f":"IF($B62=\"\",\"\",VLOOKUP($B62,Data!$A$4:$T$727,2,FALSE))","v":""},{"$f":"IF($B62=\"\",\"\",VLOOKUP($B62,Data!$A$4:$T$727,10,FALSE))","v":""},{"$f":"IF($B62=\"\",\"\",VLOOKUP($B62,Data!$A$4:$T$727,4,FALSE))","v":""},{"$f":"IF($B62=\"\",\"\",VLOOKUP($B62,Data!$A$4:$T$727,5,FALSE))","v":""},{"$f":"IF($B62=\"\",\"\",VLOOKUP($B62,Data!$A$4:$T$727,7,FALSE))","v":""},"","","","",{"$f":"IF($I$15=\"Show\",VLOOKUP($B62,Data!$A$4:$T$727,9,FALSE),VLOOKUP($B62,Data!$A$4:$T$727,7,FALSE))","v":{"$error":"#N/A"}},{"$f":"IF($B62=\"\",\"\",VLOOKUP($B62,Data!$A$4:$T$727,6,FALSE))","v":""},"",{"$f":"IF($B62=\"\",\"\",IF(VLOOKUP($B62,Data!$A$4:$T$727,11,FALSE)<1,\"\",VLOOKUP(B62,Data!$A$4:$T$727,11,FALSE)))","v":""}]
[null,null,{"$f":"IF($B63=\"\",\"\",VLOOKUP($B63,Data!$A$4:$T$727,2,FALSE))","v":""},{"$f":"IF($B63=\"\",\"\",VLOOKUP($B63,Data!$A$4:$T$727,10,FALSE))","v":""},{"$f":"IF($B63=\"\",\"\",VLOOKUP($B63,Data!$A$4:$T$727,4,FALSE))","v":""},{"$f":"IF($B63=\"\",\"\",VLOOKUP($B63,Data!$A$4:$T$727,5,FALSE))","v":""},{"$f":"IF($B63=\"\",\"\",VLOOKUP($B63,Data!$A$4:$T$727,7,FALSE))","v":""},"","","","",{"$f":"IF($I$15=\"Show\",VLOOKUP($B63,Data!$A$4:$T$727,9,FALSE),VLOOKUP($B63,Data!$A$4:$T$727,7,FALSE))","v":{"$error":"#N/A"}},{"$f":"IF($B63=\"\",\"\",VLOOKUP($B63,Data!$A$4:$T$727,6,FALSE))","v":""},"",{"$f":"IF($B63=\"\",\"\",IF(VLOOKUP($B63,Data!$A$4:$T$727,11,FALSE)<1,\"\",VLOOKUP(B63,Data!$A$4:$T$727,11,FALSE)))","v":""}]
[null,null,{"$f":"IF($B64=\"\",\"\",VLOOKUP($B64,Data!$A$4:$T$727,2,FALSE))","v":""},{"$f":"IF($B64=\"\",\"\",VLOOKUP($B64,Data!$A$4:$T$727,10,FALSE))","v":""},{"$f":"IF($B64=\"\",\"\",VLOOKUP($B64,Data!$A$4:$T$727,4,FALSE))","v":""},{"$f":"IF($B64=\"\",\"\",VLOOKUP($B64,Data!$A$4:$T$727,5,FALSE))","v":""},{"$f":"IF($B64=\"\",\"\",VLOOKUP($B64,Data!$A$4:$T$727,7,FALSE))","v":""},"","","","",{"$f":"IF($I$15=\"Show\",VLOOKUP($B64,Data!$A$4:$T$727,9,FALSE),VLOOKUP($B64,Data!$A$4:$T$727,7,FALSE))","v":{"$error":"#N/A"}},{"$f":"IF($B64=\"\",\"\",VLOOKUP($B64,Data!$A$4:$T$727,6,FALSE))","v":""},"",{"$f":"IF($B64=\"\",\"\",IF(VLOOKUP($B64,Data!$A$4:$T$727,11,FALSE)<1,\"\",VLOOKUP(B64,Data!$A$4:$T$727,11,FALSE)))","v":""}]
[null,null,{"$f":"IF($B65=\"\",\"\",VLOOKUP($B65,Data!$A$4:$T$727,2,FALSE))","v":""},{"$f":"IF($B65=\"\",\"\",VLOOKUP($B65,Data!$A$4:$T$727,10,FALSE))","v":""},{"$f":"IF($B65=\"\",\"\",VLOOKUP($B65,Data!$A$4:$T$727,4,FALSE))","v":""},{"$f":"IF($B65=\"\",\"\",VLOOKUP($B65,Data!$A$4:$T$727,5,FALSE))","v":""},{"$f":"IF($B65=\"\",\"\",VLOOKUP($B65,Data!$A$4:$T$727,7,FALSE))","v":""},"","","","",{"$f":"IF($I$15=\"Show\",VLOOKUP($B65,Data!$A$4:$T$727,9,FALSE),VLOOKUP($B65,Data!$A$4:$T$727,7,FALSE))","v":{"$error":"#N/A"}},{"$f":"IF($B65=\"\",\"\",VLOOKUP($B65,Data!$A$4:$T$727,6,FALSE))","v":""},"",{"$f":"IF($B65=\"\",\"\",IF(VLOOKUP($B65,Data!$A$4:$T$727,11,FALSE)<1,\"\",VLOOKUP(B65,Data!$A$4:$T$727,11,FALSE)))","v":""}]
[null,null,{"$f":"IF($B66=\"\",\"\",VLOOKUP($B66,Data!$A$4:$T$727,2,FALSE))","v":""},{"$f":"IF($B66=\"\",\"\",VLOOKUP($B66,Data!$A$4:$T$727,10,FALSE))","v":""},{"$f":"IF($B66=\"\",\"\",VLOOKUP($B66,Data!$A$4:$T$727,4,FALSE))","v":""},{"$f":"IF($B66=\"\",\"\",VLOOKUP($B66,Data!$A$4:$T$727,5,FALSE))","v":""},{"$f":"IF($B66=\"\",\"\",VLOOKUP($B66,Data!$A$4:$T$727,7,FALSE))","v":""},"","","","",{"$f":"IF($I$15=\"Show\",VLOOKUP($B66,Data!$A$4:$T$727,9,FALSE),VLOOKUP($B66,Data!$A$4:$T$727,7,FALSE))","v":{"$error":"#N/A"}},{"$f":"IF($B66=\"\",\"\",VLOOKUP($B66,Data!$A$4:$T$727,6,FALSE))","v":""},"",{"$f":"IF($B66=\"\",\"\",IF(VLOOKUP($B66,Data!$A$4:$T$727,11,FALSE)<1,\"\",VLOOKUP(B66,Data!$A$4:$T$727,11,FALSE)))","v":""}]
[null,null,{"$f":"IF($B67=\"\",\"\",VLOOKUP($B67,Data!$A$4:$T$727,2,FALSE))","v":""},{"$f":"IF($B67=\"\",\"\",VLOOKUP($B67,Data!$A$4:$T$727,10,FALSE))","v":""},{"$f":"IF($B67=\"\",\"\",VLOOKUP($B67,Data!$A$4:$T$727,4,FALSE))","v":""},{"$f":"IF($B67=\"\",\"\",VLOOKUP($B67,Data!$A$4:$T$727,5,FALSE))","v":""},{"$f":"IF($B67=\"\",\"\",VLOOKUP($B67,Data!$A$4:$T$727,7,FALSE))","v":""},"","","","",{"$f":"IF($I$15=\"Show\",VLOOKUP($B67,Data!$A$4:$T$727,9,FALSE),VLOOKUP($B67,Data!$A$4:$T$727,7,FALSE))","v":{"$error":"#N/A"}},{"$f":"IF($B67=\"\",\"\",VLOOKUP($B67,Data!$A$4:$T$727,6,FALSE))","v":""},"",{"$f":"IF($B67=\"\",\"\",IF(VLOOKUP($B67,Data!$A$4:$T$727,11,FALSE)<1,\"\",VLOOKUP(B67,Data!$A$4:$T$727,11,FALSE)))","v":""}]
[null,null,{"$f":"IF($B68=\"\",\"\",VLOOKUP($B68,Data!$A$4:$T$727,2,FALSE))","v":""},{"$f":"IF($B68=\"\",\"\",VLOOKUP($B68,Data!$A$4:$T$727,10,FALSE))","v":""},{"$f":"IF($B68=\"\",\"\",VLOOKUP($B68,Data!$A$4:$T$727,4,FALSE))","v":""},{"$f":"IF($B68=\"\",\"\",VLOOKUP($B68,Data!$A$4:$T$727,5,FALSE))","v":""},{"$f":"IF($B68=\"\",\"\",VLOOKUP($B68,Data!$A$4:$T$727,7,FALSE))","v":""},"","","","",{"$f":"IF($I$15=\"Show\",VLOOKUP($B68,Data!$A$4:$T$727,9,FALSE),VLOOKUP($B68,Data!$A$4:$T$727,7,FALSE))","v":{"$error":"#N/A"}},{"$f":"IF($B68=\"\",\"\",VLOOKUP($B68,Data!$A$4:$T$727,6,FALSE))","v":""},"",{"$f":"IF($B68=\"\",\"\",IF(VLOOKUP($B68,Data!$A$4:$T$727,11,FALSE)<1,\"\",VLOOKUP(B68,Data!$A$4:$T$727,11,FALSE)))","v":""}]
[null,null,{"$f":"IF($B69=\"\",\"\",VLOOKUP($B69,Data!$A$4:$T$727,2,FALSE))","v":""},{"$f":"IF($B69=\"\",\"\",VLOOKUP($B69,Data!$A$4:$T$727,10,FALSE))","v":""},{"$f":"IF($B69=\"\",\"\",VLOOKUP($B69,Data!$A$4:$T$727,4,FALSE))","v":""},{"$f":"IF($B69=\"\",\"\",VLOOKUP($B69,Data!$A$4:$T$727,5,FALSE))","v":""},{"$f":"IF($B69=\"\",\"\",VLOOKUP($B69,Data!$A$4:$T$727,7,FALSE))","v":""},"","","","",{"$f":"IF($I$15=\"Show\",VLOOKUP($B69,Data!$A$4:$T$727,9,FALSE),VLOOKUP($B69,Data!$A$4:$T$727,7,FALSE))","v":{"$error":"#N/A"}},{"$f":"IF($B69=\"\",\"\",VLOOKUP($B69,Data!$A$4:$T$727,6,FALSE))","v":""},"",{"$f":"IF($B69=\"\",\"\",IF(VLOOKUP($B69,Data!$A$4:$T$727,11,FALSE)<1,\"\",VLOOKUP(B69,Data!$A$4:$T$727,11,FALSE)))","v":""}]
[null,null,{"$f":"IF($B70=\"\",\"\",VLOOKUP($B70,Data!$A$4:$T$727,2,FALSE))","v":""},{"$f":"IF($B70=\"\",\"\",VLOOKUP($B70,Data!$A$4:$T$727,10,FALSE))","v":""},{"$f":"IF($B70=\"\",\"\",VLOOKUP($B70,Data!$A$4:$T$727,4,FALSE))","v":""},{"$f":"IF($B70=\"\",\"\",VLOOKUP($B70,Data!$A$4:$T$727,5,FALSE))","v":""},{"$f":"IF($B70=\"\",\"\",VLOOKUP($B70,Data!$A$4:$T$727,7,FALSE))","v":""},"","","","",{"$f":"IF($I$15=\"Show\",VLOOKUP($B70,Data!$A$4:$T$727,9,FALSE),VLOOKUP($B70,Data!$A$4:$T$727,7,FALSE))","v":{"$error":"#N/A"}},{"$f":"IF($B70=\"\",\"\",VLOOKUP($B70,Data!$A$4:$T$727,6,FALSE))","v":""},"",{"$f":"IF($B70=\"\",\"\",IF(VLOOKUP($B70,Data!$A$4:$T$727,11,FALSE)<1,\"\",VLOOKUP(B70,Data!$A$4:$T$727,11,FALSE)))","v":""}]
[null,null,{"$f":"IF($B71=\"\",\"\",VLOOKUP($B71,Data!$A$4:$T$727,2,FALSE))","v":""},{"$f":"IF($B71=\"\",\"\",VLOOKUP($B71,Data!$A$4:$T$727,10,FALSE))","v":""},{"$f":"IF($B71=\"\",\"\",VLOOKUP($B71,Data!$A$4:$T$727,4,FALSE))","v":""},{"$f":"IF($B71=\"\",\"\",VLOOKUP($B71,Data!$A$4:$T$727,5,FALSE))","v":""},{"$f":"IF($B71=\"\",\"\",VLOOKUP($B71,Data!$A$4:$T$727,7,FALSE))","v":""},"","","","",{"$f":"IF($I$15=\"Show\",VLOOKUP($B71,Data!$A$4:$T$727,9,FALSE),VLOOKUP($B71,Data!$A$4:$T$727,7,FALSE))","v":{"$error":"#N/A"}},{"$f":"IF($B71=\"\",\"\",VLOOKUP($B71,Data!$A$4:$T$727,6,FALSE))","v":""},"",{"$f":"IF($B71=\"\",\"\",IF(VLOOKUP($B71,Data!$A$4:$T$727,11,FALSE)<1,\"\",VLOOKUP(B71,Data!$A$4:$T$727,11,FALSE)))","v":""}]
[null,null,{"$f":"IF($B72=\"\",\"\",VLOOKUP($B72,Data!$A$4:$T$727,2,FALSE))","v":""},{"$f":"IF($B72=\"\",\"\",VLOOKUP($B72,Data!$A$4:$T$727,10,FALSE))","v":""},{"$f":"IF($B72=\"\",\"\",VLOOKUP($B72,Data!$A$4:$T$727,4,FALSE))","v":""},{"$f":"IF($B72=\"\",\"\",VLOOKUP($B72,Data!$A$4:$T$727,5,FALSE))","v":""},{"$f":"IF($B72=\"\",\"\",VLOOKUP($B72,Data!$A$4:$T$727,7,FALSE))","v":""},"","","","",{"$f":"IF($I$15=\"Show\",VLOOKUP($B72,Data!$A$4:$T$727,9,FALSE),VLOOKUP($B72,Data!$A$4:$T$727,7,FALSE))","v":{"$error":"#N/A"}},{"$f":"IF($B72=\"\",\"\",VLOOKUP($B72,Data!$A$4:$T$727,6,FALSE))","v":""},"",{"$f":"IF($B72=\"\",\"\",IF(VLOOKUP($B72,Data!$A$4:$T$727,11,FALSE)<1,\"\",VLOOKUP(B72,Data!$A$4:$T$727,11,FALSE)))","v":""}]
[null,null,{"$f":"IF($B73=\"\",\"\",VLOOKUP($B73,Data!$A$4:$T$727,2,FALSE))","v":""},{"$f":"IF($B73=\"\",\"\",VLOOKUP($B73,Data!$A$4:$T$727,10,FALSE))","v":""},{"$f":"IF($B73=\"\",\"\",VLOOKUP($B73,Data!$A$4:$T$727,4,FALSE))","v":""},{"$f":"IF($B73=\"\",\"\",VLOOKUP($B73,Data!$A$4:$T$727,5,FALSE))","v":""},{"$f":"IF($B73=\"\",\"\",VLOOKUP($B73,Data!$A$4:$T$727,7,FALSE))","v":""},"","","","",{"$f":"IF($I$15=\"Show\",VLOOKUP($B73,Data!$A$4:$T$727,9,FALSE),VLOOKUP($B73,Data!$A$4:$T$727,7,FALSE))","v":{"$error":"#N/A"}},{"$f":"IF($B73=\"\",\"\",VLOOKUP($B73,Data!$A$4:$T$727,6,FALSE))","v":""},"",{"$f":"IF($B73=\"\",\"\",IF(VLOOKUP($B73,Data!$A$4:$T$727,11,FALSE)<1,\"\",VLOOKUP(B73,Data!$A$4:$T$727,11,FALSE)))","v":""}]
[null,null,{"$f":"IF($B74=\"\",\"\",VLOOKUP($B74,Data!$A$4:$T$727,2,FALSE))","v":""},{"$f":"IF($B74=\"\",\"\",VLOOKUP($B74,Data!$A$4:$T$727,10,FALSE))","v":""},{"$f":"IF($B74=\"\",\"\",VLOOKUP($B74,Data!$A$4:$T$727,4,FALSE))","v":""},{"$f":"IF($B74=\"\",\"\",VLOOKUP($B74,Data!$A$4:$T$727,5,FALSE))","v":""},{"$f":"IF($B74=\"\",\"\",VLOOKUP($B74,Data!$A$4:$T$727,7,FALSE))","v":""},"","","","",{"$f":"IF($I$15=\"Show\",VLOOKUP($B74,Data!$A$4:$T$727,9,FALSE),VLOOKUP($B74,Data!$A$4:$T$727,7,FALSE))","v":{"$error":"#N/A"}},{"$f":"IF($B74=\"\",\"\",VLOOKUP($B74,Data!$A$4:$T$727,6,FALSE))","v":""},"",{"$f":"IF($B74=\"\",\"\",IF(VLOOKUP($B74,Data!$A$4:$T$727,11,FALSE)<1,\"\",VLOOKUP(B74,Data!$A$4:$T$727,11,FALSE)))","v":""}]
[null,null,{"$f":"IF($B75=\"\",\"\",VLOOKUP($B75,Data!$A$4:$T$727,2,FALSE))","v":""},{"$f":"IF($B75=\"\",\"\",VLOOKUP($B75,Data!$A$4:$T$727,10,FALSE))","v":""},{"$f":"IF($B75=\"\",\"\",VLOOKUP($B75,Data!$A$4:$T$727,4,FALSE))","v":""},{"$f":"IF($B75=\"\",\"\",VLOOKUP($B75,Data!$A$4:$T$727,5,FALSE))","v":""},{"$f":"IF($B75=\"\",\"\",VLOOKUP($B75,Data!$A$4:$T$727,7,FALSE))","v":""},"","","","",{"$f":"IF($I$15=\"Show\",VLOOKUP($B75,Data!$A$4:$T$727,9,FALSE),VLOOKUP($B75,Data!$A$4:$T$727,7,FALSE))","v":{"$error":"#N/A"}},{"$f":"IF($B75=\"\",\"\",VLOOKUP($B75,Data!$A$4:$T$727,6,FALSE))","v":""},"",{"$f":"IF($B75=\"\",\"\",IF(VLOOKUP($B75,Data!$A$4:$T$727,11,FALSE)<1,\"\",VLOOKUP(B75,Data!$A$4:$T$727,11,FALSE)))","v":""}]
[null,null,{"$f":"IF($B76=\"\",\"\",VLOOKUP($B76,Data!$A$4:$T$727,2,FALSE))","v":""},{"$f":"IF($B76=\"\",\"\",VLOOKUP($B76,Data!$A$4:$T$727,10,FALSE))","v":""},{"$f":"IF($B76=\"\",\"\",VLOOKUP($B76,Data!$A$4:$T$727,4,FALSE))","v":""},{"$f":"IF($B76=\"\",\"\",VLOOKUP($B76,Data!$A$4:$T$727,5,FALSE))","v":""},{"$f":"IF($B76=\"\",\"\",VLOOKUP($B76,Data!$A$4:$T$727,7,FALSE))","v":""},"","","","",{"$f":"IF($I$15=\"Show\",VLOOKUP($B76,Data!$A$4:$T$727,9,FALSE),VLOOKUP($B76,Data!$A$4:$T$727,7,FALSE))","v":{"$error":"#N/A"}},{"$f":"IF($B76=\"\",\"\",VLOOKUP($B76,Data!$A$4:$T$727,6,FALSE))","v":""},"",{"$f":"IF($B76=\"\",\"\",IF(VLOOKUP($B76,Data!$A$4:$T$727,11,FALSE)<1,\"\",VLOOKUP(B76,Data!$A$4:$T$727,11,FALSE)))","v":""}]
[null,null,{"$f":"IF($B77=\"\",\"\",VLOOKUP($B77,Data!$A$4:$T$727,2,FALSE))","v":""},{"$f":"IF($B77=\"\",\"\",VLOOKUP($B77,Data!$A$4:$T$727,10,FALSE))","v":""},{"$f":"IF($B77=\"\",\"\",VLOOKUP($B77,Data!$A$4:$T$727,4,FALSE))","v":""},{"$f":"IF($B77=\"\",\"\",VLOOKUP($B77,Data!$A$4:$T$727,5,FALSE))","v":""},{"$f":"IF($B77=\"\",\"\",VLOOKUP($B77,Data!$A$4:$T$727,7,FALSE))","v":""},"","","","",{"$f":"IF($I$15=\"Show\",VLOOKUP($B77,Data!$A$4:$T$727,9,FALSE),VLOOKUP($B77,Data!$A$4:$T$727,7,FALSE))","v":{"$error":"#N/A"}},{"$f":"IF($B77=\"\",\"\",VLOOKUP($B77,Data!$A$4:$T$727,6,FALSE))","v":""},"",{"$f":"IF($B77=\"\",\"\",IF(VLOOKUP($B77,Data!$A$4:$T$727,11,FALSE)<1,\"\",VLOOKUP(B77,Data!$A$4:$T$727,11,FALSE)))","v":""}]
[null,null,{"$f":"IF($B78=\"\",\"\",VLOOKUP($B78,Data!$A$4:$T$727,2,FALSE))","v":""},{"$f":"IF($B78=\"\",\"\",VLOOKUP($B78,Data!$A$4:$T$727,10,FALSE))","v":""},{"$f":"IF($B78=\"\",\"\",VLOOKUP($B78,Data!$A$4:$T$727,4,FALSE))","v":""},{"$f":"IF($B78=\"\",\"\",VLOOKUP($B78,Data!$A$4:$T$727,5,FALSE))","v":""},{"$f":"IF($B78=\"\",\"\",VLOOKUP($B78,Data!$A$4:$T$727,7,FALSE))","v":""},"","","","",{"$f":"IF($I$15=\"Show\",VLOOKUP($B78,Data!$A$4:$T$727,9,FALSE),VLOOKUP($B78,Data!$A$4:$T$727,7,FALSE))","v":{"$error":"#N/A"}},{"$f":"IF($B78=\"\",\"\",VLOOKUP($B78,Data!$A$4:$T$727,6,FALSE))","v":""},"",{"$f":"IF($B78=\"\",\"\",IF(VLOOKUP($B78,Data!$A$4:$T$727,11,FALSE)<1,\"\",VLOOKUP(B78,Data!$A$4:$T$727,11,FALSE)))","v":""}]
[null,null,{"$f":"IF($B79=\"\",\"\",VLOOKUP($B79,Data!$A$4:$T$727,2,FALSE))","v":""},{"$f":"IF($B79=\"\",\"\",VLOOKUP($B79,Data!$A$4:$T$727,10,FALSE))","v":""},{"$f":"IF($B79=\"\",\"\",VLOOKUP($B79,Data!$A$4:$T$727,4,FALSE))","v":""},{"$f":"IF($B79=\"\",\"\",VLOOKUP($B79,Data!$A$4:$T$727,5,FALSE))","v":""},{"$f":"IF($B79=\"\",\"\",VLOOKUP($B79,Data!$A$4:$T$727,7,FALSE))","v":""},"","","","",{"$f":"IF($I$15=\"Show\",VLOOKUP($B79,Data!$A$4:$T$727,9,FALSE),VLOOKUP($B79,Data!$A$4:$T$727,7,FALSE))","v":{"$error":"#N/A"}},{"$f":"IF($B79=\"\",\"\",VLOOKUP($B79,Data!$A$4:$T$727,6,FALSE))","v":""},"",{"$f":"IF($B79=\"\",\"\",IF(VLOOKUP($B79,Data!$A$4:$T$727,11,FALSE)<1,\"\",VLOOKUP(B79,Data!$A$4:$T$727,11,FALSE)))","v":""}]
[null,null,{"$f":"IF($B80=\"\",\"\",VLOOKUP($B80,Data!$A$4:$T$727,2,FALSE))","v":""},{"$f":"IF($B80=\"\",\"\",VLOOKUP($B80,Data!$A$4:$T$727,10,FALSE))","v":""},{"$f":"IF($B80=\"\",\"\",VLOOKUP($B80,Data!$A$4:$T$727,4,FALSE))","v":""},{"$f":"IF($B80=\"\",\"\",VLOOKUP($B80,Data!$A$4:$T$727,5,FALSE))","v":""},{"$f":"IF($B80=\"\",\"\",VLOOKUP($B80,Data!$A$4:$T$727,7,FALSE))","v":""},"","","","",{"$f":"IF($I$15=\"Show\",VLOOKUP($B80,Data!$A$4:$T$727,9,FALSE),VLOOKUP($B80,Data!$A$4:$T$727,7,FALSE))","v":{"$error":"#N/A"}},{"$f":"IF($B80=\"\",\"\",VLOOKUP($B80,Data!$A$4:$T$727,6,FALSE))","v":""},"",{"$f":"IF($B80=\"\",\"\",IF(VLOOKUP($B80,Data!$A$4:$T$727,11,FALSE)<1,\"\",VLOOKUP(B80,Data!$A$4:$T$727,11,FALSE)))","v":""}]
[null,null,{"$f":"IF($B81=\"\",\"\",VLOOKUP($B81,Data!$A$4:$T$727,2,FALSE))","v":""},{"$f":"IF($B81=\"\",\"\",VLOOKUP($B81,Data!$A$4:$T$727,10,FALSE))","v":""},{"$f":"IF($B81=\"\",\"\",VLOOKUP($B81,Data!$A$4:$T$727,4,FALSE))","v":""},{"$f":"IF($B81=\"\",\"\",VLOOKUP($B81,Data!$A$4:$T$727,5,FALSE))","v":""},{"$f":"IF($B81=\"\",\"\",VLOOKUP($B81,Data!$A$4:$T$727,7,FALSE))","v":""},"","","","",{"$f":"IF($I$15=\"Show\",VLOOKUP($B81,Data!$A$4:$T$727,9,FALSE),VLOOKUP($B81,Data!$A$4:$T$727,7,FALSE))","v":{"$error":"#N/A"}},{"$f":"IF($B81=\"\",\"\",VLOOKUP($B81,Data!$A$4:$T$727,6,FALSE))","v":""},"",{"$f":"IF($B81=\"\",\"\",IF(VLOOKUP($B81,Data!$A$4:$T$727,11,FALSE)<1,\"\",VLOOKUP(B81,Data!$A$4:$T$727,11,FALSE)))","v":""}]
[null,null,{"$f":"IF($B82=\"\",\"\",VLOOKUP($B82,Data!$A$4:$T$727,2,FALSE))","v":""},{"$f":"IF($B82=\"\",\"\",VLOOKUP($B82,Data!$A$4:$T$727,10,FALSE))","v":""},{"$f":"IF($B82=\"\",\"\",VLOOKUP($B82,Data!$A$4:$T$727,4,FALSE))","v":""},{"$f":"IF($B82=\"\",\"\",VLOOKUP($B82,Data!$A$4:$T$727,5,FALSE))","v":""},{"$f":"IF($B82=\"\",\"\",VLOOKUP($B82,Data!$A$4:$T$727,7,FALSE))","v":""},"","","","",{"$f":"IF($I$15=\"Show\",VLOOKUP($B82,Data!$A$4:$T$727,9,FALSE),VLOOKUP($B82,Data!$A$4:$T$727,7,FALSE))","v":{"$error":"#N/A"}},{"$f":"IF($B82=\"\",\"\",VLOOKUP($B82,Data!$A$4:$T$727,6,FALSE))","v":""},"",{"$f":"IF($B82=\"\",\"\",IF(VLOOKUP($B82,Data!$A$4:$T$727,11,FALSE)<1,\"\",VLOOKUP(B82,Data!$A$4:$T$727,11,FALSE)))","v":""}]
[null,null,{"$f":"IF($B83=\"\",\"\",VLOOKUP($B83,Data!$A$4:$T$727,2,FALSE))","v":""},{"$f":"IF($B83=\"\",\"\",VLOOKUP($B83,Data!$A$4:$T$727,10,FALSE))","v":""},{"$f":"IF($B83=\"\",\"\",VLOOKUP($B83,Data!$A$4:$T$727,4,FALSE))","v":""},{"$f":"IF($B83=\"\",\"\",VLOOKUP($B83,Data!$A$4:$T$727,5,FALSE))","v":""},{"$f":"IF($B83=\"\",\"\",VLOOKUP($B83,Data!$A$4:$T$727,7,FALSE))","v":""},"","","","",{"$f":"IF($I$15=\"Show\",VLOOKUP($B83,Data!$A$4:$T$727,9,FALSE),VLOOKUP($B83,Data!$A$4:$T$727,7,FALSE))","v":{"$error":"#N/A"}},{"$f":"IF($B83=\"\",\"\",VLOOKUP($B83,Data!$A$4:$T$727,6,FALSE))","v":""},"",{"$f":"IF($B83=\"\",\"\",IF(VLOOKUP($B83,Data!$A$4:$T$727,11,FALSE)<1,\"\",VLOOKUP(B83,Data!$A$4:$T$727,11,FALSE)))","v":""}]
[null,null,{"$f":"IF($B84=\"\",\"\",VLOOKUP($B84,Data!$A$4:$T$727,2,FALSE))","v":""},{"$f":"IF($B84=\"\",\"\",VLOOKUP($B84,Data!$A$4:$T$727,10,FALSE))","v":""},{"$f":"IF($B84=\"\",\"\",VLOOKUP($B84,Data!$A$4:$T$727,4,FALSE))","v":""},{"$f":"IF($B84=\"\",\"\",VLOOKUP($B84,Data!$A$4:$T$727,5,FALSE))","v":""},{"$f":"IF($B84=\"\",\"\",VLOOKUP($B84,Data!$A$4:$T$727,7,FALSE))","v":""},"","","","",{"$f":"IF($I$15=\"Show\",VLOOKUP($B84,Data!$A$4:$T$727,9,FALSE),VLOOKUP($B84,Data!$A$4:$T$727,7,FALSE))","v":{"$error":"#N/A"}},{"$f":"IF($B84=\"\",\"\",VLOOKUP($B84,Data!$A$4:$T$727,6,FALSE))","v":""},"",{"$f":"IF($B84=\"\",\"\",IF(VLOOKUP($B84,Data!$A$4:$T$727,11,FALSE)<1,\"\",VLOOKUP(B84,Data!$A$4:$T$727,11,FALSE)))","v":""}]
[null,null,{"$f":"IF($B85=\"\",\"\",VLOOKUP($B85,Data!$A$4:$T$727,2,FALSE))","v":""},{"$f":"IF($B85=\"\",\"\",VLOOKUP($B85,Data!$A$4:$T$727,10,FALSE))","v":""},{"$f":"IF($B85=\"\",\"\",VLOOKUP($B85,Data!$A$4:$T$727,4,FALSE))","v":""},{"$f":"IF($B85=\"\",\"\",VLOOKUP($B85,Data!$A$4:$T$727,5,FALSE))","v":""},{"$f":"IF($B85=\"\",\"\",VLOOKUP($B85,Data!$A$4:$T$727,7,FALSE))","v":""},"","","","",{"$f":"IF($I$15=\"Show\",VLOOKUP($B85,Data!$A$4:$T$727,9,FALSE),VLOOKUP($B85,Data!$A$4:$T$727,7,FALSE))","v":{"$error":"#N/A"}},{"$f":"IF($B85=\"\",\"\",VLOOKUP($B85,Data!$A$4:$T$727,6,FALSE))","v":""},"",{"$f":"IF($B85=\"\",\"\",IF(VLOOKUP($B85,Data!$A$4:$T$727,11,FALSE)<1,\"\",VLOOKUP(B85,Data!$A$4:$T$727,11,FALSE)))","v":""}]
[null,null,{"$f":"IF($B86=\"\",\"\",VLOOKUP($B86,Data!$A$4:$T$727,2,FALSE))","v":""},{"$f":"IF($B86=\"\",\"\",VLOOKUP($B86,Data!$A$4:$T$727,10,FALSE))","v":""},{"$f":"IF($B86=\"\",\"\",VLOOKUP($B86,Data!$A$4:$T$727,4,FALSE))","v":""},{"$f":"IF($B86=\"\",\"\",VLOOKUP($B86,Data!$A$4:$T$727,5,FALSE))","v":""},{"$f":"IF($B86=\"\",\"\",VLOOKUP($B86,Data!$A$4:$T$727,7,FALSE))","v":""},{"$f":"IF($B86=\"\",\"\",IF($K$15=\"\",\"\",ROUND($G86*(1-($K$15*0.01)),2)))","v":""},{"$f":"IF($B86=\"\",\"\",IF($G86=$L86,\"\",L86))","v":""},{"$f":"IF($B86=\"\",\"\",IF($H86<$L86,$H86,$L86))","v":""},{"$f":"IF(A86=\"\",\"\",J86*A86)","v":""},{"$f":"IF($I$15=\"Show\",VLOOKUP($B86,Data!$A$4:$T$727,9,FALSE),VLOOKUP($B86,Data!$A$4:$T$727,7,FALSE))","v":{"$error":"#N/A"}},{"$f":"IF($B86=\"\",\"\",VLOOKUP($B86,Data!$A$4:$T$727,6,FALSE))","v":""},{"$f":"IF($A86=\"\",\"\",$A86/$M86)","v":""},{"$f":"IF($B86=\"\",\"\",IF(VLOOKUP($B86,Data!$A$4:$T$727,11,FALSE)<1,\"\",VLOOKUP(B86,Data!$A$4:$T$727,11,FALSE)))","v":""}]
[null,null,{"$f":"IF($B87=\"\",\"\",VLOOKUP($B87,Data!$A$4:$T$727,2,FALSE))","v":""},{"$f":"IF($B87=\"\",\"\",VLOOKUP($B87,Data!$A$4:$T$727,10,FALSE))","v":""},{"$f":"IF($B87=\"\",\"\",VLOOKUP($B87,Data!$A$4:$T$727,4,FALSE))","v":""},{"$f":"IF($B87=\"\",\"\",VLOOKUP($B87,Data!$A$4:$T$727,5,FALSE))","v":""},{"$f":"IF($B87=\"\",\"\",VLOOKUP($B87,Data!$A$4:$T$727,7,FALSE))","v":""},"","","","",{"$f":"IF($I$15=\"Show\",VLOOKUP($B87,Data!$A$4:$T$727,9,FALSE),VLOOKUP($B87,Data!$A$4:$T$727,7,FALSE))","v":{"$error":"#N/A"}},{"$f":"IF($B87=\"\",\"\",VLOOKUP($B87,Data!$A$4:$T$727,6,FALSE))","v":""},"",{"$f":"IF($B87=\"\",\"\",IF(VLOOKUP($B87,Data!$A$4:$T$727,11,FALSE)<1,\"\",VLOOKUP(B87,Data!$A$4:$T$727,11,FALSE)))","v":""}]
[null,null,{"$f":"IF($B88=\"\",\"\",VLOOKUP($B88,Data!$A$4:$T$727,2,FALSE))","v":""},{"$f":"IF($B88=\"\",\"\",VLOOKUP($B88,Data!$A$4:$T$727,10,FALSE))","v":""},{"$f":"IF($B88=\"\",\"\",VLOOKUP($B88,Data!$A$4:$T$727,4,FALSE))","v":""},{"$f":"IF($B88=\"\",\"\",VLOOKUP($B88,Data!$A$4:$T$727,5,FALSE))","v":""},{"$f":"IF($B88=\"\",\"\",VLOOKUP($B88,Data!$A$4:$T$727,7,FALSE))","v":""},"","","","",{"$f":"IF($I$15=\"Show\",VLOOKUP($B88,Data!$A$4:$T$727,9,FALSE),VLOOKUP($B88,Data!$A$4:$T$727,7,FALSE))","v":{"$error":"#N/A"}},{"$f":"IF($B88=\"\",\"\",VLOOKUP($B88,Data!$A$4:$T$727,6,FALSE))","v":""},"",{"$f":"IF($B88=\"\",\"\",IF(VLOOKUP($B88,Data!$A$4:$T$727,11,FALSE)<1,\"\",VLOOKUP(B88,Data!$A$4:$T$727,11,FALSE)))","v":""}]
[null,null,{"$f":"IF($B89=\"\",\"\",VLOOKUP($B89,Data!$A$4:$T$727,2,FALSE))","v":""},{"$f":"IF($B89=\"\",\"\",VLOOKUP($B89,Data!$A$4:$T$727,10,FALSE))","v":""},{"$f":"IF($B89=\"\",\"\",VLOOKUP($B89,Data!$A$4:$T$727,4,FALSE))","v":""},{"$f":"IF($B89=\"\",\"\",VLOOKUP($B89,Data!$A$4:$T$727,5,FALSE))","v":""},{"$f":"IF($B89=\"\",\"\",VLOOKUP($B89,Data!$A$4:$T$727,7,FALSE))","v":""},"","","","",{"$f":"IF($I$15=\"Show\",VLOOKUP($B89,Data!$A$4:$T$727,9,FALSE),VLOOKUP($B89,Data!$A$4:$T$727,7,FALSE))","v":{"$error":"#N/A"}},{"$f":"IF($B89=\"\",\"\",VLOOKUP($B89,Data!$A$4:$T$727,6,FALSE))","v":""},"",{"$f":"IF($B89=\"\",\"\",IF(VLOOKUP($B89,Data!$A$4:$T$727,11,FALSE)<1,\"\",VLOOKUP(B89,Data!$A$4:$T$727,11,FALSE)))","v":""}]
[null,null,{"$f":"IF($B90=\"\",\"\",VLOOKUP($B90,Data!$A$4:$T$727,2,FALSE))","v":""},{"$f":"IF($B90=\"\",\"\",VLOOKUP($B90,Data!$A$4:$T$727,10,FALSE))","v":""},{"$f":"IF($B90=\"\",\"\",VLOOKUP($B90,Data!$A$4:$T$727,4,FALSE))","v":""},{"$f":"IF($B90=\"\",\"\",VLOOKUP($B90,Data!$A$4:$T$727,5,FALSE))","v":""},{"$f":"IF($B90=\"\",\"\",VLOOKUP($B90,Data!$A$4:$T$727,7,FALSE))","v":""},"","","","",{"$f":"IF($I$15=\"Show\",VLOOKUP($B90,Data!$A$4:$T$727,9,FALSE),VLOOKUP($B90,Data!$A$4:$T$727,7,FALSE))","v":{"$error":"#N/A"}},{"$f":"IF($B90=\"\",\"\",VLOOKUP($B90,Data!$A$4:$T$727,6,FALSE))","v":""},"",{"$f":"IF($B90=\"\",\"\",IF(VLOOKUP($B90,Data!$A$4:$T$727,11,FALSE)<1,\"\",VLOOKUP(B90,Data!$A$4:$T$727,11,FALSE)))","v":""}]
[null,null,{"$f":"IF($B91=\"\",\"\",VLOOKUP($B91,Data!$A$4:$T$727,2,FALSE))","v":""},{"$f":"IF($B91=\"\",\"\",VLOOKUP($B91,Data!$A$4:$T$727,10,FALSE))","v":""},{"$f":"IF($B91=\"\",\"\",VLOOKUP($B91,Data!$A$4:$T$727,4,FALSE))","v":""},{"$f":"IF($B91=\"\",\"\",VLOOKUP($B91,Data!$A$4:$T$727,5,FALSE))","v":""},{"$f":"IF($B91=\"\",\"\",VLOOKUP($B91,Data!$A$4:$T$727,7,FALSE))","v":""},"","","","",{"$f":"IF($I$15=\"Show\",VLOOKUP($B91,Data!$A$4:$T$727,9,FALSE),VLOOKUP($B91,Data!$A$4:$T$727,7,FALSE))","v":{"$error":"#N/A"}},{"$f":"IF($B91=\"\",\"\",VLOOKUP($B91,Data!$A$4:$T$727,6,FALSE))","v":""},"",{"$f":"IF($B91=\"\",\"\",IF(VLOOKUP($B91,Data!$A$4:$T$727,11,FALSE)<1,\"\",VLOOKUP(B91,Data!$A$4:$T$727,11,FALSE)))","v":""}]
[null,null,{"$f":"IF($B92=\"\",\"\",VLOOKUP($B92,Data!$A$4:$T$727,2,FALSE))","v":""},{"$f":"IF($B92=\"\",\"\",VLOOKUP($B92,Data!$A$4:$T$727,10,FALSE))","v":""},{"$f":"IF($B92=\"\",\"\",VLOOKUP($B92,Data!$A$4:$T$727,4,FALSE))","v":""},{"$f":"IF($B92=\"\",\"\",VLOOKUP($B92,Data!$A$4:$T$727,5,FALSE))","v":""},{"$f":"IF($B92=\"\",\"\",VLOOKUP($B92,Data!$A$4:$T$727,7,FALSE))","v":""},"","","","",{"$f":"IF($I$15=\"Show\",VLOOKUP($B92,Data!$A$4:$T$727,9,FALSE),VLOOKUP($B92,Data!$A$4:$T$727,7,FALSE))","v":{"$error":"#N/A"}},{"$f":"IF($B92=\"\",\"\",VLOOKUP($B92,Data!$A$4:$T$727,6,FALSE))","v":""},"",{"$f":"IF($B92=\"\",\"\",IF(VLOOKUP($B92,Data!$A$4:$T$727,11,FALSE)<1,\"\",VLOOKUP(B92,Data!$A$4:$T$727,11,FALSE)))","v":""}]
[null,null,{"$f":"IF($B93=\"\",\"\",VLOOKUP($B93,Data!$A$4:$T$727,2,FALSE))","v":""},{"$f":"IF($B93=\"\",\"\",VLOOKUP($B93,Data!$A$4:$T$727,10,FALSE))","v":""},{"$f":"IF($B93=\"\",\"\",VLOOKUP($B93,Data!$A$4:$T$727,4,FALSE))","v":""},{"$f":"IF($B93=\"\",\"\",VLOOKUP($B93,Data!$A$4:$T$727,5,FALSE))","v":""},{"$f":"IF($B93=\"\",\"\",VLOOKUP($B93,Data!$A$4:$T$727,7,FALSE))","v":""},"","","","",{"$f":"IF($I$15=\"Show\",VLOOKUP($B93,Data!$A$4:$T$727,9,FALSE),VLOOKUP($B93,Data!$A$4:$T$727,7,FALSE))","v":{"$error":"#N/A"}},{"$f":"IF($B93=\"\",\"\",VLOOKUP($B93,Data!$A$4:$T$727,6,FALSE))","v":""},"",{"$f":"IF($B93=\"\",\"\",IF(VLOOKUP($B93,Data!$A$4:$T$727,11,FALSE)<1,\"\",VLOOKUP(B93,Data!$A$4:$T$727,11,FALSE)))","v":""}]
[null,null,{"$f":"IF($B94=\"\",\"\",VLOOKUP($B94,Data!$A$4:$T$727,2,FALSE))","v":""},{"$f":"IF($B94=\"\",\"\",VLOOKUP($B94,Data!$A$4:$T$727,10,FALSE))","v":""},{"$f":"IF($B94=\"\",\"\",VLOOKUP($B94,Data!$A$4:$T$727,4,FALSE))","v":""},{"$f":"IF($B94=\"\",\"\",VLOOKUP($B94,Data!$A$4:$T$727,5,FALSE))","v":""},{"$f":"IF($B94=\"\",\"\",VLOOKUP($B94,Data!$A$4:$T$727,7,FALSE))","v":""},"","","","",{"$f":"IF($I$15=\"Show\",VLOOKUP($B94,Data!$A$4:$T$727,9,FALSE),VLOOKUP($B94,Data!$A$4:$T$727,7,FALSE))","v":{"$error":"#N/A"}},{"$f":"IF($B94=\"\",\"\",VLOOKUP($B94,Data!$A$4:$T$727,6,FALSE))","v":""},"",{"$f":"IF($B94=\"\",\"\",IF(VLOOKUP($B94,Data!$A$4:$T$727,11,FALSE)<1,\"\",VLOOKUP(B94,Data!$A$4:$T$727,11,FALSE)))","v":""}]
[null,null,{"$f":"IF($B95=\"\",\"\",VLOOKUP($B95,Data!$A$4:$T$727,2,FALSE))","v":""},{"$f":"IF($B95=\"\",\"\",VLOOKUP($B95,Data!$A$4:$T$727,10,FALSE))","v":""},{"$f":"IF($B95=\"\",\"\",VLOOKUP($B95,Data!$A$4:$T$727,4,FALSE))","v":""},{"$f":"IF($B95=\"\",\"\",VLOOKUP($B95,Data!$A$4:$T$727,5,FALSE))","v":""},{"$f":"IF($B95=\"\",\"\",VLOOKUP($B95,Data!$A$4:$T$727,7,FALSE))","v":""},"","","","",{"$f":"IF($I$15=\"Show\",VLOOKUP($B95,Data!$A$4:$T$727,9,FALSE),VLOOKUP($B95,Data!$A$4:$T$727,7,FALSE))","v":{"$error":"#N/A"}},{"$f":"IF($B95=\"\",\"\",VLOOKUP($B95,Data!$A$4:$T$727,6,FALSE))","v":""},"",{"$f":"IF($B95=\"\",\"\",IF(VLOOKUP($B95,Data!$A$4:$T$727,11,FALSE)<1,\"\",VLOOKUP(B95,Data!$A$4:$T$727,11,FALSE)))","v":""}]
[null,null,{"$f":"IF($B96=\"\",\"\",VLOOKUP($B96,Data!$A$4:$T$727,2,FALSE))","v":""},{"$f":"IF($B96=\"\",\"\",VLOOKUP($B96,Data!$A$4:$T$727,10,FALSE))","v":""},{"$f":"IF($B96=\"\",\"\",VLOOKUP($B96,Data!$A$4:$T$727,4,FALSE))","v":""},{"$f":"IF($B96=\"\",\"\",VLOOKUP($B96,Data!$A$4:$T$727,5,FALSE))","v":""},{"$f":"IF($B96=\"\",\"\",VLOOKUP($B96,Data!$A$4:$T$727,7,FALSE))","v":""},"","","","",{"$f":"IF($I$15=\"Show\",VLOOKUP($B96,Data!$A$4:$T$727,9,FALSE),VLOOKUP($B96,Data!$A$4:$T$727,7,FALSE))","v":{"$error":"#N/A"}},{"$f":"IF($B96=\"\",\"\",VLOOKUP($B96,Data!$A$4:$T$727,6,FALSE))","v":""},"",{"$f":"IF($B96=\"\",\"\",IF(VLOOKUP($B96,Data!$A$4:$T$727,11,FALSE)<1,\"\",VLOOKUP(B96,Data!$A$4:$T$727,11,FALSE)))","v":""}]
[null,null,{"$f":"IF($B97=\"\",\"\",VLOOKUP($B97,Data!$A$4:$T$727,2,FALSE))","v":""},{"$f":"IF($B97=\"\",\"\",VLOOKUP($B97,Data!$A$4:$T$727,10,FALSE))","v":""},{"$f":"IF($B97=\"\",\"\",VLOOKUP($B97,Data!$A$4:$T$727,4,FALSE))","v":""},{"$f":"IF($B97=\"\",\"\",VLOOKUP($B97,Data!$A$4:$T$727,5,FALSE))","v":""},{"$f":"IF($B97=\"\",\"\",VLOOKUP($B97,Data!$A$4:$T$727,7,FALSE))","v":""},"","","","",{"$f":"IF($I$15=\"Show\",VLOOKUP($B97,Data!$A$4:$T$727,9,FALSE),VLOOKUP($B97,Data!$A$4:$T$727,7,FALSE))","v":{"$error":"#N/A"}},{"$f":"IF($B97=\"\",\"\",VLOOKUP($B97,Data!$A$4:$T$727,6,FALSE))","v":""},"",{"$f":"IF($B97=\"\",\"\",IF(VLOOKUP($B97,Data!$A$4:$T$727,11,FALSE)<1,\"\",VLOOKUP(B97,Data!$A$4:$T$727,11,FALSE)))","v":""}]
[null,null,{"$f":"IF($B98=\"\",\"\",VLOOKUP($B98,Data!$A$4:$T$727,2,FALSE))","v":""},{"$f":"IF($B98=\"\",\"\",VLOOKUP($B98,Data!$A$4:$T$727,10,FALSE))","v":""},{"$f":"IF($B98=\"\",\"\",VLOOKUP($B98,Data!$A$4:$T$727,4,FALSE))","v":""},{"$f":"IF($B98=\"\",\"\",VLOOKUP($B98,Data!$A$4:$T$727,5,FALSE))","v":""},{"$f":"IF($B98=\"\",\"\",VLOOKUP($B98,Data!$A$4:$T$727,7,FALSE))","v":""},"","","","",{"$f":"IF($I$15=\"Show\",VLOOKUP($B98,Data!$A$4:$T$727,9,FALSE),VLOOKUP($B98,Data!$A$4:$T$727,7,FALSE))","v":{"$error":"#N/A"}},{"$f":"IF($B98=\"\",\"\",VLOOKUP($B98,Data!$A$4:$T$727,6,FALSE))","v":""},"",{"$f":"IF($B98=\"\",\"\",IF(VLOOKUP($B98,Data!$A$4:$T$727,11,FALSE)<1,\"\",VLOOKUP(B98,Data!$A$4:$T$727,11,FALSE)))","v":""}]
[null,null,{"$f":"IF($B99=\"\",\"\",VLOOKUP($B99,Data!$A$4:$T$727,2,FALSE))","v":""},{"$f":"IF($B99=\"\",\"\",VLOOKUP($B99,Data!$A$4:$T$727,10,FALSE))","v":""},{"$f":"IF($B99=\"\",\"\",VLOOKUP($B99,Data!$A$4:$T$727,4,FALSE))","v":""},{"$f":"IF($B99=\"\",\"\",VLOOKUP($B99,Data!$A$4:$T$727,5,FALSE))","v":""},{"$f":"IF($B99=\"\",\"\",VLOOKUP($B99,Data!$A$4:$T$727,7,FALSE))","v":""},"","","","",{"$f":"IF($I$15=\"Show\",VLOOKUP($B99,Data!$A$4:$T$727,9,FALSE),VLOOKUP($B99,Data!$A$4:$T$727,7,FALSE))","v":{"$error":"#N/A"}},{"$f":"IF($B99=\"\",\"\",VLOOKUP($B99,Data!$A$4:$T$727,6,FALSE))","v":""},"",{"$f":"IF($B99=\"\",\"\",IF(VLOOKUP($B99,Data!$A$4:$T$727,11,FALSE)<1,\"\",VLOOKUP(B99,Data!$A$4:$T$727,11,FALSE)))","v":""}]
[null,null,{"$f":"IF($B100=\"\",\"\",VLOOKUP($B100,Data!$A$4:$T$727,2,FALSE))","v":""},{"$f":"IF($B100=\"\",\"\",VLOOKUP($B100,Data!$A$4:$T$727,10,FALSE))","v":""},{"$f":"IF($B100=\"\",\"\",VLOOKUP($B100,Data!$A$4:$T$727,4,FALSE))","v":""},{"$f":"IF($B100=\"\",\"\",VLOOKUP($B100,Data!$A$4:$T$727,5,FALSE))","v":""},{"$f":"IF($B100=\"\",\"\",VLOOKUP($B100,Data!$A$4:$T$727,7,FALSE))","v":""},"","","","",{"$f":"IF($I$15=\"Show\",VLOOKUP($B100,Data!$A$4:$T$727,9,FALSE),VLOOKUP($B100,Data!$A$4:$T$727,7,FALSE))","v":{"$error":"#N/A"}},{"$f":"IF($B100=\"\",\"\",VLOOKUP($B100,Data!$A$4:$T$727,6,FALSE))","v":""},"",{"$f":"IF($B100=\"\",\"\",IF(VLOOKUP($B100,Data!$A$4:$T$727,11,FALSE)<1,\"\",VLOOKUP(B100,Data!$A$4:$T$727,11,FALSE)))","v":""}]
[null,null,{"$f":"IF($B101=\"\",\"\",VLOOKUP($B101,Data!$A$4:$T$727,2,FALSE))","v":""},{"$f":"IF($B101=\"\",\"\",VLOOKUP($B101,Data!$A$4:$T$727,10,FALSE))","v":""},{"$f":"IF($B101=\"\",\"\",VLOOKUP($B101,Data!$A$4:$T$727,4,FALSE))","v":""},{"$f":"IF($B101=\"\",\"\",VLOOKUP($B101,Data!$A$4:$T$727,5,FALSE))","v":""},{"$f":"IF($B101=\"\",\"\",VLOOKUP($B101,Data!$A$4:$T$727,7,FALSE))","v":""},"","","","",{"$f":"IF($I$15=\"Show\",VLOOKUP($B101,Data!$A$4:$T$727,9,FALSE),VLOOKUP($B101,Data!$A$4:$T$727,7,FALSE))","v":{"$error":"#N/A"}},{"$f":"IF($B101=\"\",\"\",VLOOKUP($B101,Data!$A$4:$T$727,6,FALSE))","v":""},"",{"$f":"IF($B101=\"\",\"\",IF(VLOOKUP($B101,Data!$A$4:$T$727,11,FALSE)<1,\"\",VLOOKUP(B101,Data!$A$4:$T$727,11,FALSE)))","v":""}]
[null,null,{"$f":"IF($B102=\"\",\"\",VLOOKUP($B102,Data!$A$4:$T$727,2,FALSE))","v":""},{"$f":"IF($B102=\"\",\"\",VLOOKUP($B102,Data!$A$4:$T$727,10,FALSE))","v":""},{"$f":"IF($B102=\"\",\"\",VLOOKUP($B102,Data!$A$4:$T$727,4,FALSE))","v":""},{"$f":"IF($B102=\"\",\"\",VLOOKUP($B102,Data!$A$4:$T$727,5,FALSE))","v":""},{"$f":"IF($B102=\"\",\"\",VLOOKUP($B102,Data!$A$4:$T$727,7,FALSE))","v":""},"","","","",{"$f":"IF($I$15=\"Show\",VLOOKUP($B102,Data!$A$4:$T$727,9,FALSE),VLOOKUP($B102,Data!$A$4:$T$727,7,FALSE))","v":{"$error":"#N/A"}},{"$f":"IF($B102=\"\",\"\",VLOOKUP($B102,Data!$A$4:$T$727,6,FALSE))","v":""},"",{"$f":"IF($B102=\"\",\"\",IF(VLOOKUP($B102,Data!$A$4:$T$727,11,FALSE)<1,\"\",VLOOKUP(B102,Data!$A$4:$T$727,11,FALSE)))","v":""}]
[null,null,{"$f":"IF($B103=\"\",\"\",VLOOKUP($B103,Data!$A$4:$T$727,2,FALSE))","v":""},{"$f":"IF($B103=\"\",\"\",VLOOKUP($B103,Data!$A$4:$T$727,10,FALSE))","v":""},{"$f":"IF($B103=\"\",\"\",VLOOKUP($B103,Data!$A$4:$T$727,4,FALSE))","v":""},{"$f":"IF($B103=\"\",\"\",VLOOKUP($B103,Data!$A$4:$T$727,5,FALSE))","v":""},{"$f":"IF($B103=\"\",\"\",VLOOKUP($B103,Data!$A$4:$T$727,7,FALSE))","v":""},"","","","",{"$f":"IF($I$15=\"Show\",VLOOKUP($B103,Data!$A$4:$T$727,9,FALSE),VLOOKUP($B103,Data!$A$4:$T$727,7,FALSE))","v":{"$error":"#N/A"}},{"$f":"IF($B103=\"\",\"\",VLOOKUP($B103,Data!$A$4:$T$727,6,FALSE))","v":""},"",{"$f":"IF($B103=\"\",\"\",IF(VLOOKUP($B103,Data!$A$4:$T$727,11,FALSE)<1,\"\",VLOOKUP(B103,Data!$A$4:$T$727,11,FALSE)))","v":""}]
[null,null,{"$f":"IF($B104=\"\",\"\",VLOOKUP($B104,Data!$A$4:$T$727,2,FALSE))","v":""},{"$f":"IF($B104=\"\",\"\",VLOOKUP($B104,Data!$A$4:$T$727,10,FALSE))","v":""},{"$f":"IF($B104=\"\",\"\",VLOOKUP($B104,Data!$A$4:$T$727,4,FALSE))","v":""},{"$f":"IF($B104=\"\",\"\",VLOOKUP($B104,Data!$A$4:$T$727,5,FALSE))","v":""},{"$f":"IF($B104=\"\",\"\",VLOOKUP($B104,Data!$A$4:$T$727,7,FALSE))","v":""},"","","","",{"$f":"IF($I$15=\"Show\",VLOOKUP($B104,Data!$A$4:$T$727,9,FALSE),VLOOKUP($B104,Data!$A$4:$T$727,7,FALSE))","v":{"$error":"#N/A"}},{"$f":"IF($B104=\"\",\"\",VLOOKUP($B104,Data!$A$4:$T$727,6,FALSE))","v":""},"",{"$f":"IF($B104=\"\",\"\",IF(VLOOKUP($B104,Data!$A$4:$T$727,11,FALSE)<1,\"\",VLOOKUP(B104,Data!$A$4:$T$727,11,FALSE)))","v":""}]
[null,null,{"$f":"IF($B105=\"\",\"\",VLOOKUP($B105,Data!$A$4:$T$727,2,FALSE))","v":""},{"$f":"IF($B105=\"\",\"\",VLOOKUP($B105,Data!$A$4:$T$727,10,FALSE))","v":""},{"$f":"IF($B105=\"\",\"\",VLOOKUP($B105,Data!$A$4:$T$727,4,FALSE))","v":""},{"$f":"IF($B105=\"\",\"\",VLOOKUP($B105,Data!$A$4:$T$727,5,FALSE))","v":""},{"$f":"IF($B105=\"\",\"\",VLOOKUP($B105,Data!$A$4:$T$727,7,FALSE))","v":""},"","","","",{"$f":"IF($I$15=\"Show\",VLOOKUP($B105,Data!$A$4:$T$727,9,FALSE),VLOOKUP($B105,Data!$A$4:$T$727,7,FALSE))","v":{"$error":"#N/A"}},{"$f":"IF($B105=\"\",\"\",VLOOKUP($B105,Data!$A$4:$T$727,6,FALSE))","v":""},"",{"$f":"IF($B105=\"\",\"\",IF(VLOOKUP($B105,Data!$A$4:$T$727,11,FALSE)<1,\"\",VLOOKUP(B105,Data!$A$4:$T$727,11,FALSE)))","v":""}]
[null,null,{"$f":"IF($B106=\"\",\"\",VLOOKUP($B106,Data!$A$4:$T$727,2,FALSE))","v":""},{"$f":"IF($B106=\"\",\"\",VLOOKUP($B106,Data!$A$4:$T$727,10,FALSE))","v":""},{"$f":"IF($B106=\"\",\"\",VLOOKUP($B106,Data!$A$4:$T$727,4,FALSE))","v":""},{"$f":"IF($B106=\"\",\"\",VLOOKUP($B106,Data!$A$4:$T$727,5,FALSE))","v":""},{"$f":"IF($B106=\"\",\"\",VLOOKUP($B106,Data!$A$4:$T$727,7,FALSE))","v":""},"","","","",{"$f":"IF($I$15=\"Show\",VLOOKUP($B106,Data!$A$4:$T$727,9,FALSE),VLOOKUP($B106,Data!$A$4:$T$727,7,FALSE))","v":{"$error":"#N/A"}},{"$f":"IF($B106=\"\",\"\",VLOOKUP($B106,Data!$A$4:$T$727,6,FALSE))","v":""},"",{"$f":"IF($B106=\"\",\"\",IF(VLOOKUP($B106,Data!$A$4:$T$727,11,FALSE)<1,\"\",VLOOKUP(B106,Data!$A$4:$T$727,11,FALSE)))","v":""}]
[null,null,{"$f":"IF($B107=\"\",\"\",VLOOKUP($B107,Data!$A$4:$T$727,2,FALSE))","v":""},{"$f":"IF($B107=\"\",\"\",VLOOKUP($B107,Data!$A$4:$T$727,10,FALSE))","v":""},{"$f":"IF($B107=\"\",\"\",VLOOKUP($B107,Data!$A$4:$T$727,4,FALSE))","v":""},{"$f":"IF($B107=\"\",\"\",VLOOKUP($B107,Data!$A$4:$T$727,5,FALSE))","v":""},{"$f":"IF($B107=\"\",\"\",VLOOKUP($B107,Data!$A$4:$T$727,7,FALSE))","v":""},"","","","",{"$f":"IF($I$15=\"Show\",VLOOKUP($B107,Data!$A$4:$T$727,9,FALSE),VLOOKUP($B107,Data!$A$4:$T$727,7,FALSE))","v":{"$error":"#N/A"}},{"$f":"IF($B107=\"\",\"\",VLOOKUP($B107,Data!$A$4:$T$727,6,FALSE))","v":""},"",{"$f":"IF($B107=\"\",\"\",IF(VLOOKUP($B107,Data!$A$4:$T$727,11,FALSE)<1,\"\",VLOOKUP(B107,Data!$A$4:$T$727,11,FALSE)))","v":""}]
[null,null,{"$f":"IF($B108=\"\",\"\",VLOOKUP($B108,Data!$A$4:$T$727,2,FALSE))","v":""},{"$f":"IF($B108=\"\",\"\",VLOOKUP($B108,Data!$A$4:$T$727,10,FALSE))","v":""},{"$f":"IF($B108=\"\",\"\",VLOOKUP($B108,Data!$A$4:$T$727,4,FALSE))","v":""},{"$f":"IF($B108=\"\",\"\",VLOOKUP($B108,Data!$A$4:$T$727,5,FALSE))","v":""},{"$f":"IF($B108=\"\",\"\",VLOOKUP($B108,Data!$A$4:$T$727,7,FALSE))","v":""},"","","","",{"$f":"IF($I$15=\"Show\",VLOOKUP($B108,Data!$A$4:$T$727,9,FALSE),VLOOKUP($B108,Data!$A$4:$T$727,7,FALSE))","v":{"$error":"#N/A"}},{"$f":"IF($B108=\"\",\"\",VLOOKUP($B108,Data!$A$4:$T$727,6,FALSE))","v":""},"",{"$f":"IF($B108=\"\",\"\",IF(VLOOKUP($B108,Data!$A$4:$T$727,11,FALSE)<1,\"\",VLOOKUP(B108,Data!$A$4:$T$727,11,FALSE)))","v":""}]
[null,null,{"$f":"IF($B109=\"\",\"\",VLOOKUP($B109,Data!$A$4:$T$727,2,FALSE))","v":""},{"$f":"IF($B109=\"\",\"\",VLOOKUP($B109,Data!$A$4:$T$727,10,FALSE))","v":""},{"$f":"IF($B109=\"\",\"\",VLOOKUP($B109,Data!$A$4:$T$727,4,FALSE))","v":""},{"$f":"IF($B109=\"\",\"\",VLOOKUP($B109,Data!$A$4:$T$727,5,FALSE))","v":""},{"$f":"IF($B109=\"\",\"\",VLOOKUP($B109,Data!$A$4:$T$727,7,FALSE))","v":""},"","","","",{"$f":"IF($I$15=\"Show\",VLOOKUP($B109,Data!$A$4:$T$727,9,FALSE),VLOOKUP($B109,Data!$A$4:$T$727,7,FALSE))","v":{"$error":"#N/A"}},{"$f":"IF($B109=\"\",\"\",VLOOKUP($B109,Data!$A$4:$T$727,6,FALSE))","v":""},"",{"$f":"IF($B109=\"\",\"\",IF(VLOOKUP($B109,Data!$A$4:$T$727,11,FALSE)<1,\"\",VLOOKUP(B109,Data!$A$4:$T$727,11,FALSE)))","v":""}]
[null,null,{"$f":"IF($B110=\"\",\"\",VLOOKUP($B110,Data!$A$4:$T$727,2,FALSE))","v":""},{"$f":"IF($B110=\"\",\"\",VLOOKUP($B110,Data!$A$4:$T$727,10,FALSE))","v":""},{"$f":"IF($B110=\"\",\"\",VLOOKUP($B110,Data!$A$4:$T$727,4,FALSE))","v":""},{"$f":"IF($B110=\"\",\"\",VLOOKUP($B110,Data!$A$4:$T$727,5,FALSE))","v":""},{"$f":"IF($B110=\"\",\"\",VLOOKUP($B110,Data!$A$4:$T$727,7,FALSE))","v":""},"","","","",{"$f":"IF($I$15=\"Show\",VLOOKUP($B110,Data!$A$4:$T$727,9,FALSE),VLOOKUP($B110,Data!$A$4:$T$727,7,FALSE))","v":{"$error":"#N/A"}},{"$f":"IF($B110=\"\",\"\",VLOOKUP($B110,Data!$A$4:$T$727,6,FALSE))","v":""},"",{"$f":"IF($B110=\"\",\"\",IF(VLOOKUP($B110,Data!$A$4:$T$727,11,FALSE)<1,\"\",VLOOKUP(B110,Data!$A$4:$T$727,11,FALSE)))","v":""}]
[null,null,{"$f":"IF($B111=\"\",\"\",VLOOKUP($B111,Data!$A$4:$T$727,2,FALSE))","v":""},{"$f":"IF($B111=\"\",\"\",VLOOKUP($B111,Data!$A$4:$T$727,10,FALSE))","v":""},{"$f":"IF($B111=\"\",\"\",VLOOKUP($B111,Data!$A$4:$T$727,4,FALSE))","v":""},{"$f":"IF($B111=\"\",\"\",VLOOKUP($B111,Data!$A$4:$T$727,5,FALSE))","v":""},{"$f":"IF($B111=\"\",\"\",VLOOKUP($B111,Data!$A$4:$T$727,7,FALSE))","v":""},"","","","",{"$f":"IF($I$15=\"Show\",VLOOKUP($B111,Data!$A$4:$T$727,9,FALSE),VLOOKUP($B111,Data!$A$4:$T$727,7,FALSE))","v":{"$error":"#N/A"}},{"$f":"IF($B111=\"\",\"\",VLOOKUP($B111,Data!$A$4:$T$727,6,FALSE))","v":""},"",{"$f":"IF($B111=\"\",\"\",IF(VLOOKUP($B111,Data!$A$4:$T$727,11,FALSE)<1,\"\",VLOOKUP(B111,Data!$A$4:$T$727,11,FALSE)))","v":""}]
[null,null,{"$f":"IF($B112=\"\",\"\",VLOOKUP($B112,Data!$A$4:$T$727,2,FALSE))","v":""},{"$f":"IF($B112=\"\",\"\",VLOOKUP($B112,Data!$A$4:$T$727,10,FALSE))","v":""},{"$f":"IF($B112=\"\",\"\",VLOOKUP($B112,Data!$A$4:$T$727,4,FALSE))","v":""},{"$f":"IF($B112=\"\",\"\",VLOOKUP($B112,Data!$A$4:$T$727,5,FALSE))","v":""},{"$f":"IF($B112=\"\",\"\",VLOOKUP($B112,Data!$A$4:$T$727,7,FALSE))","v":""},"","","","",{"$f":"IF($I$15=\"Show\",VLOOKUP($B112,Data!$A$4:$T$727,9,FALSE),VLOOKUP($B112,Data!$A$4:$T$727,7,FALSE))","v":{"$error":"#N/A"}},{"$f":"IF($B112=\"\",\"\",VLOOKUP($B112,Data!$A$4:$T$727,6,FALSE))","v":""},"",{"$f":"IF($B112=\"\",\"\",IF(VLOOKUP($B112,Data!$A$4:$T$727,11,FALSE)<1,\"\",VLOOKUP(B112,Data!$A$4:$T$727,11,FALSE)))","v":""}]
[null,null,{"$f":"IF($B113=\"\",\"\",VLOOKUP($B113,Data!$A$4:$T$727,2,FALSE))","v":""},{"$f":"IF($B113=\"\",\"\",VLOOKUP($B113,Data!$A$4:$T$727,10,FALSE))","v":""},{"$f":"IF($B113=\"\",\"\",VLOOKUP($B113,Data!$A$4:$T$727,4,FALSE))","v":""},{"$f":"IF($B113=\"\",\"\",VLOOKUP($B113,Data!$A$4:$T$727,5,FALSE))","v":""},{"$f":"IF($B113=\"\",\"\",VLOOKUP($B113,Data!$A$4:$T$727,7,FALSE))","v":""},"","","","",{"$f":"IF($I$15=\"Show\",VLOOKUP($B113,Data!$A$4:$T$727,9,FALSE),VLOOKUP($B113,Data!$A$4:$T$727,7,FALSE))","v":{"$error":"#N/A"}},{"$f":"IF($B113=\"\",\"\",VLOOKUP($B113,Data!$A$4:$T$727,6,FALSE))","v":""},"",{"$f":"IF($B113=\"\",\"\",IF(VLOOKUP($B113,Data!$A$4:$T$727,11,FALSE)<1,\"\",VLOOKUP(B113,Data!$A$4:$T$727,11,FALSE)))","v":""}]
[null,null,{"$f":"IF($B114=\"\",\"\",VLOOKUP($B114,Data!$A$4:$T$727,2,FALSE))","v":""},{"$f":"IF($B114=\"\",\"\",VLOOKUP($B114,Data!$A$4:$T$727,10,FALSE))","v":""},{"$f":"IF($B114=\"\",\"\",VLOOKUP($B114,Data!$A$4:$T$727,4,FALSE))","v":""},{"$f":"IF($B114=\"\",\"\",VLOOKUP($B114,Data!$A$4:$T$727,5,FALSE))","v":""},{"$f":"IF($B114=\"\",\"\",VLOOKUP($B114,Data!$A$4:$T$727,7,FALSE))","v":""},"","","","",{"$f":"IF($I$15=\"Show\",VLOOKUP($B114,Data!$A$4:$T$727,9,FALSE),VLOOKUP($B114,Data!$A$4:$T$727,7,FALSE))","v":{"$error":"#N/A"}},{"$f":"IF($B114=\"\",\"\",VLOOKUP($B114,Data!$A$4:$T$727,6,FALSE))","v":""},"",{"$f":"IF($B114=\"\",\"\",IF(VLOOKUP($B114,Data!$A$4:$T$727,11,FALSE)<1,\"\",VLOOKUP(B114,Data!$A$4:$T$727,11,FALSE)))","v":""}]
[null,null,{"$f":"IF($B115=\"\",\"\",VLOOKUP($B115,Data!$A$4:$T$727,2,FALSE))","v":""},{"$f":"IF($B115=\"\",\"\",VLOOKUP($B115,Data!$A$4:$T$727,10,FALSE))","v":""},{"$f":"IF($B115=\"\",\"\",VLOOKUP($B115,Data!$A$4:$T$727,4,FALSE))","v":""},{"$f":"IF($B115=\"\",\"\",VLOOKUP($B115,Data!$A$4:$T$727,5,FALSE))","v":""},{"$f":"IF($B115=\"\",\"\",VLOOKUP($B115,Data!$A$4:$T$727,7,FALSE))","v":""},"","","","",{"$f":"IF($I$15=\"Show\",VLOOKUP($B115,Data!$A$4:$T$727,9,FALSE),VLOOKUP($B115,Data!$A$4:$T$727,7,FALSE))","v":{"$error":"#N/A"}},{"$f":"IF($B115=\"\",\"\",VLOOKUP($B115,Data!$A$4:$T$727,6,FALSE))","v":""},"",{"$f":"IF($B115=\"\",\"\",IF(VLOOKUP($B115,Data!$A$4:$T$727,11,FALSE)<1,\"\",VLOOKUP(B115,Data!$A$4:$T$727,11,FALSE)))","v":""}]
[null,null,{"$f":"IF($B116=\"\",\"\",VLOOKUP($B116,Data!$A$4:$T$727,2,FALSE))","v":""},{"$f":"IF($B116=\"\",\"\",VLOOKUP($B116,Data!$A$4:$T$727,10,FALSE))","v":""},{"$f":"IF($B116=\"\",\"\",VLOOKUP($B116,Data!$A$4:$T$727,4,FALSE))","v":""},{"$f":"IF($B116=\"\",\"\",VLOOKUP($B116,Data!$A$4:$T$727,5,FALSE))","v":""},{"$f":"IF($B116=\"\",\"\",VLOOKUP($B116,Data!$A$4:$T$727,7,FALSE))","v":""},"","","","",{"$f":"IF($I$15=\"Show\",VLOOKUP($B116,Data!$A$4:$T$727,9,FALSE),VLOOKUP($B116,Data!$A$4:$T$727,7,FALSE))","v":{"$error":"#N/A"}},{"$f":"IF($B116=\"\",\"\",VLOOKUP($B116,Data!$A$4:$T$727,6,FALSE))","v":""},"",{"$f":"IF($B116=\"\",\"\",IF(VLOOKUP($B116,Data!$A$4:$T$727,11,FALSE)<1,\"\",VLOOKUP(B116,Data!$A$4:$T$727,11,FALSE)))","v":""}]
[null,null,{"$f":"IF($B117=\"\",\"\",VLOOKUP($B117,Data!$A$4:$T$727,2,FALSE))","v":""},{"$f":"IF($B117=\"\",\"\",VLOOKUP($B117,Data!$A$4:$T$727,10,FALSE))","v":""},{"$f":"IF($B117=\"\",\"\",VLOOKUP($B117,Data!$A$4:$T$727,4,FALSE))","v":""},{"$f":"IF($B117=\"\",\"\",VLOOKUP($B117,Data!$A$4:$T$727,5,FALSE))","v":""},{"$f":"IF($B117=\"\",\"\",VLOOKUP($B117,Data!$A$4:$T$727,7,FALSE))","v":""},"","","","",{"$f":"IF($I$15=\"Show\",VLOOKUP($B117,Data!$A$4:$T$727,9,FALSE),VLOOKUP($B117,Data!$A$4:$T$727,7,FALSE))","v":{"$error":"#N/A"}},{"$f":"IF($B117=\"\",\"\",VLOOKUP($B117,Data!$A$4:$T$727,6,FALSE))","v":""},"",{"$f":"IF($B117=\"\",\"\",IF(VLOOKUP($B117,Data!$A$4:$T$727,11,FALSE)<1,\"\",VLOOKUP(B117,Data!$A$4:$T$727,11,FALSE)))","v":""}]
[null,null,{"$f":"IF($B118=\"\",\"\",VLOOKUP($B118,Data!$A$4:$T$727,2,FALSE))","v":""},{"$f":"IF($B118=\"\",\"\",VLOOKUP($B118,Data!$A$4:$T$727,10,FALSE))","v":""},{"$f":"IF($B118=\"\",\"\",VLOOKUP($B118,Data!$A$4:$T$727,4,FALSE))","v":""},{"$f":"IF($B118=\"\",\"\",VLOOKUP($B118,Data!$A$4:$T$727,5,FALSE))","v":""},{"$f":"IF($B118=\"\",\"\",VLOOKUP($B118,Data!$A$4:$T$727,7,FALSE))","v":""},"","","","",{"$f":"IF($I$15=\"Show\",VLOOKUP($B118,Data!$A$4:$T$727,9,FALSE),VLOOKUP($B118,Data!$A$4:$T$727,7,FALSE))","v":{"$error":"#N/A"}},{"$f":"IF($B118=\"\",\"\",VLOOKUP($B118,Data!$A$4:$T$727,6,FALSE))","v":""},"",{"$f":"IF($B118=\"\",\"\",IF(VLOOKUP($B118,Data!$A$4:$T$727,11,FALSE)<1,\"\",VLOOKUP(B118,Data!$A$4:$T$727,11,FALSE)))","v":""}]
[null,null,{"$f":"IF($B119=\"\",\"\",VLOOKUP($B119,Data!$A$4:$T$727,2,FALSE))","v":""},{"$f":"IF($B119=\"\",\"\",VLOOKUP($B119,Data!$A$4:$T$727,10,FALSE))","v":""},{"$f":"IF($B119=\"\",\"\",VLOOKUP($B119,Data!$A$4:$T$727,4,FALSE))","v":""},{"$f":"IF($B119=\"\",\"\",VLOOKUP($B119,Data!$A$4:$T$727,5,FALSE))","v":""},{"$f":"IF($B119=\"\",\"\",VLOOKUP($B119,Data!$A$4:$T$727,7,FALSE))","v":""},"","","","",{"$f":"IF($I$15=\"Show\",VLOOKUP($B119,Data!$A$4:$T$727,9,FALSE),VLOOKUP($B119,Data!$A$4:$T$727,7,FALSE))","v":{"$error":"#N/A"}},{"$f":"IF($B119=\"\",\"\",VLOOKUP($B119,Data!$A$4:$T$727,6,FALSE))","v":""},"",{"$f":"IF($B119=\"\",\"\",IF(VLOOKUP($B119,Data!$A$4:$T$727,11,FALSE)<1,\"\",VLOOKUP(B119,Data!$A$4:$T$727,11,FALSE)))","v":""}]
[null,null,{"$f":"IF($B120=\"\",\"\",VLOOKUP($B120,Data!$A$4:$T$727,2,FALSE))","v":""},{"$f":"IF($B120=\"\",\"\",VLOOKUP($B120,Data!$A$4:$T$727,10,FALSE))","v":""},{"$f":"IF($B120=\"\",\"\",VLOOKUP($B120,Data!$A$4:$T$727,4,FALSE))","v":""},{"$f":"IF($B120=\"\",\"\",VLOOKUP($B120,Data!$A$4:$T$727,5,FALSE))","v":""},{"$f":"IF($B120=\"\",\"\",VLOOKUP($B120,Data!$A$4:$T$727,7,FALSE))","v":""},"","","","",{"$f":"IF($I$15=\"Show\",VLOOKUP($B120,Data!$A$4:$T$727,9,FALSE),VLOOKUP($B120,Data!$A$4:$T$727,7,FALSE))","v":{"$error":"#N/A"}},{"$f":"IF($B120=\"\",\"\",VLOOKUP($B120,Data!$A$4:$T$727,6,FALSE))","v":""},"",{"$f":"IF($B120=\"\",\"\",IF(VLOOKUP($B120,Data!$A$4:$T$727,11,FALSE)<1,\"\",VLOOKUP(B120,Data!$A$4:$T$727,11,FALSE)))","v":""}]
[null,null,{"$f":"IF($B121=\"\",\"\",VLOOKUP($B121,Data!$A$4:$T$727,2,FALSE))","v":""},{"$f":"IF($B121=\"\",\"\",VLOOKUP($B121,Data!$A$4:$T$727,10,FALSE))","v":""},{"$f":"IF($B121=\"\",\"\",VLOOKUP($B121,Data!$A$4:$T$727,4,FALSE))","v":""},{"$f":"IF($B121=\"\",\"\",VLOOKUP($B121,Data!$A$4:$T$727,5,FALSE))","v":""},{"$f":"IF($B121=\"\",\"\",VLOOKUP($B121,Data!$A$4:$T$727,7,FALSE))","v":""},"","","","",{"$f":"IF($I$15=\"Show\",VLOOKUP($B121,Data!$A$4:$T$727,9,FALSE),VLOOKUP($B121,Data!$A$4:$T$727,7,FALSE))","v":{"$error":"#N/A"}},{"$f":"IF($B121=\"\",\"\",VLOOKUP($B121,Data!$A$4:$T$727,6,FALSE))","v":""},"",{"$f":"IF($B121=\"\",\"\",IF(VLOOKUP($B121,Data!$A$4:$T$727,11,FALSE)<1,\"\",VLOOKUP(B121,Data!$A$4:$T$727,11,FALSE)))","v":""}]
[null,null,{"$f":"IF($B122=\"\",\"\",VLOOKUP($B122,Data!$A$4:$T$727,2,FALSE))","v":""},{"$f":"IF($B122=\"\",\"\",VLOOKUP($B122,Data!$A$4:$T$727,10,FALSE))","v":""},{"$f":"IF($B122=\"\",\"\",VLOOKUP($B122,Data!$A$4:$T$727,4,FALSE))","v":""},{"$f":"IF($B122=\"\",\"\",VLOOKUP($B122,Data!$A$4:$T$727,5,FALSE))","v":""},{"$f":"IF($B122=\"\",\"\",VLOOKUP($B122,Data!$A$4:$T$727,7,FALSE))","v":""},"","","","",{"$f":"IF($I$15=\"Show\",VLOOKUP($B122,Data!$A$4:$T$727,9,FALSE),VLOOKUP($B122,Data!$A$4:$T$727,7,FALSE))","v":{"$error":"#N/A"}},{"$f":"IF($B122=\"\",\"\",VLOOKUP($B122,Data!$A$4:$T$727,6,FALSE))","v":""},"",{"$f":"IF($B122=\"\",\"\",IF(VLOOKUP($B122,Data!$A$4:$T$727,11,FALSE)<1,\"\",VLOOKUP(B122,Data!$A$4:$T$727,11,FALSE)))","v":""}]
[null,null,{"$f":"IF($B123=\"\",\"\",VLOOKUP($B123,Data!$A$4:$T$727,2,FALSE))","v":""},{"$f":"IF($B123=\"\",\"\",VLOOKUP($B123,Data!$A$4:$T$727,10,FALSE))","v":""},{"$f":"IF($B123=\"\",\"\",VLOOKUP($B123,Data!$A$4:$T$727,4,FALSE))","v":""},{"$f":"IF($B123=\"\",\"\",VLOOKUP($B123,Data!$A$4:$T$727,5,FALSE))","v":""},{"$f":"IF($B123=\"\",\"\",VLOOKUP($B123,Data!$A$4:$T$727,7,FALSE))","v":""},"","","","",{"$f":"IF($I$15=\"Show\",VLOOKUP($B123,Data!$A$4:$T$727,9,FALSE),VLOOKUP($B123,Data!$A$4:$T$727,7,FALSE))","v":{"$error":"#N/A"}},{"$f":"IF($B123=\"\",\"\",VLOOKUP($B123,Data!$A$4:$T$727,6,FALSE))","v":""},"",{"$f":"IF($B123=\"\",\"\",IF(VLOOKUP($B123,Data!$A$4:$T$727,11,FALSE)<1,\"\",VLOOKUP(B123,Data!$A$4:$T$727,11,FALSE)))","v":""}]
[null,null,{"$f":"IF($B124=\"\",\"\",VLOOKUP($B124,Data!$A$4:$T$727,2,FALSE))","v":""},{"$f":"IF($B124=\"\",\"\",VLOOKUP($B124,Data!$A$4:$T$727,10,FALSE))","v":""},{"$f":"IF($B124=\"\",\"\",VLOOKUP($B124,Data!$A$4:$T$727,4,FALSE))","v":""},{"$f":"IF($B124=\"\",\"\",VLOOKUP($B124,Data!$A$4:$T$727,5,FALSE))","v":""},{"$f":"IF($B124=\"\",\"\",VLOOKUP($B124,Data!$A$4:$T$727,7,FALSE))","v":""},"","","","",{"$f":"IF($I$15=\"Show\",VLOOKUP($B124,Data!$A$4:$T$727,9,FALSE),VLOOKUP($B124,Data!$A$4:$T$727,7,FALSE))","v":{"$error":"#N/A"}},{"$f":"IF($B124=\"\",\"\",VLOOKUP($B124,Data!$A$4:$T$727,6,FALSE))","v":""},"",{"$f":"IF($B124=\"\",\"\",IF(VLOOKUP($B124,Data!$A$4:$T$727,11,FALSE)<1,\"\",VLOOKUP(B124,Data!$A$4:$T$727,11,FALSE)))","v":""}]
[null,null,{"$f":"IF($B125=\"\",\"\",VLOOKUP($B125,Data!$A$4:$T$727,2,FALSE))","v":""},{"$f":"IF($B125=\"\",\"\",VLOOKUP($B125,Data!$A$4:$T$727,10,FALSE))","v":""},{"$f":"IF($B125=\"\",\"\",VLOOKUP($B125,Data!$A$4:$T$727,4,FALSE))","v":""},{"$f":"IF($B125=\"\",\"\",VLOOKUP($B125,Data!$A$4:$T$727,5,FALSE))","v":""},{"$f":"IF($B125=\"\",\"\",VLOOKUP($B125,Data!$A$4:$T$727,7,FALSE))","v":""},"","","","",{"$f":"IF($I$15=\"Show\",VLOOKUP($B125,Data!$A$4:$T$727,9,FALSE),VLOOKUP($B125,Data!$A$4:$T$727,7,FALSE))","v":{"$error":"#N/A"}},{"$f":"IF($B125=\"\",\"\",VLOOKUP($B125,Data!$A$4:$T$727,6,FALSE))","v":""},"",{"$f":"IF($B125=\"\",\"\",IF(VLOOKUP($B125,Data!$A$4:$T$727,11,FALSE)<1,\"\",VLOOKUP(B125,Data!$A$4:$T$727,11,FALSE)))","v":""}]
[null,null,{"$f":"IF($B126=\"\",\"\",VLOOKUP($B126,Data!$A$4:$T$727,2,FALSE))","v":""},{"$f":"IF($B126=\"\",\"\",VLOOKUP($B126,Data!$A$4:$T$727,10,FALSE))","v":""},{"$f":"IF($B126=\"\",\"\",VLOOKUP($B126,Data!$A$4:$T$727,4,FALSE))","v":""},{"$f":"IF($B126=\"\",\"\",VLOOKUP($B126,Data!$A$4:$T$727,5,FALSE))","v":""},{"$f":"IF($B126=\"\",\"\",VLOOKUP($B126,Data!$A$4:$T$727,7,FALSE))","v":""},"","","","",{"$f":"IF($I$15=\"Show\",VLOOKUP($B126,Data!$A$4:$T$727,9,FALSE),VLOOKUP($B126,Data!$A$4:$T$727,7,FALSE))","v":{"$error":"#N/A"}},{"$f":"IF($B126=\"\",\"\",VLOOKUP($B126,Data!$A$4:$T$727,6,FALSE))","v":""},"",{"$f":"IF($B126=\"\",\"\",IF(VLOOKUP($B126,Data!$A$4:$T$727,11,FALSE)<1,\"\",VLOOKUP(B126,Data!$A$4:$T$727,11,FALSE)))","v":""}]
[null,null,{"$f":"IF($B127=\"\",\"\",VLOOKUP($B127,Data!$A$4:$T$727,2,FALSE))","v":""},{"$f":"IF($B127=\"\",\"\",VLOOKUP($B127,Data!$A$4:$T$727,10,FALSE))","v":""},{"$f":"IF($B127=\"\",\"\",VLOOKUP($B127,Data!$A$4:$T$727,4,FALSE))","v":""},{"$f":"IF($B127=\"\",\"\",VLOOKUP($B127,Data!$A$4:$T$727,5,FALSE))","v":""},{"$f":"IF($B127=\"\",\"\",VLOOKUP($B127,Data!$A$4:$T$727,7,FALSE))","v":""},"","","","",{"$f":"IF($I$15=\"Show\",VLOOKUP($B127,Data!$A$4:$T$727,9,FALSE),VLOOKUP($B127,Data!$A$4:$T$727,7,FALSE))","v":{"$error":"#N/A"}},{"$f":"IF($B127=\"\",\"\",VLOOKUP($B127,Data!$A$4:$T$727,6,FALSE))","v":""},"",{"$f":"IF($B127=\"\",\"\",IF(VLOOKUP($B127,Data!$A$4:$T$727,11,FALSE)<1,\"\",VLOOKUP(B127,Data!$A$4:$T$727,11,FALSE)))","v":""}]
[null,null,{"$f":"IF($B128=\"\",\"\",VLOOKUP($B128,Data!$A$4:$T$727,2,FALSE))","v":""},{"$f":"IF($B128=\"\",\"\",VLOOKUP($B128,Data!$A$4:$T$727,10,FALSE))","v":""},{"$f":"IF($B128=\"\",\"\",VLOOKUP($B128,Data!$A$4:$T$727,4,FALSE))","v":""},{"$f":"IF($B128=\"\",\"\",VLOOKUP($B128,Data!$A$4:$T$727,5,FALSE))","v":""},{"$f":"IF($B128=\"\",\"\",VLOOKUP($B128,Data!$A$4:$T$727,7,FALSE))","v":""},"","","","",{"$f":"IF($I$15=\"Show\",VLOOKUP($B128,Data!$A$4:$T$727,9,FALSE),VLOOKUP($B128,Data!$A$4:$T$727,7,FALSE))","v":{"$error":"#N/A"}},{"$f":"IF($B128=\"\",\"\",VLOOKUP($B128,Data!$A$4:$T$727,6,FALSE))","v":""},"",{"$f":"IF($B128=\"\",\"\",IF(VLOOKUP($B128,Data!$A$4:$T$727,11,FALSE)<1,\"\",VLOOKUP(B128,Data!$A$4:$T$727,11,FALSE)))","v":""}]
[null,null,{"$f":"IF($B129=\"\",\"\",VLOOKUP($B129,Data!$A$4:$T$727,2,FALSE))","v":""},{"$f":"IF($B129=\"\",\"\",VLOOKUP($B129,Data!$A$4:$T$727,10,FALSE))","v":""},{"$f":"IF($B129=\"\",\"\",VLOOKUP($B129,Data!$A$4:$T$727,4,FALSE))","v":""},{"$f":"IF($B129=\"\",\"\",VLOOKUP($B129,Data!$A$4:$T$727,5,FALSE))","v":""},{"$f":"IF($B129=\"\",\"\",VLOOKUP($B129,Data!$A$4:$T$727,7,FALSE))","v":""},"","","","",{"$f":"IF($I$15=\"Show\",VLOOKUP($B129,Data!$A$4:$T$727,9,FALSE),VLOOKUP($B129,Data!$A$4:$T$727,7,FALSE))","v":{"$error":"#N/A"}},{"$f":"IF($B129=\"\",\"\",VLOOKUP($B129,Data!$A$4:$T$727,6,FALSE))","v":""},"",{"$f":"IF($B129=\"\",\"\",IF(VLOOKUP($B129,Data!$A$4:$T$727,11,FALSE)<1,\"\",VLOOKUP(B129,Data!$A$4:$T$727,11,FALSE)))","v":""}]
[null,null,{"$f":"IF($B130=\"\",\"\",VLOOKUP($B130,Data!$A$4:$T$727,2,FALSE))","v":""},{"$f":"IF($B130=\"\",\"\",VLOOKUP($B130,Data!$A$4:$T$727,10,FALSE))","v":""},{"$f":"IF($B130=\"\",\"\",VLOOKUP($B130,Data!$A$4:$T$727,4,FALSE))","v":""},{"$f":"IF($B130=\"\",\"\",VLOOKUP($B130,Data!$A$4:$T$727,5,FALSE))","v":""},{"$f":"IF($B130=\"\",\"\",VLOOKUP($B130,Data!$A$4:$T$727,7,FALSE))","v":""},"","","","",{"$f":"IF($I$15=\"Show\",VLOOKUP($B130,Data!$A$4:$T$727,9,FALSE),VLOOKUP($B130,Data!$A$4:$T$727,7,FALSE))","v":{"$error":"#N/A"}},{"$f":"IF($B130=\"\",\"\",VLOOKUP($B130,Data!$A$4:$T$727,6,FALSE))","v":""},"",{"$f":"IF($B130=\"\",\"\",IF(VLOOKUP($B130,Data!$A$4:$T$727,11,FALSE)<1,\"\",VLOOKUP(B130,Data!$A$4:$T$727,11,FALSE)))","v":""}]
[null,null,{"$f":"IF($B131=\"\",\"\",VLOOKUP($B131,Data!$A$4:$T$727,2,FALSE))","v":""},{"$f":"IF($B131=\"\",\"\",VLOOKUP($B131,Data!$A$4:$T$727,10,FALSE))","v":""},{"$f":"IF($B131=\"\",\"\",VLOOKUP($B131,Data!$A$4:$T$727,4,FALSE))","v":""},{"$f":"IF($B131=\"\",\"\",VLOOKUP($B131,Data!$A$4:$T$727,5,FALSE))","v":""},{"$f":"IF($B131=\"\",\"\",VLOOKUP($B131,Data!$A$4:$T$727,7,FALSE))","v":""},"","","","",{"$f":"IF($I$15=\"Show\",VLOOKUP($B131,Data!$A$4:$T$727,9,FALSE),VLOOKUP($B131,Data!$A$4:$T$727,7,FALSE))","v":{"$error":"#N/A"}},{"$f":"IF($B131=\"\",\"\",VLOOKUP($B131,Data!$A$4:$T$727,6,FALSE))","v":""},"",{"$f":"IF($B131=\"\",\"\",IF(VLOOKUP($B131,Data!$A$4:$T$727,11,FALSE)<1,\"\",VLOOKUP(B131,Data!$A$4:$T$727,11,FALSE)))","v":""}]
[null,null,{"$f":"IF($B132=\"\",\"\",VLOOKUP($B132,Data!$A$4:$T$727,2,FALSE))","v":""},{"$f":"IF($B132=\"\",\"\",VLOOKUP($B132,Data!$A$4:$T$727,10,FALSE))","v":""},{"$f":"IF($B132=\"\",\"\",VLOOKUP($B132,Data!$A$4:$T$727,4,FALSE))","v":""},{"$f":"IF($B132=\"\",\"\",VLOOKUP($B132,Data!$A$4:$T$727,5,FALSE))","v":""},{"$f":"IF($B132=\"\",\"\",VLOOKUP($B132,Data!$A$4:$T$727,7,FALSE))","v":""},"","","","",{"$f":"IF($I$15=\"Show\",VLOOKUP($B132,Data!$A$4:$T$727,9,FALSE),VLOOKUP($B132,Data!$A$4:$T$727,7,FALSE))","v":{"$error":"#N/A"}},{"$f":"IF($B132=\"\",\"\",VLOOKUP($B132,Data!$A$4:$T$727,6,FALSE))","v":""},"",{"$f":"IF($B132=\"\",\"\",IF(VLOOKUP($B132,Data!$A$4:$T$727,11,FALSE)<1,\"\",VLOOKUP(B132,Data!$A$4:$T$727,11,FALSE)))","v":""}]
[null,null,{"$f":"IF($B133=\"\",\"\",VLOOKUP($B133,Data!$A$4:$T$727,2,FALSE))","v":""},{"$f":"IF($B133=\"\",\"\",VLOOKUP($B133,Data!$A$4:$T$727,10,FALSE))","v":""},{"$f":"IF($B133=\"\",\"\",VLOOKUP($B133,Data!$A$4:$T$727,4,FALSE))","v":""},{"$f":"IF($B133=\"\",\"\",VLOOKUP($B133,Data!$A$4:$T$727,5,FALSE))","v":""},{"$f":"IF($B133=\"\",\"\",VLOOKUP($B133,Data!$A$4:$T$727,7,FALSE))","v":""},"","","","",{"$f":"IF($I$15=\"Show\",VLOOKUP($B133,Data!$A$4:$T$727,9,FALSE),VLOOKUP($B133,Data!$A$4:$T$727,7,FALSE))","v":{"$error":"#N/A"}},{"$f":"IF($B133=\"\",\"\",VLOOKUP($B133,Data!$A$4:$T$727,6,FALSE))","v":""},"",{"$f":"IF($B133=\"\",\"\",IF(VLOOKUP($B133,Data!$A$4:$T$727,11,FALSE)<1,\"\",VLOOKUP(B133,Data!$A$4:$T$727,11,FALSE)))","v":""}]
[null,null,{"$f":"IF($B134=\"\",\"\",VLOOKUP($B134,Data!$A$4:$T$727,2,FALSE))","v":""},{"$f":"IF($B134=\"\",\"\",VLOOKUP($B134,Data!$A$4:$T$727,10,FALSE))","v":""},{"$f":"IF($B134=\"\",\"\",VLOOKUP($B134,Data!$A$4:$T$727,4,FALSE))","v":""},{"$f":"IF($B134=\"\",\"\",VLOOKUP($B134,Data!$A$4:$T$727,5,FALSE))","v":""},{"$f":"IF($B134=\"\",\"\",VLOOKUP($B134,Data!$A$4:$T$727,7,FALSE))","v":""},"","","","",{"$f":"IF($I$15=\"Show\",VLOOKUP($B134,Data!$A$4:$T$727,9,FALSE),VLOOKUP($B134,Data!$A$4:$T$727,7,FALSE))","v":{"$error":"#N/A"}},{"$f":"IF($B134=\"\",\"\",VLOOKUP($B134,Data!$A$4:$T$727,6,FALSE))","v":""},"",{"$f":"IF($B134=\"\",\"\",IF(VLOOKUP($B134,Data!$A$4:$T$727,11,FALSE)<1,\"\",VLOOKUP(B134,Data!$A$4:$T$727,11,FALSE)))","v":""}]
[null,null,{"$f":"IF($B135=\"\",\"\",VLOOKUP($B135,Data!$A$4:$T$727,2,FALSE))","v":""},{"$f":"IF($B135=\"\",\"\",VLOOKUP($B135,Data!$A$4:$T$727,10,FALSE))","v":""},{"$f":"IF($B135=\"\",\"\",VLOOKUP($B135,Data!$A$4:$T$727,4,FALSE))","v":""},{"$f":"IF($B135=\"\",\"\",VLOOKUP($B135,Data!$A$4:$T$727,5,FALSE))","v":""},{"$f":"IF($B135=\"\",\"\",VLOOKUP($B135,Data!$A$4:$T$727,7,FALSE))","v":""},"","","","",{"$f":"IF($I$15=\"Show\",VLOOKUP($B135,Data!$A$4:$T$727,9,FALSE),VLOOKUP($B135,Data!$A$4:$T$727,7,FALSE))","v":{"$error":"#N/A"}},{"$f":"IF($B135=\"\",\"\",VLOOKUP($B135,Data!$A$4:$T$727,6,FALSE))","v":""},"",{"$f":"IF($B135=\"\",\"\",IF(VLOOKUP($B135,Data!$A$4:$T$727,11,FALSE)<1,\"\",VLOOKUP(B135,Data!$A$4:$T$727,11,FALSE)))","v":""}]
[null,null,{"$f":"IF($B136=\"\",\"\",VLOOKUP($B136,Data!$A$4:$T$727,2,FALSE))","v":""},{"$f":"IF($B136=\"\",\"\",VLOOKUP($B136,Data!$A$4:$T$727,10,FALSE))","v":""},{"$f":"IF($B136=\"\",\"\",VLOOKUP($B136,Data!$A$4:$T$727,4,FALSE))","v":""},{"$f":"IF($B136=\"\",\"\",VLOOKUP($B136,Data!$A$4:$T$727,5,FALSE))","v":""},{"$f":"IF($B136=\"\",\"\",VLOOKUP($B136,Data!$A$4:$T$727,7,FALSE))","v":""},"","","","",{"$f":"IF($I$15=\"Show\",VLOOKUP($B136,Data!$A$4:$T$727,9,FALSE),VLOOKUP($B136,Data!$A$4:$T$727,7,FALSE))","v":{"$error":"#N/A"}},{"$f":"IF($B136=\"\",\"\",VLOOKUP($B136,Data!$A$4:$T$727,6,FALSE))","v":""},"",{"$f":"IF($B136=\"\",\"\",IF(VLOOKUP($B136,Data!$A$4:$T$727,11,FALSE)<1,\"\",VLOOKUP(B136,Data!$A$4:$T$727,11,FALSE)))","v":""}]
[null,null,{"$f":"IF($B137=\"\",\"\",VLOOKUP($B137,Data!$A$4:$T$727,2,FALSE))","v":""},{"$f":"IF($B137=\"\",\"\",VLOOKUP($B137,Data!$A$4:$T$727,10,FALSE))","v":""},{"$f":"IF($B137=\"\",\"\",VLOOKUP($B137,Data!$A$4:$T$727,4,FALSE))","v":""},{"$f":"IF($B137=\"\",\"\",VLOOKUP($B137,Data!$A$4:$T$727,5,FALSE))","v":""},{"$f":"IF($B137=\"\",\"\",VLOOKUP($B137,Data!$A$4:$T$727,7,FALSE))","v":""},"","","","",{"$f":"IF($I$15=\"Show\",VLOOKUP($B137,Data!$A$4:$T$727,9,FALSE),VLOOKUP($B137,Data!$A$4:$T$727,7,FALSE))","v":{"$error":"#N/A"}},{"$f":"IF($B137=\"\",\"\",VLOOKUP($B137,Data!$A$4:$T$727,6,FALSE))","v":""},"",{"$f":"IF($B137=\"\",\"\",IF(VLOOKUP($B137,Data!$A$4:$T$727,11,FALSE)<1,\"\",VLOOKUP(B137,Data!$A$4:$T$727,11,FALSE)))","v":""}]
[null,null,{"$f":"IF($B138=\"\",\"\",VLOOKUP($B138,Data!$A$4:$T$727,2,FALSE))","v":""},{"$f":"IF($B138=\"\",\"\",VLOOKUP($B138,Data!$A$4:$T$727,10,FALSE))","v":""},{"$f":"IF($B138=\"\",\"\",VLOOKUP($B138,Data!$A$4:$T$727,4,FALSE))","v":""},{"$f":"IF($B138=\"\",\"\",VLOOKUP($B138,Data!$A$4:$T$727,5,FALSE))","v":""},{"$f":"IF($B138=\"\",\"\",VLOOKUP($B138,Data!$A$4:$T$727,7,FALSE))","v":""},"","","","",{"$f":"IF($I$15=\"Show\",VLOOKUP($B138,Data!$A$4:$T$727,9,FALSE),VLOOKUP($B138,Data!$A$4:$T$727,7,FALSE))","v":{"$error":"#N/A"}},{"$f":"IF($B138=\"\",\"\",VLOOKUP($B138,Data!$A$4:$T$727,6,FALSE))","v":""},"",{"$f":"IF($B138=\"\",\"\",IF(VLOOKUP($B138,Data!$A$4:$T$727,11,FALSE)<1,\"\",VLOOKUP(B138,Data!$A$4:$T$727,11,FALSE)))","v":""}]
[null,null,{"$f":"IF($B139=\"\",\"\",VLOOKUP($B139,Data!$A$4:$T$727,2,FALSE))","v":""},{"$f":"IF($B139=\"\",\"\",VLOOKUP($B139,Data!$A$4:$T$727,10,FALSE))","v":""},{"$f":"IF($B139=\"\",\"\",VLOOKUP($B139,Data!$A$4:$T$727,4,FALSE))","v":""},{"$f":"IF($B139=\"\",\"\",VLOOKUP($B139,Data!$A$4:$T$727,5,FALSE))","v":""},{"$f":"IF($B139=\"\",\"\",VLOOKUP($B139,Data!$A$4:$T$727,7,FALSE))","v":""},"","","","",{"$f":"IF($I$15=\"Show\",VLOOKUP($B139,Data!$A$4:$T$727,9,FALSE),VLOOKUP($B139,Data!$A$4:$T$727,7,FALSE))","v":{"$error":"#N/A"}},{"$f":"IF($B139=\"\",\"\",VLOOKUP($B139,Data!$A$4:$T$727,6,FALSE))","v":""},"",{"$f":"IF($B139=\"\",\"\",IF(VLOOKUP($B139,Data!$A$4:$T$727,11,FALSE)<1,\"\",VLOOKUP(B139,Data!$A$4:$T$727,11,FALSE)))","v":""}]
[null,null,{"$f":"IF($B140=\"\",\"\",VLOOKUP($B140,Data!$A$4:$T$727,2,FALSE))","v":""},{"$f":"IF($B140=\"\",\"\",VLOOKUP($B140,Data!$A$4:$T$727,10,FALSE))","v":""},{"$f":"IF($B140=\"\",\"\",VLOOKUP($B140,Data!$A$4:$T$727,4,FALSE))","v":""},{"$f":"IF($B140=\"\",\"\",VLOOKUP($B140,Data!$A$4:$T$727,5,FALSE))","v":""},{"$f":"IF($B140=\"\",\"\",VLOOKUP($B140,Data!$A$4:$T$727,7,FALSE))","v":""},"","","","",{"$f":"IF($I$15=\"Show\",VLOOKUP($B140,Data!$A$4:$T$727,9,FALSE),VLOOKUP($B140,Data!$A$4:$T$727,7,FALSE))","v":{"$error":"#N/A"}},{"$f":"IF($B140=\"\",\"\",VLOOKUP($B140,Data!$A$4:$T$727,6,FALSE))","v":""},"",{"$f":"IF($B140=\"\",\"\",IF(VLOOKUP($B140,Data!$A$4:$T$727,11,FALSE)<1,\"\",VLOOKUP(B140,Data!$A$4:$T$727,11,FALSE)))","v":""}]
[null,null,{"$f":"IF($B141=\"\",\"\",VLOOKUP($B141,Data!$A$4:$T$727,2,FALSE))","v":""},{"$f":"IF($B141=\"\",\"\",VLOOKUP($B141,Data!$A$4:$T$727,10,FALSE))","v":""},{"$f":"IF($B141=\"\",\"\",VLOOKUP($B141,Data!$A$4:$T$727,4,FALSE))","v":""},{"$f":"IF($B141=\"\",\"\",VLOOKUP($B141,Data!$A$4:$T$727,5,FALSE))","v":""},{"$f":"IF($B141=\"\",\"\",VLOOKUP($B141,Data!$A$4:$T$727,7,FALSE))","v":""},"","","","",{"$f":"IF($I$15=\"Show\",VLOOKUP($B141,Data!$A$4:$T$727,9,FALSE),VLOOKUP($B141,Data!$A$4:$T$727,7,FALSE))","v":{"$error":"#N/A"}},{"$f":"IF($B141=\"\",\"\",VLOOKUP($B141,Data!$A$4:$T$727,6,FALSE))","v":""},"",{"$f":"IF($B141=\"\",\"\",IF(VLOOKUP($B141,Data!$A$4:$T$727,11,FALSE)<1,\"\",VLOOKUP(B141,Data!$A$4:$T$727,11,FALSE)))","v":""}]
[null,null,{"$f":"IF($B142=\"\",\"\",VLOOKUP($B142,Data!$A$4:$T$727,2,FALSE))","v":""},{"$f":"IF($B142=\"\",\"\",VLOOKUP($B142,Data!$A$4:$T$727,10,FALSE))","v":""},{"$f":"IF($B142=\"\",\"\",VLOOKUP($B142,Data!$A$4:$T$727,4,FALSE))","v":""},{"$f":"IF($B142=\"\",\"\",VLOOKUP($B142,Data!$A$4:$T$727,5,FALSE))","v":""},{"$f":"IF($B142=\"\",\"\",VLOOKUP($B142,Data!$A$4:$T$727,7,FALSE))","v":""},"","","","",{"$f":"IF($I$15=\"Show\",VLOOKUP($B142,Data!$A$4:$T$727,9,FALSE),VLOOKUP($B142,Data!$A$4:$T$727,7,FALSE))","v":{"$error":"#N/A"}},{"$f":"IF($B142=\"\",\"\",VLOOKUP($B142,Data!$A$4:$T$727,6,FALSE))","v":""},"",{"$f":"IF($B142=\"\",\"\",IF(VLOOKUP($B142,Data!$A$4:$T$727,11,FALSE)<1,\"\",VLOOKUP(B142,Data!$A$4:$T$727,11,FALSE)))","v":""}]
[null,null,{"$f":"IF($B143=\"\",\"\",VLOOKUP($B143,Data!$A$4:$T$727,2,FALSE))","v":""},{"$f":"IF($B143=\"\",\"\",VLOOKUP($B143,Data!$A$4:$T$727,10,FALSE))","v":""},{"$f":"IF($B143=\"\",\"\",VLOOKUP($B143,Data!$A$4:$T$727,4,FALSE))","v":""},{"$f":"IF($B143=\"\",\"\",VLOOKUP($B143,Data!$A$4:$T$727,5,FALSE))","v":""},{"$f":"IF($B143=\"\",\"\",VLOOKUP($B143,Data!$A$4:$T$727,7,FALSE))","v":""},"","","","",{"$f":"IF($I$15=\"Show\",VLOOKUP($B143,Data!$A$4:$T$727,9,FALSE),VLOOKUP($B143,Data!$A$4:$T$727,7,FALSE))","v":{"$error":"#N/A"}},{"$f":"IF($B143=\"\",\"\",VLOOKUP($B143,Data!$A$4:$T$727,6,FALSE))","v":""},"",{"$f":"IF($B143=\"\",\"\",IF(VLOOKUP($B143,Data!$A$4:$T$727,11,FALSE)<1,\"\",VLOOKUP(B143,Data!$A$4:$T$727,11,FALSE)))","v":""}]
[null,null,{"$f":"IF($B144=\"\",\"\",VLOOKUP($B144,Data!$A$4:$T$727,2,FALSE))","v":""},{"$f":"IF($B144=\"\",\"\",VLOOKUP($B144,Data!$A$4:$T$727,10,FALSE))","v":""},{"$f":"IF($B144=\"\",\"\",VLOOKUP($B144,Data!$A$4:$T$727,4,FALSE))","v":""},{"$f":"IF($B144=\"\",\"\",VLOOKUP($B144,Data!$A$4:$T$727,5,FALSE))","v":""},{"$f":"IF($B144=\"\",\"\",VLOOKUP($B144,Data!$A$4:$T$727,7,FALSE))","v":""},"","","","",{"$f":"IF($I$15=\"Show\",VLOOKUP($B144,Data!$A$4:$T$727,9,FALSE),VLOOKUP($B144,Data!$A$4:$T$727,7,FALSE))","v":{"$error":"#N/A"}},{"$f":"IF($B144=\"\",\"\",VLOOKUP($B144,Data!$A$4:$T$727,6,FALSE))","v":""},"",{"$f":"IF($B144=\"\",\"\",IF(VLOOKUP($B144,Data!$A$4:$T$727,11,FALSE)<1,\"\",VLOOKUP(B144,Data!$A$4:$T$727,11,FALSE)))","v":""}]
[null,null,{"$f":"IF($B145=\"\",\"\",VLOOKUP($B145,Data!$A$4:$T$727,2,FALSE))","v":""},{"$f":"IF($B145=\"\",\"\",VLOOKUP($B145,Data!$A$4:$T$727,10,FALSE))","v":""},{"$f":"IF($B145=\"\",\"\",VLOOKUP($B145,Data!$A$4:$T$727,4,FALSE))","v":""},{"$f":"IF($B145=\"\",\"\",VLOOKUP($B145,Data!$A$4:$T$727,5,FALSE))","v":""},{"$f":"IF($B145=\"\",\"\",VLOOKUP($B145,Data!$A$4:$T$727,7,FALSE))","v":""},"","","","",{"$f":"IF($I$15=\"Show\",VLOOKUP($B145,Data!$A$4:$T$727,9,FALSE),VLOOKUP($B145,Data!$A$4:$T$727,7,FALSE))","v":{"$error":"#N/A"}},{"$f":"IF($B145=\"\",\"\",VLOOKUP($B145,Data!$A$4:$T$727,6,FALSE))","v":""},"",{"$f":"IF($B145=\"\",\"\",IF(VLOOKUP($B145,Data!$A$4:$T$727,11,FALSE)<1,\"\",VLOOKUP(B145,Data!$A$4:$T$727,11,FALSE)))","v":""}]
[null,null,{"$f":"IF($B146=\"\",\"\",VLOOKUP($B146,Data!$A$4:$T$727,2,FALSE))","v":""},{"$f":"IF($B146=\"\",\"\",VLOOKUP($B146,Data!$A$4:$T$727,10,FALSE))","v":""},{"$f":"IF($B146=\"\",\"\",VLOOKUP($B146,Data!$A$4:$T$727,4,FALSE))","v":""},{"$f":"IF($B146=\"\",\"\",VLOOKUP($B146,Data!$A$4:$T$727,5,FALSE))","v":""},{"$f":"IF($B146=\"\",\"\",VLOOKUP($B146,Data!$A$4:$T$727,7,FALSE))","v":""},"","","","",{"$f":"IF($I$15=\"Show\",VLOOKUP($B146,Data!$A$4:$T$727,9,FALSE),VLOOKUP($B146,Data!$A$4:$T$727,7,FALSE))","v":{"$error":"#N/A"}},{"$f":"IF($B146=\"\",\"\",VLOOKUP($B146,Data!$A$4:$T$727,6,FALSE))","v":""},"",{"$f":"IF($B146=\"\",\"\",IF(VLOOKUP($B146,Data!$A$4:$T$727,11,FALSE)<1,\"\",VLOOKUP(B146,Data!$A$4:$T$727,11,FALSE)))","v":""}]
[null,null,{"$f":"IF($B147=\"\",\"\",VLOOKUP($B147,Data!$A$4:$T$727,2,FALSE))","v":""},{"$f":"IF($B147=\"\",\"\",VLOOKUP($B147,Data!$A$4:$T$727,10,FALSE))","v":""},{"$f":"IF($B147=\"\",\"\",VLOOKUP($B147,Data!$A$4:$T$727,4,FALSE))","v":""},{"$f":"IF($B147=\"\",\"\",VLOOKUP($B147,Data!$A$4:$T$727,5,FALSE))","v":""},{"$f":"IF($B147=\"\",\"\",VLOOKUP($B147,Data!$A$4:$T$727,7,FALSE))","v":""},"","","","",{"$f":"IF($I$15=\"Show\",VLOOKUP($B147,Data!$A$4:$T$727,9,FALSE),VLOOKUP($B147,Data!$A$4:$T$727,7,FALSE))","v":{"$error":"#N/A"}},{"$f":"IF($B147=\"\",\"\",VLOOKUP($B147,Data!$A$4:$T$727,6,FALSE))","v":""},"",{"$f":"IF($B147=\"\",\"\",IF(VLOOKUP($B147,Data!$A$4:$T$727,11,FALSE)<1,\"\",VLOOKUP(B147,Data!$A$4:$T$727,11,FALSE)))","v":""}]
[null,null,{"$f":"IF($B148=\"\",\"\",VLOOKUP($B148,Data!$A$4:$T$727,2,FALSE))","v":""},{"$f":"IF($B148=\"\",\"\",VLOOKUP($B148,Data!$A$4:$T$727,10,FALSE))","v":""},{"$f":"IF($B148=\"\",\"\",VLOOKUP($B148,Data!$A$4:$T$727,4,FALSE))","v":""},{"$f":"IF($B148=\"\",\"\",VLOOKUP($B148,Data!$A$4:$T$727,5,FALSE))","v":""},{"$f":"IF($B148=\"\",\"\",VLOOKUP($B148,Data!$A$4:$T$727,7,FALSE))","v":""},"","","","",{"$f":"IF($I$15=\"Show\",VLOOKUP($B148,Data!$A$4:$T$727,9,FALSE),VLOOKUP($B148,Data!$A$4:$T$727,7,FALSE))","v":{"$error":"#N/A"}},{"$f":"IF($B148=\"\",\"\",VLOOKUP($B148,Data!$A$4:$T$727,6,FALSE))","v":""},"",{"$f":"IF($B148=\"\",\"\",IF(VLOOKUP($B148,Data!$A$4:$T$727,11,FALSE)<1,\"\",VLOOKUP(B148,Data!$A$4:$T$727,11,FALSE)))","v":""}]
[null,null,{"$f":"IF($B149=\"\",\"\",VLOOKUP($B149,Data!$A$4:$T$727,2,FALSE))","v":""},{"$f":"IF($B149=\"\",\"\",VLOOKUP($B149,Data!$A$4:$T$727,10,FALSE))","v":""},{"$f":"IF($B149=\"\",\"\",VLOOKUP($B149,Data!$A$4:$T$727,4,FALSE))","v":""},{"$f":"IF($B149=\"\",\"\",VLOOKUP($B149,Data!$A$4:$T$727,5,FALSE))","v":""},{"$f":"IF($B149=\"\",\"\",VLOOKUP($B149,Data!$A$4:$T$727,7,FALSE))","v":""},"","","","",{"$f":"IF($I$15=\"Show\",VLOOKUP($B149,Data!$A$4:$T$727,9,FALSE),VLOOKUP($B149,Data!$A$4:$T$727,7,FALSE))","v":{"$error":"#N/A"}},{"$f":"IF($B149=\"\",\"\",VLOOKUP($B149,Data!$A$4:$T$727,6,FALSE))","v":""},"",{"$f":"IF($B149=\"\",\"\",IF(VLOOKUP($B149,Data!$A$4:$T$727,11,FALSE)<1,\"\",VLOOKUP(B149,Data!$A$4:$T$727,11,FALSE)))","v":""}]
[null,null,{"$f":"IF($B150=\"\",\"\",VLOOKUP($B150,Data!$A$4:$T$727,2,FALSE))","v":""},{"$f":"IF($B150=\"\",\"\",VLOOKUP($B150,Data!$A$4:$T$727,10,FALSE))","v":""},{"$f":"IF($B150=\"\",\"\",VLOOKUP($B150,Data!$A$4:$T$727,4,FALSE))","v":""},{"$f":"IF($B150=\"\",\"\",VLOOKUP($B150,Data!$A$4:$T$727,5,FALSE))","v":""},{"$f":"IF($B150=\"\",\"\",VLOOKUP($B150,Data!$A$4:$T$727,7,FALSE))","v":""},{"$f":"IF($B150=\"\",\"\",IF($K$15=\"\",\"\",ROUND($G150*(1-($K$15*0.01)),2)))","v":""},{"$f":"IF($B150=\"\",\"\",IF($G150=$L150,\"\",L150))","v":""},{"$f":"IF($B150=\"\",\"\",IF($H150<$L150,$H150,$L150))","v":""},{"$f":"IF(A150=\"\",\"\",J150*A150)","v":""},{"$f":"IF($I$15=\"Show\",VLOOKUP($B150,Data!$A$4:$T$727,9,FALSE),VLOOKUP($B150,Data!$A$4:$T$727,7,FALSE))","v":{"$error":"#N/A"}},{"$f":"IF($B150=\"\",\"\",VLOOKUP($B150,Data!$A$4:$T$727,6,FALSE))","v":""},{"$f":"IF($A150=\"\",\"\",$A150/$M150)","v":""},{"$f":"IF($B150=\"\",\"\",IF(VLOOKUP($B150,Data!$A$4:$T$727,11,FALSE)<1,\"\",VLOOKUP(B150,Data!$A$4:$T$727,11,FALSE)))","v":""}]
[null,null,{"$f":"IF($B151=\"\",\"\",VLOOKUP($B151,Data!$A$4:$T$727,2,FALSE))","v":""},{"$f":"IF($B151=\"\",\"\",VLOOKUP($B151,Data!$A$4:$T$727,10,FALSE))","v":""},{"$f":"IF($B151=\"\",\"\",VLOOKUP($B151,Data!$A$4:$T$727,4,FALSE))","v":""},{"$f":"IF($B151=\"\",\"\",VLOOKUP($B151,Data!$A$4:$T$727,5,FALSE))","v":""},{"$f":"IF($B151=\"\",\"\",VLOOKUP($B151,Data!$A$4:$T$727,7,FALSE))","v":""},"","","","",{"$f":"IF($I$15=\"Show\",VLOOKUP($B151,Data!$A$4:$T$727,9,FALSE),VLOOKUP($B151,Data!$A$4:$T$727,7,FALSE))","v":{"$error":"#N/A"}},{"$f":"IF($B151=\"\",\"\",VLOOKUP($B151,Data!$A$4:$T$727,6,FALSE))","v":""},"",{"$f":"IF($B151=\"\",\"\",IF(VLOOKUP($B151,Data!$A$4:$T$727,11,FALSE)<1,\"\",VLOOKUP(B151,Data!$A$4:$T$727,11,FALSE)))","v":""}]
[null,null,{"$f":"IF($B152=\"\",\"\",VLOOKUP($B152,Data!$A$4:$T$727,2,FALSE))","v":""},{"$f":"IF($B152=\"\",\"\",VLOOKUP($B152,Data!$A$4:$T$727,10,FALSE))","v":""},{"$f":"IF($B152=\"\",\"\",VLOOKUP($B152,Data!$A$4:$T$727,4,FALSE))","v":""},{"$f":"IF($B152=\"\",\"\",VLOOKUP($B152,Data!$A$4:$T$727,5,FALSE))","v":""},{"$f":"IF($B152=\"\",\"\",VLOOKUP($B152,Data!$A$4:$T$727,7,FALSE))","v":""},"","","","",{"$f":"IF($I$15=\"Show\",VLOOKUP($B152,Data!$A$4:$T$727,9,FALSE),VLOOKUP($B152,Data!$A$4:$T$727,7,FALSE))","v":{"$error":"#N/A"}},{"$f":"IF($B152=\"\",\"\",VLOOKUP($B152,Data!$A$4:$T$727,6,FALSE))","v":""},"",{"$f":"IF($B152=\"\",\"\",IF(VLOOKUP($B152,Data!$A$4:$T$727,11,FALSE)<1,\"\",VLOOKUP(B152,Data!$A$4:$T$727,11,FALSE)))","v":""}]
[null,null,{"$f":"IF($B153=\"\",\"\",VLOOKUP($B153,Data!$A$4:$T$727,2,FALSE))","v":""},{"$f":"IF($B153=\"\",\"\",VLOOKUP($B153,Data!$A$4:$T$727,10,FALSE))","v":""},{"$f":"IF($B153=\"\",\"\",VLOOKUP($B153,Data!$A$4:$T$727,4,FALSE))","v":""},{"$f":"IF($B153=\"\",\"\",VLOOKUP($B153,Data!$A$4:$T$727,5,FALSE))","v":""},{"$f":"IF($B153=\"\",\"\",VLOOKUP($B153,Data!$A$4:$T$727,7,FALSE))","v":""},"","","","",{"$f":"IF($I$15=\"Show\",VLOOKUP($B153,Data!$A$4:$T$727,9,FALSE),VLOOKUP($B153,Data!$A$4:$T$727,7,FALSE))","v":{"$error":"#N/A"}},{"$f":"IF($B153=\"\",\"\",VLOOKUP($B153,Data!$A$4:$T$727,6,FALSE))","v":""},"",{"$f":"IF($B153=\"\",\"\",IF(VLOOKUP($B153,Data!$A$4:$T$727,11,FALSE)<1,\"\",VLOOKUP(B153,Data!$A$4:$T$727,11,FALSE)))","v":""}]
[null,null,{"$f":"IF($B154=\"\",\"\",VLOOKUP($B154,Data!$A$4:$T$727,2,FALSE))","v":""},{"$f":"IF($B154=\"\",\"\",VLOOKUP($B154,Data!$A$4:$T$727,10,FALSE))","v":""},{"$f":"IF($B154=\"\",\"\",VLOOKUP($B154,Data!$A$4:$T$727,4,FALSE))","v":""},{"$f":"IF($B154=\"\",\"\",VLOOKUP($B154,Data!$A$4:$T$727,5,FALSE))","v":""},{"$f":"IF($B154=\"\",\"\",VLOOKUP($B154,Data!$A$4:$T$727,7,FALSE))","v":""},"","","","",{"$f":"IF($I$15=\"Show\",VLOOKUP($B154,Data!$A$4:$T$727,9,FALSE),VLOOKUP($B154,Data!$A$4:$T$727,7,FALSE))","v":{"$error":"#N/A"}},{"$f":"IF($B154=\"\",\"\",VLOOKUP($B154,Data!$A$4:$T$727,6,FALSE))","v":""},"",{"$f":"IF($B154=\"\",\"\",IF(VLOOKUP($B154,Data!$A$4:$T$727,11,FALSE)<1,\"\",VLOOKUP(B154,Data!$A$4:$T$727,11,FALSE)))","v":""}]
[null,null,{"$f":"IF($B155=\"\",\"\",VLOOKUP($B155,Data!$A$4:$T$727,2,FALSE))","v":""},{"$f":"IF($B155=\"\",\"\",VLOOKUP($B155,Data!$A$4:$T$727,10,FALSE))","v":""},{"$f":"IF($B155=\"\",\"\",VLOOKUP($B155,Data!$A$4:$T$727,4,FALSE))","v":""},{"$f":"IF($B155=\"\",\"\",VLOOKUP($B155,Data!$A$4:$T$727,5,FALSE))","v":""},{"$f":"IF($B155=\"\",\"\",VLOOKUP($B155,Data!$A$4:$T$727,7,FALSE))","v":""},"","","","",{"$f":"IF($I$15=\"Show\",VLOOKUP($B155,Data!$A$4:$T$727,9,FALSE),VLOOKUP($B155,Data!$A$4:$T$727,7,FALSE))","v":{"$error":"#N/A"}},{"$f":"IF($B155=\"\",\"\",VLOOKUP($B155,Data!$A$4:$T$727,6,FALSE))","v":""},"",{"$f":"IF($B155=\"\",\"\",IF(VLOOKUP($B155,Data!$A$4:$T$727,11,FALSE)<1,\"\",VLOOKUP(B155,Data!$A$4:$T$727,11,FALSE)))","v":""}]
[null,null,{"$f":"IF($B156=\"\",\"\",VLOOKUP($B156,Data!$A$4:$T$727,2,FALSE))","v":""},{"$f":"IF($B156=\"\",\"\",VLOOKUP($B156,Data!$A$4:$T$727,10,FALSE))","v":""},{"$f":"IF($B156=\"\",\"\",VLOOKUP($B156,Data!$A$4:$T$727,4,FALSE))","v":""},{"$f":"IF($B156=\"\",\"\",VLOOKUP($B156,Data!$A$4:$T$727,5,FALSE))","v":""},{"$f":"IF($B156=\"\",\"\",VLOOKUP($B156,Data!$A$4:$T$727,7,FALSE))","v":""},"","","","",{"$f":"IF($I$15=\"Show\",VLOOKUP($B156,Data!$A$4:$T$727,9,FALSE),VLOOKUP($B156,Data!$A$4:$T$727,7,FALSE))","v":{"$error":"#N/A"}},{"$f":"IF($B156=\"\",\"\",VLOOKUP($B156,Data!$A$4:$T$727,6,FALSE))","v":""},"",{"$f":"IF($B156=\"\",\"\",IF(VLOOKUP($B156,Data!$A$4:$T$727,11,FALSE)<1,\"\",VLOOKUP(B156,Data!$A$4:$T$727,11,FALSE)))","v":""}]
[null,null,{"$f":"IF($B157=\"\",\"\",VLOOKUP($B157,Data!$A$4:$T$727,2,FALSE))","v":""},{"$f":"IF($B157=\"\",\"\",VLOOKUP($B157,Data!$A$4:$T$727,10,FALSE))","v":""},{"$f":"IF($B157=\"\",\"\",VLOOKUP($B157,Data!$A$4:$T$727,4,FALSE))","v":""},{"$f":"IF($B157=\"\",\"\",VLOOKUP($B157,Data!$A$4:$T$727,5,FALSE))","v":""},{"$f":"IF($B157=\"\",\"\",VLOOKUP($B157,Data!$A$4:$T$727,7,FALSE))","v":""},"","","","",{"$f":"IF($I$15=\"Show\",VLOOKUP($B157,Data!$A$4:$T$727,9,FALSE),VLOOKUP($B157,Data!$A$4:$T$727,7,FALSE))","v":{"$error":"#N/A"}},{"$f":"IF($B157=\"\",\"\",VLOOKUP($B157,Data!$A$4:$T$727,6,FALSE))","v":""},"",{"$f":"IF($B157=\"\",\"\",IF(VLOOKUP($B157,Data!$A$4:$T$727,11,FALSE)<1,\"\",VLOOKUP(B157,Data!$A$4:$T$727,11,FALSE)))","v":""}]
[null,null,{"$f":"IF($B158=\"\",\"\",VLOOKUP($B158,Data!$A$4:$T$727,2,FALSE))","v":""},{"$f":"IF($B158=\"\",\"\",VLOOKUP($B158,Data!$A$4:$T$727,10,FALSE))","v":""},{"$f":"IF($B158=\"\",\"\",VLOOKUP($B158,Data!$A$4:$T$727,4,FALSE))","v":""},{"$f":"IF($B158=\"\",\"\",VLOOKUP($B158,Data!$A$4:$T$727,5,FALSE))","v":""},{"$f":"IF($B158=\"\",\"\",VLOOKUP($B158,Data!$A$4:$T$727,7,FALSE))","v":""},"","","","",{"$f":"IF($I$15=\"Show\",VLOOKUP($B158,Data!$A$4:$T$727,9,FALSE),VLOOKUP($B158,Data!$A$4:$T$727,7,FALSE))","v":{"$error":"#N/A"}},{"$f":"IF($B158=\"\",\"\",VLOOKUP($B158,Data!$A$4:$T$727,6,FALSE))","v":""},"",{"$f":"IF($B158=\"\",\"\",IF(VLOOKUP($B158,Data!$A$4:$T$727,11,FALSE)<1,\"\",VLOOKUP(B158,Data!$A$4:$T$727,11,FALSE)))","v":""}]
[null,null,{"$f":"IF($B159=\"\",\"\",VLOOKUP($B159,Data!$A$4:$T$727,2,FALSE))","v":""},{"$f":"IF($B159=\"\",\"\",VLOOKUP($B159,Data!$A$4:$T$727,10,FALSE))","v":""},{"$f":"IF($B159=\"\",\"\",VLOOKUP($B159,Data!$A$4:$T$727,4,FALSE))","v":""},{"$f":"IF($B159=\"\",\"\",VLOOKUP($B159,Data!$A$4:$T$727,5,FALSE))","v":""},{"$f":"IF($B159=\"\",\"\",VLOOKUP($B159,Data!$A$4:$T$727,7,FALSE))","v":""},"","","","",{"$f":"IF($I$15=\"Show\",VLOOKUP($B159,Data!$A$4:$T$727,9,FALSE),VLOOKUP($B159,Data!$A$4:$T$727,7,FALSE))","v":{"$error":"#N/A"}},{"$f":"IF($B159=\"\",\"\",VLOOKUP($B159,Data!$A$4:$T$727,6,FALSE))","v":""},"",{"$f":"IF($B159=\"\",\"\",IF(VLOOKUP($B159,Data!$A$4:$T$727,11,FALSE)<1,\"\",VLOOKUP(B159,Data!$A$4:$T$727,11,FALSE)))","v":""}]
[null,null,{"$f":"IF($B160=\"\",\"\",VLOOKUP($B160,Data!$A$4:$T$727,2,FALSE))","v":""},{"$f":"IF($B160=\"\",\"\",VLOOKUP($B160,Data!$A$4:$T$727,10,FALSE))","v":""},{"$f":"IF($B160=\"\",\"\",VLOOKUP($B160,Data!$A$4:$T$727,4,FALSE))","v":""},{"$f":"IF($B160=\"\",\"\",VLOOKUP($B160,Data!$A$4:$T$727,5,FALSE))","v":""},{"$f":"IF($B160=\"\",\"\",VLOOKUP($B160,Data!$A$4:$T$727,7,FALSE))","v":""},"","","","",{"$f":"IF($I$15=\"Show\",VLOOKUP($B160,Data!$A$4:$T$727,9,FALSE),VLOOKUP($B160,Data!$A$4:$T$727,7,FALSE))","v":{"$error":"#N/A"}},{"$f":"IF($B160=\"\",\"\",VLOOKUP($B160,Data!$A$4:$T$727,6,FALSE))","v":""},"",{"$f":"IF($B160=\"\",\"\",IF(VLOOKUP($B160,Data!$A$4:$T$727,11,FALSE)<1,\"\",VLOOKUP(B160,Data!$A$4:$T$727,11,FALSE)))","v":""}]
[null,null,{"$f":"IF($B161=\"\",\"\",VLOOKUP($B161,Data!$A$4:$T$727,2,FALSE))","v":""},{"$f":"IF($B161=\"\",\"\",VLOOKUP($B161,Data!$A$4:$T$727,10,FALSE))","v":""},{"$f":"IF($B161=\"\",\"\",VLOOKUP($B161,Data!$A$4:$T$727,4,FALSE))","v":""},{"$f":"IF($B161=\"\",\"\",VLOOKUP($B161,Data!$A$4:$T$727,5,FALSE))","v":""},{"$f":"IF($B161=\"\",\"\",VLOOKUP($B161,Data!$A$4:$T$727,7,FALSE))","v":""},"","","","",{"$f":"IF($I$15=\"Show\",VLOOKUP($B161,Data!$A$4:$T$727,9,FALSE),VLOOKUP($B161,Data!$A$4:$T$727,7,FALSE))","v":{"$error":"#N/A"}},{"$f":"IF($B161=\"\",\"\",VLOOKUP($B161,Data!$A$4:$T$727,6,FALSE))","v":""},"",{"$f":"IF($B161=\"\",\"\",IF(VLOOKUP($B161,Data!$A$4:$T$727,11,FALSE)<1,\"\",VLOOKUP(B161,Data!$A$4:$T$727,11,FALSE)))","v":""}]
[null,null,{"$f":"IF($B162=\"\",\"\",VLOOKUP($B162,Data!$A$4:$T$727,2,FALSE))","v":""},{"$f":"IF($B162=\"\",\"\",VLOOKUP($B162,Data!$A$4:$T$727,10,FALSE))","v":""},{"$f":"IF($B162=\"\",\"\",VLOOKUP($B162,Data!$A$4:$T$727,4,FALSE))","v":""},{"$f":"IF($B162=\"\",\"\",VLOOKUP($B162,Data!$A$4:$T$727,5,FALSE))","v":""},{"$f":"IF($B162=\"\",\"\",VLOOKUP($B162,Data!$A$4:$T$727,7,FALSE))","v":""},"","","","",{"$f":"IF($I$15=\"Show\",VLOOKUP($B162,Data!$A$4:$T$727,9,FALSE),VLOOKUP($B162,Data!$A$4:$T$727,7,FALSE))","v":{"$error":"#N/A"}},{"$f":"IF($B162=\"\",\"\",VLOOKUP($B162,Data!$A$4:$T$727,6,FALSE))","v":""},"",{"$f":"IF($B162=\"\",\"\",IF(VLOOKUP($B162,Data!$A$4:$T$727,11,FALSE)<1,\"\",VLOOKUP(B162,Data!$A$4:$T$727,11,FALSE)))","v":""}]
[null,null,{"$f":"IF($B163=\"\",\"\",VLOOKUP($B163,Data!$A$4:$T$727,2,FALSE))","v":""},{"$f":"IF($B163=\"\",\"\",VLOOKUP($B163,Data!$A$4:$T$727,10,FALSE))","v":""},{"$f":"IF($B163=\"\",\"\",VLOOKUP($B163,Data!$A$4:$T$727,4,FALSE))","v":""},{"$f":"IF($B163=\"\",\"\",VLOOKUP($B163,Data!$A$4:$T$727,5,FALSE))","v":""},{"$f":"IF($B163=\"\",\"\",VLOOKUP($B163,Data!$A$4:$T$727,7,FALSE))","v":""},"","","","",{"$f":"IF($I$15=\"Show\",VLOOKUP($B163,Data!$A$4:$T$727,9,FALSE),VLOOKUP($B163,Data!$A$4:$T$727,7,FALSE))","v":{"$error":"#N/A"}},{"$f":"IF($B163=\"\",\"\",VLOOKUP($B163,Data!$A$4:$T$727,6,FALSE))","v":""},"",{"$f":"IF($B163=\"\",\"\",IF(VLOOKUP($B163,Data!$A$4:$T$727,11,FALSE)<1,\"\",VLOOKUP(B163,Data!$A$4:$T$727,11,FALSE)))","v":""}]
[null,null,{"$f":"IF($B164=\"\",\"\",VLOOKUP($B164,Data!$A$4:$T$727,2,FALSE))","v":""},{"$f":"IF($B164=\"\",\"\",VLOOKUP($B164,Data!$A$4:$T$727,10,FALSE))","v":""},{"$f":"IF($B164=\"\",\"\",VLOOKUP($B164,Data!$A$4:$T$727,4,FALSE))","v":""},{"$f":"IF($B164=\"\",\"\",VLOOKUP($B164,Data!$A$4:$T$727,5,FALSE))","v":""},{"$f":"IF($B164=\"\",\"\",VLOOKUP($B164,Data!$A$4:$T$727,7,FALSE))","v":""},"","","","",{"$f":"IF($I$15=\"Show\",VLOOKUP($B164,Data!$A$4:$T$727,9,FALSE),VLOOKUP($B164,Data!$A$4:$T$727,7,FALSE))","v":{"$error":"#N/A"}},{"$f":"IF($B164=\"\",\"\",VLOOKUP($B164,Data!$A$4:$T$727,6,FALSE))","v":""},"",{"$f":"IF($B164=\"\",\"\",IF(VLOOKUP($B164,Data!$A$4:$T$727,11,FALSE)<1,\"\",VLOOKUP(B164,Data!$A$4:$T$727,11,FALSE)))","v":""}]
[null,null,{"$f":"IF($B165=\"\",\"\",VLOOKUP($B165,Data!$A$4:$T$727,2,FALSE))","v":""},{"$f":"IF($B165=\"\",\"\",VLOOKUP($B165,Data!$A$4:$T$727,10,FALSE))","v":""},{"$f":"IF($B165=\"\",\"\",VLOOKUP($B165,Data!$A$4:$T$727,4,FALSE))","v":""},{"$f":"IF($B165=\"\",\"\",VLOOKUP($B165,Data!$A$4:$T$727,5,FALSE))","v":""},{"$f":"IF($B165=\"\",\"\",VLOOKUP($B165,Data!$A$4:$T$727,7,FALSE))","v":""},"","","","",{"$f":"IF($I$15=\"Show\",VLOOKUP($B165,Data!$A$4:$T$727,9,FALSE),VLOOKUP($B165,Data!$A$4:$T$727,7,FALSE))","v":{"$error":"#N/A"}},{"$f":"IF($B165=\"\",\"\",VLOOKUP($B165,Data!$A$4:$T$727,6,FALSE))","v":""},"",{"$f":"IF($B165=\"\",\"\",IF(VLOOKUP($B165,Data!$A$4:$T$727,11,FALSE)<1,\"\",VLOOKUP(B165,Data!$A$4:$T$727,11,FALSE)))","v":""}]
[null,null,{"$f":"IF($B166=\"\",\"\",VLOOKUP($B166,Data!$A$4:$T$727,2,FALSE))","v":""},{"$f":"IF($B166=\"\",\"\",VLOOKUP($B166,Data!$A$4:$T$727,10,FALSE))","v":""},{"$f":"IF($B166=\"\",\"\",VLOOKUP($B166,Data!$A$4:$T$727,4,FALSE))","v":""},{"$f":"IF($B166=\"\",\"\",VLOOKUP($B166,Data!$A$4:$T$727,5,FALSE))","v":""},{"$f":"IF($B166=\"\",\"\",VLOOKUP($B166,Data!$A$4:$T$727,7,FALSE))","v":""},"","","","",{"$f":"IF($I$15=\"Show\",VLOOKUP($B166,Data!$A$4:$T$727,9,FALSE),VLOOKUP($B166,Data!$A$4:$T$727,7,FALSE))","v":{"$error":"#N/A"}},{"$f":"IF($B166=\"\",\"\",VLOOKUP($B166,Data!$A$4:$T$727,6,FALSE))","v":""},"",{"$f":"IF($B166=\"\",\"\",IF(VLOOKUP($B166,Data!$A$4:$T$727,11,FALSE)<1,\"\",VLOOKUP(B166,Data!$A$4:$T$727,11,FALSE)))","v":""}]
[null,null,{"$f":"IF($B167=\"\",\"\",VLOOKUP($B167,Data!$A$4:$T$727,2,FALSE))","v":""},{"$f":"IF($B167=\"\",\"\",VLOOKUP($B167,Data!$A$4:$T$727,10,FALSE))","v":""},{"$f":"IF($B167=\"\",\"\",VLOOKUP($B167,Data!$A$4:$T$727,4,FALSE))","v":""},{"$f":"IF($B167=\"\",\"\",VLOOKUP($B167,Data!$A$4:$T$727,5,FALSE))","v":""},{"$f":"IF($B167=\"\",\"\",VLOOKUP($B167,Data!$A$4:$T$727,7,FALSE))","v":""},"","","","",{"$f":"IF($I$15=\"Show\",VLOOKUP($B167,Data!$A$4:$T$727,9,FALSE),VLOOKUP($B167,Data!$A$4:$T$727,7,FALSE))","v":{"$error":"#N/A"}},{"$f":"IF($B167=\"\",\"\",VLOOKUP($B167,Data!$A$4:$T$727,6,FALSE))","v":""},"",{"$f":"IF($B167=\"\",\"\",IF(VLOOKUP($B167,Data!$A$4:$T$727,11,FALSE)<1,\"\",VLOOKUP(B167,Data!$A$4:$T$727,11,FALSE)))","v":""}]
[null,null,{"$f":"IF($B168=\"\",\"\",VLOOKUP($B168,Data!$A$4:$T$727,2,FALSE))","v":""},{"$f":"IF($B168=\"\",\"\",VLOOKUP($B168,Data!$A$4:$T$727,10,FALSE))","v":""},{"$f":"IF($B168=\"\",\"\",VLOOKUP($B168,Data!$A$4:$T$727,4,FALSE))","v":""},{"$f":"IF($B168=\"\",\"\",VLOOKUP($B168,Data!$A$4:$T$727,5,FALSE))","v":""},{"$f":"IF($B168=\"\",\"\",VLOOKUP($B168,Data!$A$4:$T$727,7,FALSE))","v":""},"","","","",{"$f":"IF($I$15=\"Show\",VLOOKUP($B168,Data!$A$4:$T$727,9,FALSE),VLOOKUP($B168,Data!$A$4:$T$727,7,FALSE))","v":{"$error":"#N/A"}},{"$f":"IF($B168=\"\",\"\",VLOOKUP($B168,Data!$A$4:$T$727,6,FALSE))","v":""},"",{"$f":"IF($B168=\"\",\"\",IF(VLOOKUP($B168,Data!$A$4:$T$727,11,FALSE)<1,\"\",VLOOKUP(B168,Data!$A$4:$T$727,11,FALSE)))","v":""}]
[null,null,{"$f":"IF($B169=\"\",\"\",VLOOKUP($B169,Data!$A$4:$T$727,2,FALSE))","v":""},{"$f":"IF($B169=\"\",\"\",VLOOKUP($B169,Data!$A$4:$T$727,10,FALSE))","v":""},{"$f":"IF($B169=\"\",\"\",VLOOKUP($B169,Data!$A$4:$T$727,4,FALSE))","v":""},{"$f":"IF($B169=\"\",\"\",VLOOKUP($B169,Data!$A$4:$T$727,5,FALSE))","v":""},{"$f":"IF($B169=\"\",\"\",VLOOKUP($B169,Data!$A$4:$T$727,7,FALSE))","v":""},"","","","",{"$f":"IF($I$15=\"Show\",VLOOKUP($B169,Data!$A$4:$T$727,9,FALSE),VLOOKUP($B169,Data!$A$4:$T$727,7,FALSE))","v":{"$error":"#N/A"}},{"$f":"IF($B169=\"\",\"\",VLOOKUP($B169,Data!$A$4:$T$727,6,FALSE))","v":""},"",{"$f":"IF($B169=\"\",\"\",IF(VLOOKUP($B169,Data!$A$4:$T$727,11,FALSE)<1,\"\",VLOOKUP(B169,Data!$A$4:$T$727,11,FALSE)))","v":""}]
[null,null,{"$f":"IF($B170=\"\",\"\",VLOOKUP($B170,Data!$A$4:$T$727,2,FALSE))","v":""},{"$f":"IF($B170=\"\",\"\",VLOOKUP($B170,Data!$A$4:$T$727,10,FALSE))","v":""},{"$f":"IF($B170=\"\",\"\",VLOOKUP($B170,Data!$A$4:$T$727,4,FALSE))","v":""},{"$f":"IF($B170=\"\",\"\",VLOOKUP($B170,Data!$A$4:$T$727,5,FALSE))","v":""},{"$f":"IF($B170=\"\",\"\",VLOOKUP($B170,Data!$A$4:$T$727,7,FALSE))","v":""},"","","","",{"$f":"IF($I$15=\"Show\",VLOOKUP($B170,Data!$A$4:$T$727,9,FALSE),VLOOKUP($B170,Data!$A$4:$T$727,7,FALSE))","v":{"$error":"#N/A"}},{"$f":"IF($B170=\"\",\"\",VLOOKUP($B170,Data!$A$4:$T$727,6,FALSE))","v":""},"",{"$f":"IF($B170=\"\",\"\",IF(VLOOKUP($B170,Data!$A$4:$T$727,11,FALSE)<1,\"\",VLOOKUP(B170,Data!$A$4:$T$727,11,FALSE)))","v":""}]
[null,null,{"$f":"IF($B171=\"\",\"\",VLOOKUP($B171,Data!$A$4:$T$727,2,FALSE))","v":""},{"$f":"IF($B171=\"\",\"\",VLOOKUP($B171,Data!$A$4:$T$727,10,FALSE))","v":""},{"$f":"IF($B171=\"\",\"\",VLOOKUP($B171,Data!$A$4:$T$727,4,FALSE))","v":""},{"$f":"IF($B171=\"\",\"\",VLOOKUP($B171,Data!$A$4:$T$727,5,FALSE))","v":""},{"$f":"IF($B171=\"\",\"\",VLOOKUP($B171,Data!$A$4:$T$727,7,FALSE))","v":""},"","","","",{"$f":"IF($I$15=\"Show\",VLOOKUP($B171,Data!$A$4:$T$727,9,FALSE),VLOOKUP($B171,Data!$A$4:$T$727,7,FALSE))","v":{"$error":"#N/A"}},{"$f":"IF($B171=\"\",\"\",VLOOKUP($B171,Data!$A$4:$T$727,6,FALSE))","v":""},"",{"$f":"IF($B171=\"\",\"\",IF(VLOOKUP($B171,Data!$A$4:$T$727,11,FALSE)<1,\"\",VLOOKUP(B171,Data!$A$4:$T$727,11,FALSE)))","v":""}]
[null,null,{"$f":"IF($B172=\"\",\"\",VLOOKUP($B172,Data!$A$4:$T$727,2,FALSE))","v":""},{"$f":"IF($B172=\"\",\"\",VLOOKUP($B172,Data!$A$4:$T$727,10,FALSE))","v":""},{"$f":"IF($B172=\"\",\"\",VLOOKUP($B172,Data!$A$4:$T$727,4,FALSE))","v":""},{"$f":"IF($B172=\"\",\"\",VLOOKUP($B172,Data!$A$4:$T$727,5,FALSE))","v":""},{"$f":"IF($B172=\"\",\"\",VLOOKUP($B172,Data!$A$4:$T$727,7,FALSE))","v":""},"","","","",{"$f":"IF($I$15=\"Show\",VLOOKUP($B172,Data!$A$4:$T$727,9,FALSE),VLOOKUP($B172,Data!$A$4:$T$727,7,FALSE))","v":{"$error":"#N/A"}},{"$f":"IF($B172=\"\",\"\",VLOOKUP($B172,Data!$A$4:$T$727,6,FALSE))","v":""},"",{"$f":"IF($B172=\"\",\"\",IF(VLOOKUP($B172,Data!$A$4:$T$727,11,FALSE)<1,\"\",VLOOKUP(B172,Data!$A$4:$T$727,11,FALSE)))","v":""}]
[null,null,{"$f":"IF($B173=\"\",\"\",VLOOKUP($B173,Data!$A$4:$T$727,2,FALSE))","v":""},{"$f":"IF($B173=\"\",\"\",VLOOKUP($B173,Data!$A$4:$T$727,10,FALSE))","v":""},{"$f":"IF($B173=\"\",\"\",VLOOKUP($B173,Data!$A$4:$T$727,4,FALSE))","v":""},{"$f":"IF($B173=\"\",\"\",VLOOKUP($B173,Data!$A$4:$T$727,5,FALSE))","v":""},{"$f":"IF($B173=\"\",\"\",VLOOKUP($B173,Data!$A$4:$T$727,7,FALSE))","v":""},"","","","",{"$f":"IF($I$15=\"Show\",VLOOKUP($B173,Data!$A$4:$T$727,9,FALSE),VLOOKUP($B173,Data!$A$4:$T$727,7,FALSE))","v":{"$error":"#N/A"}},{"$f":"IF($B173=\"\",\"\",VLOOKUP($B173,Data!$A$4:$T$727,6,FALSE))","v":""},"",{"$f":"IF($B173=\"\",\"\",IF(VLOOKUP($B173,Data!$A$4:$T$727,11,FALSE)<1,\"\",VLOOKUP(B173,Data!$A$4:$T$727,11,FALSE)))","v":""}]
[null,null,{"$f":"IF($B174=\"\",\"\",VLOOKUP($B174,Data!$A$4:$T$727,2,FALSE))","v":""},{"$f":"IF($B174=\"\",\"\",VLOOKUP($B174,Data!$A$4:$T$727,10,FALSE))","v":""},{"$f":"IF($B174=\"\",\"\",VLOOKUP($B174,Data!$A$4:$T$727,4,FALSE))","v":""},{"$f":"IF($B174=\"\",\"\",VLOOKUP($B174,Data!$A$4:$T$727,5,FALSE))","v":""},{"$f":"IF($B174=\"\",\"\",VLOOKUP($B174,Data!$A$4:$T$727,7,FALSE))","v":""},"","","","",{"$f":"IF($I$15=\"Show\",VLOOKUP($B174,Data!$A$4:$T$727,9,FALSE),VLOOKUP($B174,Data!$A$4:$T$727,7,FALSE))","v":{"$error":"#N/A"}},{"$f":"IF($B174=\"\",\"\",VLOOKUP($B174,Data!$A$4:$T$727,6,FALSE))","v":""},"",{"$f":"IF($B174=\"\",\"\",IF(VLOOKUP($B174,Data!$A$4:$T$727,11,FALSE)<1,\"\",VLOOKUP(B174,Data!$A$4:$T$727,11,FALSE)))","v":""}]
[null,null,{"$f":"IF($B175=\"\",\"\",VLOOKUP($B175,Data!$A$4:$T$727,2,FALSE))","v":""},{"$f":"IF($B175=\"\",\"\",VLOOKUP($B175,Data!$A$4:$T$727,10,FALSE))","v":""},{"$f":"IF($B175=\"\",\"\",VLOOKUP($B175,Data!$A$4:$T$727,4,FALSE))","v":""},{"$f":"IF($B175=\"\",\"\",VLOOKUP($B175,Data!$A$4:$T$727,5,FALSE))","v":""},{"$f":"IF($B175=\"\",\"\",VLOOKUP($B175,Data!$A$4:$T$727,7,FALSE))","v":""},"","","","",{"$f":"IF($I$15=\"Show\",VLOOKUP($B175,Data!$A$4:$T$727,9,FALSE),VLOOKUP($B175,Data!$A$4:$T$727,7,FALSE))","v":{"$error":"#N/A"}},{"$f":"IF($B175=\"\",\"\",VLOOKUP($B175,Data!$A$4:$T$727,6,FALSE))","v":""},"",{"$f":"IF($B175=\"\",\"\",IF(VLOOKUP($B175,Data!$A$4:$T$727,11,FALSE)<1,\"\",VLOOKUP(B175,Data!$A$4:$T$727,11,FALSE)))","v":""}]
[null,null,{"$f":"IF($B176=\"\",\"\",VLOOKUP($B176,Data!$A$4:$T$727,2,FALSE))","v":""},{"$f":"IF($B176=\"\",\"\",VLOOKUP($B176,Data!$A$4:$T$727,10,FALSE))","v":""},{"$f":"IF($B176=\"\",\"\",VLOOKUP($B176,Data!$A$4:$T$727,4,FALSE))","v":""},{"$f":"IF($B176=\"\",\"\",VLOOKUP($B176,Data!$A$4:$T$727,5,FALSE))","v":""},{"$f":"IF($B176=\"\",\"\",VLOOKUP($B176,Data!$A$4:$T$727,7,FALSE))","v":""},"","","","",{"$f":"IF($I$15=\"Show\",VLOOKUP($B176,Data!$A$4:$T$727,9,FALSE),VLOOKUP($B176,Data!$A$4:$T$727,7,FALSE))","v":{"$error":"#N/A"}},{"$f":"IF($B176=\"\",\"\",VLOOKUP($B176,Data!$A$4:$T$727,6,FALSE))","v":""},"",{"$f":"IF($B176=\"\",\"\",IF(VLOOKUP($B176,Data!$A$4:$T$727,11,FALSE)<1,\"\",VLOOKUP(B176,Data!$A$4:$T$727,11,FALSE)))","v":""}]
[null,null,{"$f":"IF($B177=\"\",\"\",VLOOKUP($B177,Data!$A$4:$T$727,2,FALSE))","v":""},{"$f":"IF($B177=\"\",\"\",VLOOKUP($B177,Data!$A$4:$T$727,10,FALSE))","v":""},{"$f":"IF($B177=\"\",\"\",VLOOKUP($B177,Data!$A$4:$T$727,4,FALSE))","v":""},{"$f":"IF($B177=\"\",\"\",VLOOKUP($B177,Data!$A$4:$T$727,5,FALSE))","v":""},{"$f":"IF($B177=\"\",\"\",VLOOKUP($B177,Data!$A$4:$T$727,7,FALSE))","v":""},"","","","",{"$f":"IF($I$15=\"Show\",VLOOKUP($B177,Data!$A$4:$T$727,9,FALSE),VLOOKUP($B177,Data!$A$4:$T$727,7,FALSE))","v":{"$error":"#N/A"}},{"$f":"IF($B177=\"\",\"\",VLOOKUP($B177,Data!$A$4:$T$727,6,FALSE))","v":""},"",{"$f":"IF($B177=\"\",\"\",IF(VLOOKUP($B177,Data!$A$4:$T$727,11,FALSE)<1,\"\",VLOOKUP(B177,Data!$A$4:$T$727,11,FALSE)))","v":""}]
[null,null,{"$f":"IF($B178=\"\",\"\",VLOOKUP($B178,Data!$A$4:$T$727,2,FALSE))","v":""},{"$f":"IF($B178=\"\",\"\",VLOOKUP($B178,Data!$A$4:$T$727,10,FALSE))","v":""},{"$f":"IF($B178=\"\",\"\",VLOOKUP($B178,Data!$A$4:$T$727,4,FALSE))","v":""},{"$f":"IF($B178=\"\",\"\",VLOOKUP($B178,Data!$A$4:$T$727,5,FALSE))","v":""},{"$f":"IF($B178=\"\",\"\",VLOOKUP($B178,Data!$A$4:$T$727,7,FALSE))","v":""},"","","","",{"$f":"IF($I$15=\"Show\",VLOOKUP($B178,Data!$A$4:$T$727,9,FALSE),VLOOKUP($B178,Data!$A$4:$T$727,7,FALSE))","v":{"$error":"#N/A"}},{"$f":"IF($B178=\"\",\"\",VLOOKUP($B178,Data!$A$4:$T$727,6,FALSE))","v":""},"",{"$f":"IF($B178=\"\",\"\",IF(VLOOKUP($B178,Data!$A$4:$T$727,11,FALSE)<1,\"\",VLOOKUP(B178,Data!$A$4:$T$727,11,FALSE)))","v":""}]
[null,null,{"$f":"IF($B179=\"\",\"\",VLOOKUP($B179,Data!$A$4:$T$727,2,FALSE))","v":""},{"$f":"IF($B179=\"\",\"\",VLOOKUP($B179,Data!$A$4:$T$727,10,FALSE))","v":""},{"$f":"IF($B179=\"\",\"\",VLOOKUP($B179,Data!$A$4:$T$727,4,FALSE))","v":""},{"$f":"IF($B179=\"\",\"\",VLOOKUP($B179,Data!$A$4:$T$727,5,FALSE))","v":""},{"$f":"IF($B179=\"\",\"\",VLOOKUP($B179,Data!$A$4:$T$727,7,FALSE))","v":""},"","","","",{"$f":"IF($I$15=\"Show\",VLOOKUP($B179,Data!$A$4:$T$727,9,FALSE),VLOOKUP($B179,Data!$A$4:$T$727,7,FALSE))","v":{"$error":"#N/A"}},{"$f":"IF($B179=\"\",\"\",VLOOKUP($B179,Data!$A$4:$T$727,6,FALSE))","v":""},"",{"$f":"IF($B179=\"\",\"\",IF(VLOOKUP($B179,Data!$A$4:$T$727,11,FALSE)<1,\"\",VLOOKUP(B179,Data!$A$4:$T$727,11,FALSE)))","v":""}]
[null,null,{"$f":"IF($B180=\"\",\"\",VLOOKUP($B180,Data!$A$4:$T$727,2,FALSE))","v":""},{"$f":"IF($B180=\"\",\"\",VLOOKUP($B180,Data!$A$4:$T$727,10,FALSE))","v":""},{"$f":"IF($B180=\"\",\"\",VLOOKUP($B180,Data!$A$4:$T$727,4,FALSE))","v":""},{"$f":"IF($B180=\"\",\"\",VLOOKUP($B180,Data!$A$4:$T$727,5,FALSE))","v":""},{"$f":"IF($B180=\"\",\"\",VLOOKUP($B180,Data!$A$4:$T$727,7,FALSE))","v":""},"","","","",{"$f":"IF($I$15=\"Show\",VLOOKUP($B180,Data!$A$4:$T$727,9,FALSE),VLOOKUP($B180,Data!$A$4:$T$727,7,FALSE))","v":{"$error":"#N/A"}},{"$f":"IF($B180=\"\",\"\",VLOOKUP($B180,Data!$A$4:$T$727,6,FALSE))","v":""},"",{"$f":"IF($B180=\"\",\"\",IF(VLOOKUP($B180,Data!$A$4:$T$727,11,FALSE)<1,\"\",VLOOKUP(B180,Data!$A$4:$T$727,11,FALSE)))","v":""}]
[null,null,{"$f":"IF($B181=\"\",\"\",VLOOKUP($B181,Data!$A$4:$T$727,2,FALSE))","v":""},{"$f":"IF($B181=\"\",\"\",VLOOKUP($B181,Data!$A$4:$T$727,10,FALSE))","v":""},{"$f":"IF($B181=\"\",\"\",VLOOKUP($B181,Data!$A$4:$T$727,4,FALSE))","v":""},{"$f":"IF($B181=\"\",\"\",VLOOKUP($B181,Data!$A$4:$T$727,5,FALSE))","v":""},{"$f":"IF($B181=\"\",\"\",VLOOKUP($B181,Data!$A$4:$T$727,7,FALSE))","v":""},"","","","",{"$f":"IF($I$15=\"Show\",VLOOKUP($B181,Data!$A$4:$T$727,9,FALSE),VLOOKUP($B181,Data!$A$4:$T$727,7,FALSE))","v":{"$error":"#N/A"}},{"$f":"IF($B181=\"\",\"\",VLOOKUP($B181,Data!$A$4:$T$727,6,FALSE))","v":""},"",{"$f":"IF($B181=\"\",\"\",IF(VLOOKUP($B181,Data!$A$4:$T$727,11,FALSE)<1,\"\",VLOOKUP(B181,Data!$A$4:$T$727,11,FALSE)))","v":""}]
[null,null,{"$f":"IF($B182=\"\",\"\",VLOOKUP($B182,Data!$A$4:$T$727,2,FALSE))","v":""},{"$f":"IF($B182=\"\",\"\",VLOOKUP($B182,Data!$A$4:$T$727,10,FALSE))","v":""},{"$f":"IF($B182=\"\",\"\",VLOOKUP($B182,Data!$A$4:$T$727,4,FALSE))","v":""},{"$f":"IF($B182=\"\",\"\",VLOOKUP($B182,Data!$A$4:$T$727,5,FALSE))","v":""},{"$f":"IF($B182=\"\",\"\",VLOOKUP($B182,Data!$A$4:$T$727,7,FALSE))","v":""},"","","","",{"$f":"IF($I$15=\"Show\",VLOOKUP($B182,Data!$A$4:$T$727,9,FALSE),VLOOKUP($B182,Data!$A$4:$T$727,7,FALSE))","v":{"$error":"#N/A"}},{"$f":"IF($B182=\"\",\"\",VLOOKUP($B182,Data!$A$4:$T$727,6,FALSE))","v":""},"",{"$f":"IF($B182=\"\",\"\",IF(VLOOKUP($B182,Data!$A$4:$T$727,11,FALSE)<1,\"\",VLOOKUP(B182,Data!$A$4:$T$727,11,FALSE)))","v":""}]
[null,null,{"$f":"IF($B183=\"\",\"\",VLOOKUP($B183,Data!$A$4:$T$727,2,FALSE))","v":""},{"$f":"IF($B183=\"\",\"\",VLOOKUP($B183,Data!$A$4:$T$727,10,FALSE))","v":""},{"$f":"IF($B183=\"\",\"\",VLOOKUP($B183,Data!$A$4:$T$727,4,FALSE))","v":""},{"$f":"IF($B183=\"\",\"\",VLOOKUP($B183,Data!$A$4:$T$727,5,FALSE))","v":""},{"$f":"IF($B183=\"\",\"\",VLOOKUP($B183,Data!$A$4:$T$727,7,FALSE))","v":""},"","","","",{"$f":"IF($I$15=\"Show\",VLOOKUP($B183,Data!$A$4:$T$727,9,FALSE),VLOOKUP($B183,Data!$A$4:$T$727,7,FALSE))","v":{"$error":"#N/A"}},{"$f":"IF($B183=\"\",\"\",VLOOKUP($B183,Data!$A$4:$T$727,6,FALSE))","v":""},"",{"$f":"IF($B183=\"\",\"\",IF(VLOOKUP($B183,Data!$A$4:$T$727,11,FALSE)<1,\"\",VLOOKUP(B183,Data!$A$4:$T$727,11,FALSE)))","v":""}]
[null,null,{"$f":"IF($B184=\"\",\"\",VLOOKUP($B184,Data!$A$4:$T$727,2,FALSE))","v":""},{"$f":"IF($B184=\"\",\"\",VLOOKUP($B184,Data!$A$4:$T$727,10,FALSE))","v":""},{"$f":"IF($B184=\"\",\"\",VLOOKUP($B184,Data!$A$4:$T$727,4,FALSE))","v":""},{"$f":"IF($B184=\"\",\"\",VLOOKUP($B184,Data!$A$4:$T$727,5,FALSE))","v":""},{"$f":"IF($B184=\"\",\"\",VLOOKUP($B184,Data!$A$4:$T$727,7,FALSE))","v":""},"","","","",{"$f":"IF($I$15=\"Show\",VLOOKUP($B184,Data!$A$4:$T$727,9,FALSE),VLOOKUP($B184,Data!$A$4:$T$727,7,FALSE))","v":{"$error":"#N/A"}},{"$f":"IF($B184=\"\",\"\",VLOOKUP($B184,Data!$A$4:$T$727,6,FALSE))","v":""},"",{"$f":"IF($B184=\"\",\"\",IF(VLOOKUP($B184,Data!$A$4:$T$727,11,FALSE)<1,\"\",VLOOKUP(B184,Data!$A$4:$T$727,11,FALSE)))","v":""}]
[null,null,{"$f":"IF($B185=\"\",\"\",VLOOKUP($B185,Data!$A$4:$T$727,2,FALSE))","v":""},{"$f":"IF($B185=\"\",\"\",VLOOKUP($B185,Data!$A$4:$T$727,10,FALSE))","v":""},{"$f":"IF($B185=\"\",\"\",VLOOKUP($B185,Data!$A$4:$T$727,4,FALSE))","v":""},{"$f":"IF($B185=\"\",\"\",VLOOKUP($B185,Data!$A$4:$T$727,5,FALSE))","v":""},{"$f":"IF($B185=\"\",\"\",VLOOKUP($B185,Data!$A$4:$T$727,7,FALSE))","v":""},"","","","",{"$f":"IF($I$15=\"Show\",VLOOKUP($B185,Data!$A$4:$T$727,9,FALSE),VLOOKUP($B185,Data!$A$4:$T$727,7,FALSE))","v":{"$error":"#N/A"}},{"$f":"IF($B185=\"\",\"\",VLOOKUP($B185,Data!$A$4:$T$727,6,FALSE))","v":""},"",{"$f":"IF($B185=\"\",\"\",IF(VLOOKUP($B185,Data!$A$4:$T$727,11,FALSE)<1,\"\",VLOOKUP(B185,Data!$A$4:$T$727,11,FALSE)))","v":""}]
[null,null,{"$f":"IF($B186=\"\",\"\",VLOOKUP($B186,Data!$A$4:$T$727,2,FALSE))","v":""},{"$f":"IF($B186=\"\",\"\",VLOOKUP($B186,Data!$A$4:$T$727,10,FALSE))","v":""},{"$f":"IF($B186=\"\",\"\",VLOOKUP($B186,Data!$A$4:$T$727,4,FALSE))","v":""},{"$f":"IF($B186=\"\",\"\",VLOOKUP($B186,Data!$A$4:$T$727,5,FALSE))","v":""},{"$f":"IF($B186=\"\",\"\",VLOOKUP($B186,Data!$A$4:$T$727,7,FALSE))","v":""},"","","","",{"$f":"IF($I$15=\"Show\",VLOOKUP($B186,Data!$A$4:$T$727,9,FALSE),VLOOKUP($B186,Data!$A$4:$T$727,7,FALSE))","v":{"$error":"#N/A"}},{"$f":"IF($B186=\"\",\"\",VLOOKUP($B186,Data!$A$4:$T$727,6,FALSE))","v":""},"",{"$f":"IF($B186=\"\",\"\",IF(VLOOKUP($B186,Data!$A$4:$T$727,11,FALSE)<1,\"\",VLOOKUP(B186,Data!$A$4:$T$727,11,FALSE)))","v":""}]
[null,null,{"$f":"IF($B187=\"\",\"\",VLOOKUP($B187,Data!$A$4:$T$727,2,FALSE))","v":""},{"$f":"IF($B187=\"\",\"\",VLOOKUP($B187,Data!$A$4:$T$727,10,FALSE))","v":""},{"$f":"IF($B187=\"\",\"\",VLOOKUP($B187,Data!$A$4:$T$727,4,FALSE))","v":""},{"$f":"IF($B187=\"\",\"\",VLOOKUP($B187,Data!$A$4:$T$727,5,FALSE))","v":""},{"$f":"IF($B187=\"\",\"\",VLOOKUP($B187,Data!$A$4:$T$727,7,FALSE))","v":""},"","","","",{"$f":"IF($I$15=\"Show\",VLOOKUP($B187,Data!$A$4:$T$727,9,FALSE),VLOOKUP($B187,Data!$A$4:$T$727,7,FALSE))","v":{"$error":"#N/A"}},{"$f":"IF($B187=\"\",\"\",VLOOKUP($B187,Data!$A$4:$T$727,6,FALSE))","v":""},"",{"$f":"IF($B187=\"\",\"\",IF(VLOOKUP($B187,Data!$A$4:$T$727,11,FALSE)<1,\"\",VLOOKUP(B187,Data!$A$4:$T$727,11,FALSE)))","v":""}]
[null,null,{"$f":"IF($B188=\"\",\"\",VLOOKUP($B188,Data!$A$4:$T$727,2,FALSE))","v":""},{"$f":"IF($B188=\"\",\"\",VLOOKUP($B188,Data!$A$4:$T$727,10,FALSE))","v":""},{"$f":"IF($B188=\"\",\"\",VLOOKUP($B188,Data!$A$4:$T$727,4,FALSE))","v":""},{"$f":"IF($B188=\"\",\"\",VLOOKUP($B188,Data!$A$4:$T$727,5,FALSE))","v":""},{"$f":"IF($B188=\"\",\"\",VLOOKUP($B188,Data!$A$4:$T$727,7,FALSE))","v":""},"","","","",{"$f":"IF($I$15=\"Show\",VLOOKUP($B188,Data!$A$4:$T$727,9,FALSE),VLOOKUP($B188,Data!$A$4:$T$727,7,FALSE))","v":{"$error":"#N/A"}},{"$f":"IF($B188=\"\",\"\",VLOOKUP($B188,Data!$A$4:$T$727,6,FALSE))","v":""},"",{"$f":"IF($B188=\"\",\"\",IF(VLOOKUP($B188,Data!$A$4:$T$727,11,FALSE)<1,\"\",VLOOKUP(B188,Data!$A$4:$T$727,11,FALSE)))","v":""}]
[null,null,{"$f":"IF($B189=\"\",\"\",VLOOKUP($B189,Data!$A$4:$T$727,2,FALSE))","v":""},{"$f":"IF($B189=\"\",\"\",VLOOKUP($B189,Data!$A$4:$T$727,10,FALSE))","v":""},{"$f":"IF($B189=\"\",\"\",VLOOKUP($B189,Data!$A$4:$T$727,4,FALSE))","v":""},{"$f":"IF($B189=\"\",\"\",VLOOKUP($B189,Data!$A$4:$T$727,5,FALSE))","v":""},{"$f":"IF($B189=\"\",\"\",VLOOKUP($B189,Data!$A$4:$T$727,7,FALSE))","v":""},"","","","",{"$f":"IF($I$15=\"Show\",VLOOKUP($B189,Data!$A$4:$T$727,9,FALSE),VLOOKUP($B189,Data!$A$4:$T$727,7,FALSE))","v":{"$error":"#N/A"}},{"$f":"IF($B189=\"\",\"\",VLOOKUP($B189,Data!$A$4:$T$727,6,FALSE))","v":""},"",{"$f":"IF($B189=\"\",\"\",IF(VLOOKUP($B189,Data!$A$4:$T$727,11,FALSE)<1,\"\",VLOOKUP(B189,Data!$A$4:$T$727,11,FALSE)))","v":""}]
[null,null,{"$f":"IF($B190=\"\",\"\",VLOOKUP($B190,Data!$A$4:$T$727,2,FALSE))","v":""},{"$f":"IF($B190=\"\",\"\",VLOOKUP($B190,Data!$A$4:$T$727,10,FALSE))","v":""},{"$f":"IF($B190=\"\",\"\",VLOOKUP($B190,Data!$A$4:$T$727,4,FALSE))","v":""},{"$f":"IF($B190=\"\",\"\",VLOOKUP($B190,Data!$A$4:$T$727,5,FALSE))","v":""},{"$f":"IF($B190=\"\",\"\",VLOOKUP($B190,Data!$A$4:$T$727,7,FALSE))","v":""},"","","","",{"$f":"IF($I$15=\"Show\",VLOOKUP($B190,Data!$A$4:$T$727,9,FALSE),VLOOKUP($B190,Data!$A$4:$T$727,7,FALSE))","v":{"$error":"#N/A"}},{"$f":"IF($B190=\"\",\"\",VLOOKUP($B190,Data!$A$4:$T$727,6,FALSE))","v":""},"",{"$f":"IF($B190=\"\",\"\",IF(VLOOKUP($B190,Data!$A$4:$T$727,11,FALSE)<1,\"\",VLOOKUP(B190,Data!$A$4:$T$727,11,FALSE)))","v":""}]
[null,null,{"$f":"IF($B191=\"\",\"\",VLOOKUP($B191,Data!$A$4:$T$727,2,FALSE))","v":""},{"$f":"IF($B191=\"\",\"\",VLOOKUP($B191,Data!$A$4:$T$727,10,FALSE))","v":""},{"$f":"IF($B191=\"\",\"\",VLOOKUP($B191,Data!$A$4:$T$727,4,FALSE))","v":""},{"$f":"IF($B191=\"\",\"\",VLOOKUP($B191,Data!$A$4:$T$727,5,FALSE))","v":""},{"$f":"IF($B191=\"\",\"\",VLOOKUP($B191,Data!$A$4:$T$727,7,FALSE))","v":""},"","","","",{"$f":"IF($I$15=\"Show\",VLOOKUP($B191,Data!$A$4:$T$727,9,FALSE),VLOOKUP($B191,Data!$A$4:$T$727,7,FALSE))","v":{"$error":"#N/A"}},{"$f":"IF($B191=\"\",\"\",VLOOKUP($B191,Data!$A$4:$T$727,6,FALSE))","v":""},"",{"$f":"IF($B191=\"\",\"\",IF(VLOOKUP($B191,Data!$A$4:$T$727,11,FALSE)<1,\"\",VLOOKUP(B191,Data!$A$4:$T$727,11,FALSE)))","v":""}]
[null,null,{"$f":"IF($B192=\"\",\"\",VLOOKUP($B192,Data!$A$4:$T$727,2,FALSE))","v":""},{"$f":"IF($B192=\"\",\"\",VLOOKUP($B192,Data!$A$4:$T$727,10,FALSE))","v":""},{"$f":"IF($B192=\"\",\"\",VLOOKUP($B192,Data!$A$4:$T$727,4,FALSE))","v":""},{"$f":"IF($B192=\"\",\"\",VLOOKUP($B192,Data!$A$4:$T$727,5,FALSE))","v":""},{"$f":"IF($B192=\"\",\"\",VLOOKUP($B192,Data!$A$4:$T$727,7,FALSE))","v":""},"","","","",{"$f":"IF($I$15=\"Show\",VLOOKUP($B192,Data!$A$4:$T$727,9,FALSE),VLOOKUP($B192,Data!$A$4:$T$727,7,FALSE))","v":{"$error":"#N/A"}},{"$f":"IF($B192=\"\",\"\",VLOOKUP($B192,Data!$A$4:$T$727,6,FALSE))","v":""},"",{"$f":"IF($B192=\"\",\"\",IF(VLOOKUP($B192,Data!$A$4:$T$727,11,FALSE)<1,\"\",VLOOKUP(B192,Data!$A$4:$T$727,11,FALSE)))","v":""}]
[null,null,{"$f":"IF($B193=\"\",\"\",VLOOKUP($B193,Data!$A$4:$T$727,2,FALSE))","v":""},{"$f":"IF($B193=\"\",\"\",VLOOKUP($B193,Data!$A$4:$T$727,10,FALSE))","v":""},{"$f":"IF($B193=\"\",\"\",VLOOKUP($B193,Data!$A$4:$T$727,4,FALSE))","v":""},{"$f":"IF($B193=\"\",\"\",VLOOKUP($B193,Data!$A$4:$T$727,5,FALSE))","v":""},{"$f":"IF($B193=\"\",\"\",VLOOKUP($B193,Data!$A$4:$T$727,7,FALSE))","v":""},"","","","",{"$f":"IF($I$15=\"Show\",VLOOKUP($B193,Data!$A$4:$T$727,9,FALSE),VLOOKUP($B193,Data!$A$4:$T$727,7,FALSE))","v":{"$error":"#N/A"}},{"$f":"IF($B193=\"\",\"\",VLOOKUP($B193,Data!$A$4:$T$727,6,FALSE))","v":""},"",{"$f":"IF($B193=\"\",\"\",IF(VLOOKUP($B193,Data!$A$4:$T$727,11,FALSE)<1,\"\",VLOOKUP(B193,Data!$A$4:$T$727,11,FALSE)))","v":""}]
[null,null,{"$f":"IF($B194=\"\",\"\",VLOOKUP($B194,Data!$A$4:$T$727,2,FALSE))","v":""},{"$f":"IF($B194=\"\",\"\",VLOOKUP($B194,Data!$A$4:$T$727,10,FALSE))","v":""},{"$f":"IF($B194=\"\",\"\",VLOOKUP($B194,Data!$A$4:$T$727,4,FALSE))","v":""},{"$f":"IF($B194=\"\",\"\",VLOOKUP($B194,Data!$A$4:$T$727,5,FALSE))","v":""},{"$f":"IF($B194=\"\",\"\",VLOOKUP($B194,Data!$A$4:$T$727,7,FALSE))","v":""},"","","","",{"$f":"IF($I$15=\"Show\",VLOOKUP($B194,Data!$A$4:$T$727,9,FALSE),VLOOKUP($B194,Data!$A$4:$T$727,7,FALSE))","v":{"$error":"#N/A"}},{"$f":"IF($B194=\"\",\"\",VLOOKUP($B194,Data!$A$4:$T$727,6,FALSE))","v":""},"",{"$f":"IF($B194=\"\",\"\",IF(VLOOKUP($B194,Data!$A$4:$T$727,11,FALSE)<1,\"\",VLOOKUP(B194,Data!$A$4:$T$727,11,FALSE)))","v":""}]
[null,null,{"$f":"IF($B195=\"\",\"\",VLOOKUP($B195,Data!$A$4:$T$727,2,FALSE))","v":""},{"$f":"IF($B195=\"\",\"\",VLOOKUP($B195,Data!$A$4:$T$727,10,FALSE))","v":""},{"$f":"IF($B195=\"\",\"\",VLOOKUP($B195,Data!$A$4:$T$727,4,FALSE))","v":""},{"$f":"IF($B195=\"\",\"\",VLOOKUP($B195,Data!$A$4:$T$727,5,FALSE))","v":""},{"$f":"IF($B195=\"\",\"\",VLOOKUP($B195,Data!$A$4:$T$727,7,FALSE))","v":""},"","","","",{"$f":"IF($I$15=\"Show\",VLOOKUP($B195,Data!$A$4:$T$727,9,FALSE),VLOOKUP($B195,Data!$A$4:$T$727,7,FALSE))","v":{"$error":"#N/A"}},{"$f":"IF($B195=\"\",\"\",VLOOKUP($B195,Data!$A$4:$T$727,6,FALSE))","v":""},"",{"$f":"IF($B195=\"\",\"\",IF(VLOOKUP($B195,Data!$A$4:$T$727,11,FALSE)<1,\"\",VLOOKUP(B195,Data!$A$4:$T$727,11,FALSE)))","v":""}]
[null,null,{"$f":"IF($B196=\"\",\"\",VLOOKUP($B196,Data!$A$4:$T$727,2,FALSE))","v":""},{"$f":"IF($B196=\"\",\"\",VLOOKUP($B196,Data!$A$4:$T$727,10,FALSE))","v":""},{"$f":"IF($B196=\"\",\"\",VLOOKUP($B196,Data!$A$4:$T$727,4,FALSE))","v":""},{"$f":"IF($B196=\"\",\"\",VLOOKUP($B196,Data!$A$4:$T$727,5,FALSE))","v":""},{"$f":"IF($B196=\"\",\"\",VLOOKUP($B196,Data!$A$4:$T$727,7,FALSE))","v":""},"","","","",{"$f":"IF($I$15=\"Show\",VLOOKUP($B196,Data!$A$4:$T$727,9,FALSE),VLOOKUP($B196,Data!$A$4:$T$727,7,FALSE))","v":{"$error":"#N/A"}},{"$f":"IF($B196=\"\",\"\",VLOOKUP($B196,Data!$A$4:$T$727,6,FALSE))","v":""},"",{"$f":"IF($B196=\"\",\"\",IF(VLOOKUP($B196,Data!$A$4:$T$727,11,FALSE)<1,\"\",VLOOKUP(B196,Data!$A$4:$T$727,11,FALSE)))","v":""}]
[null,null,{"$f":"IF($B197=\"\",\"\",VLOOKUP($B197,Data!$A$4:$T$727,2,FALSE))","v":""},{"$f":"IF($B197=\"\",\"\",VLOOKUP($B197,Data!$A$4:$T$727,10,FALSE))","v":""},{"$f":"IF($B197=\"\",\"\",VLOOKUP($B197,Data!$A$4:$T$727,4,FALSE))","v":""},{"$f":"IF($B197=\"\",\"\",VLOOKUP($B197,Data!$A$4:$T$727,5,FALSE))","v":""},{"$f":"IF($B197=\"\",\"\",VLOOKUP($B197,Data!$A$4:$T$727,7,FALSE))","v":""},"","","","",{"$f":"IF($I$15=\"Show\",VLOOKUP($B197,Data!$A$4:$T$727,9,FALSE),VLOOKUP($B197,Data!$A$4:$T$727,7,FALSE))","v":{"$error":"#N/A"}},{"$f":"IF($B197=\"\",\"\",VLOOKUP($B197,Data!$A$4:$T$727,6,FALSE))","v":""},"",{"$f":"IF($B197=\"\",\"\",IF(VLOOKUP($B197,Data!$A$4:$T$727,11,FALSE)<1,\"\",VLOOKUP(B197,Data!$A$4:$T$727,11,FALSE)))","v":""}]
[null,null,{"$f":"IF($B198=\"\",\"\",VLOOKUP($B198,Data!$A$4:$T$727,2,FALSE))","v":""},{"$f":"IF($B198=\"\",\"\",VLOOKUP($B198,Data!$A$4:$T$727,10,FALSE))","v":""},{"$f":"IF($B198=\"\",\"\",VLOOKUP($B198,Data!$A$4:$T$727,4,FALSE))","v":""},{"$f":"IF($B198=\"\",\"\",VLOOKUP($B198,Data!$A$4:$T$727,5,FALSE))","v":""},{"$f":"IF($B198=\"\",\"\",VLOOKUP($B198,Data!$A$4:$T$727,7,FALSE))","v":""},"","","","",{"$f":"IF($I$15=\"Show\",VLOOKUP($B198,Data!$A$4:$T$727,9,FALSE),VLOOKUP($B198,Data!$A$4:$T$727,7,FALSE))","v":{"$error":"#N/A"}},{"$f":"IF($B198=\"\",\"\",VLOOKUP($B198,Data!$A$4:$T$727,6,FALSE))","v":""},"",{"$f":"IF($B198=\"\",\"\",IF(VLOOKUP($B198,Data!$A$4:$T$727,11,FALSE)<1,\"\",VLOOKUP(B198,Data!$A$4:$T$727,11,FALSE)))","v":""}]
[null,null,{"$f":"IF($B199=\"\",\"\",VLOOKUP($B199,Data!$A$4:$T$727,2,FALSE))","v":""},{"$f":"IF($B199=\"\",\"\",VLOOKUP($B199,Data!$A$4:$T$727,10,FALSE))","v":""},{"$f":"IF($B199=\"\",\"\",VLOOKUP($B199,Data!$A$4:$T$727,4,FALSE))","v":""},{"$f":"IF($B199=\"\",\"\",VLOOKUP($B199,Data!$A$4:$T$727,5,FALSE))","v":""},{"$f":"IF($B199=\"\",\"\",VLOOKUP($B199,Data!$A$4:$T$727,7,FALSE))","v":""},"","","","",{"$f":"IF($I$15=\"Show\",VLOOKUP($B199,Data!$A$4:$T$727,9,FALSE),VLOOKUP($B199,Data!$A$4:$T$727,7,FALSE))","v":{"$error":"#N/A"}},{"$f":"IF($B199=\"\",\"\",VLOOKUP($B199,Data!$A$4:$T$727,6,FALSE))","v":""},"",{"$f":"IF($B199=\"\",\"\",IF(VLOOKUP($B199,Data!$A$4:$T$727,11,FALSE)<1,\"\",VLOOKUP(B199,Data!$A$4:$T$727,11,FALSE)))","v":""}]
[null,null,{"$f":"IF($B200=\"\",\"\",VLOOKUP($B200,Data!$A$4:$T$727,2,FALSE))","v":""},{"$f":"IF($B200=\"\",\"\",VLOOKUP($B200,Data!$A$4:$T$727,10,FALSE))","v":""},{"$f":"IF($B200=\"\",\"\",VLOOKUP($B200,Data!$A$4:$T$727,4,FALSE))","v":""},{"$f":"IF($B200=\"\",\"\",VLOOKUP($B200,Data!$A$4:$T$727,5,FALSE))","v":""},{"$f":"IF($B200=\"\",\"\",VLOOKUP($B200,Data!$A$4:$T$727,7,FALSE))","v":""},"","","","",{"$f":"IF($I$15=\"Show\",VLOOKUP($B200,Data!$A$4:$T$727,9,FALSE),VLOOKUP($B200,Data!$A$4:$T$727,7,FALSE))","v":{"$error":"#N/A"}},{"$f":"IF($B200=\"\",\"\",VLOOKUP($B200,Data!$A$4:$T$727,6,FALSE))","v":""},"",{"$f":"IF($B200=\"\",\"\",IF(VLOOKUP($B200,Data!$A$4:$T$727,11,FALSE)<1,\"\",VLOOKUP(B200,Data!$A$4:$T$727,11,FALSE)))","v":""}]
[null,null,{"$f":"IF($B201=\"\",\"\",VLOOKUP($B201,Data!$A$4:$T$727,2,FALSE))","v":""},{"$f":"IF($B201=\"\",\"\",VLOOKUP($B201,Data!$A$4:$T$727,10,FALSE))","v":""},{"$f":"IF($B201=\"\",\"\",VLOOKUP($B201,Data!$A$4:$T$727,4,FALSE))","v":""},{"$f":"IF($B201=\"\",\"\",VLOOKUP($B201,Data!$A$4:$T$727,5,FALSE))","v":""},{"$f":"IF($B201=\"\",\"\",VLOOKUP($B201,Data!$A$4:$T$727,7,FALSE))","v":""},"","","","",{"$f":"IF($I$15=\"Show\",VLOOKUP($B201,Data!$A$4:$T$727,9,FALSE),VLOOKUP($B201,Data!$A$4:$T$727,7,FALSE))","v":{"$error":"#N/A"}},{"$f":"IF($B201=\"\",\"\",VLOOKUP($B201,Data!$A$4:$T$727,6,FALSE))","v":""},"",{"$f":"IF($B201=\"\",\"\",IF(VLOOKUP($B201,Data!$A$4:$T$727,11,FALSE)<1,\"\",VLOOKUP(B201,Data!$A$4:$T$727,11,FALSE)))","v":""}]
[null,null,{"$f":"IF($B202=\"\",\"\",VLOOKUP($B202,Data!$A$4:$T$727,2,FALSE))","v":""},{"$f":"IF($B202=\"\",\"\",VLOOKUP($B202,Data!$A$4:$T$727,10,FALSE))","v":""},{"$f":"IF($B202=\"\",\"\",VLOOKUP($B202,Data!$A$4:$T$727,4,FALSE))","v":""},{"$f":"IF($B202=\"\",\"\",VLOOKUP($B202,Data!$A$4:$T$727,5,FALSE))","v":""},{"$f":"IF($B202=\"\",\"\",VLOOKUP($B202,Data!$A$4:$T$727,7,FALSE))","v":""},"","","","",{"$f":"IF($I$15=\"Show\",VLOOKUP($B202,Data!$A$4:$T$727,9,FALSE),VLOOKUP($B202,Data!$A$4:$T$727,7,FALSE))","v":{"$error":"#N/A"}},{"$f":"IF($B202=\"\",\"\",VLOOKUP($B202,Data!$A$4:$T$727,6,FALSE))","v":""},"",{"$f":"IF($B202=\"\",\"\",IF(VLOOKUP($B202,Data!$A$4:$T$727,11,FALSE)<1,\"\",VLOOKUP(B202,Data!$A$4:$T$727,11,FALSE)))","v":""}]
[null,null,{"$f":"IF($B203=\"\",\"\",VLOOKUP($B203,Data!$A$4:$T$727,2,FALSE))","v":""},{"$f":"IF($B203=\"\",\"\",VLOOKUP($B203,Data!$A$4:$T$727,10,FALSE))","v":""},{"$f":"IF($B203=\"\",\"\",VLOOKUP($B203,Data!$A$4:$T$727,4,FALSE))","v":""},{"$f":"IF($B203=\"\",\"\",VLOOKUP($B203,Data!$A$4:$T$727,5,FALSE))","v":""},{"$f":"IF($B203=\"\",\"\",VLOOKUP($B203,Data!$A$4:$T$727,7,FALSE))","v":""},"","","","",{"$f":"IF($I$15=\"Show\",VLOOKUP($B203,Data!$A$4:$T$727,9,FALSE),VLOOKUP($B203,Data!$A$4:$T$727,7,FALSE))","v":{"$error":"#N/A"}},{"$f":"IF($B203=\"\",\"\",VLOOKUP($B203,Data!$A$4:$T$727,6,FALSE))","v":""},"",{"$f":"IF($B203=\"\",\"\",IF(VLOOKUP($B203,Data!$A$4:$T$727,11,FALSE)<1,\"\",VLOOKUP(B203,Data!$A$4:$T$727,11,FALSE)))","v":""}]
[null,null,{"$f":"IF($B204=\"\",\"\",VLOOKUP($B204,Data!$A$4:$T$727,2,FALSE))","v":""},{"$f":"IF($B204=\"\",\"\",VLOOKUP($B204,Data!$A$4:$T$727,10,FALSE))","v":""},{"$f":"IF($B204=\"\",\"\",VLOOKUP($B204,Data!$A$4:$T$727,4,FALSE))","v":""},{"$f":"IF($B204=\"\",\"\",VLOOKUP($B204,Data!$A$4:$T$727,5,FALSE))","v":""},{"$f":"IF($B204=\"\",\"\",VLOOKUP($B204,Data!$A$4:$T$727,7,FALSE))","v":""},"","","","",{"$f":"IF($I$15=\"Show\",VLOOKUP($B204,Data!$A$4:$T$727,9,FALSE),VLOOKUP($B204,Data!$A$4:$T$727,7,FALSE))","v":{"$error":"#N/A"}},{"$f":"IF($B204=\"\",\"\",VLOOKUP($B204,Data!$A$4:$T$727,6,FALSE))","v":""},"",{"$f":"IF($B204=\"\",\"\",IF(VLOOKUP($B204,Data!$A$4:$T$727,11,FALSE)<1,\"\",VLOOKUP(B204,Data!$A$4:$T$727,11,FALSE)))","v":""}]
[null,null,{"$f":"IF($B205=\"\",\"\",VLOOKUP($B205,Data!$A$4:$T$727,2,FALSE))","v":""},{"$f":"IF($B205=\"\",\"\",VLOOKUP($B205,Data!$A$4:$T$727,10,FALSE))","v":""},{"$f":"IF($B205=\"\",\"\",VLOOKUP($B205,Data!$A$4:$T$727,4,FALSE))","v":""},{"$f":"IF($B205=\"\",\"\",VLOOKUP($B205,Data!$A$4:$T$727,5,FALSE))","v":""},{"$f":"IF($B205=\"\",\"\",VLOOKUP($B205,Data!$A$4:$T$727,7,FALSE))","v":""},"","","","",{"$f":"IF($I$15=\"Show\",VLOOKUP($B205,Data!$A$4:$T$727,9,FALSE),VLOOKUP($B205,Data!$A$4:$T$727,7,FALSE))","v":{"$error":"#N/A"}},{"$f":"IF($B205=\"\",\"\",VLOOKUP($B205,Data!$A$4:$T$727,6,FALSE))","v":""},"",{"$f":"IF($B205=\"\",\"\",IF(VLOOKUP($B205,Data!$A$4:$T$727,11,FALSE)<1,\"\",VLOOKUP(B205,Data!$A$4:$T$727,11,FALSE)))","v":""}]
[null,null,{"$f":"IF($B206=\"\",\"\",VLOOKUP($B206,Data!$A$4:$T$727,2,FALSE))","v":""},{"$f":"IF($B206=\"\",\"\",VLOOKUP($B206,Data!$A$4:$T$727,10,FALSE))","v":""},{"$f":"IF($B206=\"\",\"\",VLOOKUP($B206,Data!$A$4:$T$727,4,FALSE))","v":""},{"$f":"IF($B206=\"\",\"\",VLOOKUP($B206,Data!$A$4:$T$727,5,FALSE))","v":""},{"$f":"IF($B206=\"\",\"\",VLOOKUP($B206,Data!$A$4:$T$727,7,FALSE))","v":""},"","","","",{"$f":"IF($I$15=\"Show\",VLOOKUP($B206,Data!$A$4:$T$727,9,FALSE),VLOOKUP($B206,Data!$A$4:$T$727,7,FALSE))","v":{"$error":"#N/A"}},{"$f":"IF($B206=\"\",\"\",VLOOKUP($B206,Data!$A$4:$T$727,6,FALSE))","v":""},"",{"$f":"IF($B206=\"\",\"\",IF(VLOOKUP($B206,Data!$A$4:$T$727,11,FALSE)<1,\"\",VLOOKUP(B206,Data!$A$4:$T$727,11,FALSE)))","v":""}]
[null,null,{"$f":"IF($B207=\"\",\"\",VLOOKUP($B207,Data!$A$4:$T$727,2,FALSE))","v":""},{"$f":"IF($B207=\"\",\"\",VLOOKUP($B207,Data!$A$4:$T$727,10,FALSE))","v":""},{"$f":"IF($B207=\"\",\"\",VLOOKUP($B207,Data!$A$4:$T$727,4,FALSE))","v":""},{"$f":"IF($B207=\"\",\"\",VLOOKUP($B207,Data!$A$4:$T$727,5,FALSE))","v":""},{"$f":"IF($B207=\"\",\"\",VLOOKUP($B207,Data!$A$4:$T$727,7,FALSE))","v":""},"","","","",{"$f":"IF($I$15=\"Show\",VLOOKUP($B207,Data!$A$4:$T$727,9,FALSE),VLOOKUP($B207,Data!$A$4:$T$727,7,FALSE))","v":{"$error":"#N/A"}},{"$f":"IF($B207=\"\",\"\",VLOOKUP($B207,Data!$A$4:$T$727,6,FALSE))","v":""},"",{"$f":"IF($B207=\"\",\"\",IF(VLOOKUP($B207,Data!$A$4:$T$727,11,FALSE)<1,\"\",VLOOKUP(B207,Data!$A$4:$T$727,11,FALSE)))","v":""}]
[null,null,{"$f":"IF($B208=\"\",\"\",VLOOKUP($B208,Data!$A$4:$T$727,2,FALSE))","v":""},{"$f":"IF($B208=\"\",\"\",VLOOKUP($B208,Data!$A$4:$T$727,10,FALSE))","v":""},{"$f":"IF($B208=\"\",\"\",VLOOKUP($B208,Data!$A$4:$T$727,4,FALSE))","v":""},{"$f":"IF($B208=\"\",\"\",VLOOKUP($B208,Data!$A$4:$T$727,5,FALSE))","v":""},{"$f":"IF($B208=\"\",\"\",VLOOKUP($B208,Data!$A$4:$T$727,7,FALSE))","v":""},"","","","",{"$f":"IF($I$15=\"Show\",VLOOKUP($B208,Data!$A$4:$T$727,9,FALSE),VLOOKUP($B208,Data!$A$4:$T$727,7,FALSE))","v":{"$error":"#N/A"}},{"$f":"IF($B208=\"\",\"\",VLOOKUP($B208,Data!$A$4:$T$727,6,FALSE))","v":""},"",{"$f":"IF($B208=\"\",\"\",IF(VLOOKUP($B208,Data!$A$4:$T$727,11,FALSE)<1,\"\",VLOOKUP(B208,Data!$A$4:$T$727,11,FALSE)))","v":""}]
[null,null,{"$f":"IF($B209=\"\",\"\",VLOOKUP($B209,Data!$A$4:$T$727,2,FALSE))","v":""},{"$f":"IF($B209=\"\",\"\",VLOOKUP($B209,Data!$A$4:$T$727,10,FALSE))","v":""},{"$f":"IF($B209=\"\",\"\",VLOOKUP($B209,Data!$A$4:$T$727,4,FALSE))","v":""},{"$f":"IF($B209=\"\",\"\",VLOOKUP($B209,Data!$A$4:$T$727,5,FALSE))","v":""},{"$f":"IF($B209=\"\",\"\",VLOOKUP($B209,Data!$A$4:$T$727,7,FALSE))","v":""},"","","","",{"$f":"IF($I$15=\"Show\",VLOOKUP($B209,Data!$A$4:$T$727,9,FALSE),VLOOKUP($B209,Data!$A$4:$T$727,7,FALSE))","v":{"$error":"#N/A"}},{"$f":"IF($B209=\"\",\"\",VLOOKUP($B209,Data!$A$4:$T$727,6,FALSE))","v":""},"",{"$f":"IF($B209=\"\",\"\",IF(VLOOKUP($B209,Data!$A$4:$T$727,11,FALSE)<1,\"\",VLOOKUP(B209,Data!$A$4:$T$727,11,FALSE)))","v":""}]
[null,null,{"$f":"IF($B210=\"\",\"\",VLOOKUP($B210,Data!$A$4:$T$727,2,FALSE))","v":""},{"$f":"IF($B210=\"\",\"\",VLOOKUP($B210,Data!$A$4:$T$727,10,FALSE))","v":""},{"$f":"IF($B210=\"\",\"\",VLOOKUP($B210,Data!$A$4:$T$727,4,FALSE))","v":""},{"$f":"IF($B210=\"\",\"\",VLOOKUP($B210,Data!$A$4:$T$727,5,FALSE))","v":""},{"$f":"IF($B210=\"\",\"\",VLOOKUP($B210,Data!$A$4:$T$727,7,FALSE))","v":""},"","","","",{"$f":"IF($I$15=\"Show\",VLOOKUP($B210,Data!$A$4:$T$727,9,FALSE),VLOOKUP($B210,Data!$A$4:$T$727,7,FALSE))","v":{"$error":"#N/A"}},{"$f":"IF($B210=\"\",\"\",VLOOKUP($B210,Data!$A$4:$T$727,6,FALSE))","v":""},"",{"$f":"IF($B210=\"\",\"\",IF(VLOOKUP($B210,Data!$A$4:$T$727,11,FALSE)<1,\"\",VLOOKUP(B210,Data!$A$4:$T$727,11,FALSE)))","v":""}]
[null,null,{"$f":"IF($B211=\"\",\"\",VLOOKUP($B211,Data!$A$4:$T$727,2,FALSE))","v":""},{"$f":"IF($B211=\"\",\"\",VLOOKUP($B211,Data!$A$4:$T$727,10,FALSE))","v":""},{"$f":"IF($B211=\"\",\"\",VLOOKUP($B211,Data!$A$4:$T$727,4,FALSE))","v":""},{"$f":"IF($B211=\"\",\"\",VLOOKUP($B211,Data!$A$4:$T$727,5,FALSE))","v":""},{"$f":"IF($B211=\"\",\"\",VLOOKUP($B211,Data!$A$4:$T$727,7,FALSE))","v":""},"","","","",{"$f":"IF($I$15=\"Show\",VLOOKUP($B211,Data!$A$4:$T$727,9,FALSE),VLOOKUP($B211,Data!$A$4:$T$727,7,FALSE))","v":{"$error":"#N/A"}},{"$f":"IF($B211=\"\",\"\",VLOOKUP($B211,Data!$A$4:$T$727,6,FALSE))","v":""},"",{"$f":"IF($B211=\"\",\"\",IF(VLOOKUP($B211,Data!$A$4:$T$727,11,FALSE)<1,\"\",VLOOKUP(B211,Data!$A$4:$T$727,11,FALSE)))","v":""}]
[null,null,{"$f":"IF($B212=\"\",\"\",VLOOKUP($B212,Data!$A$4:$T$727,2,FALSE))","v":""},{"$f":"IF($B212=\"\",\"\",VLOOKUP($B212,Data!$A$4:$T$727,10,FALSE))","v":""},{"$f":"IF($B212=\"\",\"\",VLOOKUP($B212,Data!$A$4:$T$727,4,FALSE))","v":""},{"$f":"IF($B212=\"\",\"\",VLOOKUP($B212,Data!$A$4:$T$727,5,FALSE))","v":""},{"$f":"IF($B212=\"\",\"\",VLOOKUP($B212,Data!$A$4:$T$727,7,FALSE))","v":""},"","","","",{"$f":"IF($I$15=\"Show\",VLOOKUP($B212,Data!$A$4:$T$727,9,FALSE),VLOOKUP($B212,Data!$A$4:$T$727,7,FALSE))","v":{"$error":"#N/A"}},{"$f":"IF($B212=\"\",\"\",VLOOKUP($B212,Data!$A$4:$T$727,6,FALSE))","v":""},"",{"$f":"IF($B212=\"\",\"\",IF(VLOOKUP($B212,Data!$A$4:$T$727,11,FALSE)<1,\"\",VLOOKUP(B212,Data!$A$4:$T$727,11,FALSE)))","v":""}]
[null,null,{"$f":"IF($B213=\"\",\"\",VLOOKUP($B213,Data!$A$4:$T$727,2,FALSE))","v":""},{"$f":"IF($B213=\"\",\"\",VLOOKUP($B213,Data!$A$4:$T$727,10,FALSE))","v":""},{"$f":"IF($B213=\"\",\"\",VLOOKUP($B213,Data!$A$4:$T$727,4,FALSE))","v":""},{"$f":"IF($B213=\"\",\"\",VLOOKUP($B213,Data!$A$4:$T$727,5,FALSE))","v":""},{"$f":"IF($B213=\"\",\"\",VLOOKUP($B213,Data!$A$4:$T$727,7,FALSE))","v":""},"","","","",{"$f":"IF($I$15=\"Show\",VLOOKUP($B213,Data!$A$4:$T$727,9,FALSE),VLOOKUP($B213,Data!$A$4:$T$727,7,FALSE))","v":{"$error":"#N/A"}},{"$f":"IF($B213=\"\",\"\",VLOOKUP($B213,Data!$A$4:$T$727,6,FALSE))","v":""},"",{"$f":"IF($B213=\"\",\"\",IF(VLOOKUP($B213,Data!$A$4:$T$727,11,FALSE)<1,\"\",VLOOKUP(B213,Data!$A$4:$T$727,11,FALSE)))","v":""}]
[null,null,{"$f":"IF($B214=\"\",\"\",VLOOKUP($B214,Data!$A$4:$T$727,2,FALSE))","v":""},{"$f":"IF($B214=\"\",\"\",VLOOKUP($B214,Data!$A$4:$T$727,10,FALSE))","v":""},{"$f":"IF($B214=\"\",\"\",VLOOKUP($B214,Data!$A$4:$T$727,4,FALSE))","v":""},{"$f":"IF($B214=\"\",\"\",VLOOKUP($B214,Data!$A$4:$T$727,5,FALSE))","v":""},{"$f":"IF($B214=\"\",\"\",VLOOKUP($B214,Data!$A$4:$T$727,7,FALSE))","v":""},{"$f":"IF($B214=\"\",\"\",IF($K$15=\"\",\"\",ROUND($G214*(1-($K$15*0.01)),2)))","v":""},{"$f":"IF($B214=\"\",\"\",IF($G214=$L214,\"\",L214))","v":""},{"$f":"IF($B214=\"\",\"\",IF($H214<$L214,$H214,$L214))","v":""},{"$f":"IF(A214=\"\",\"\",J214*A214)","v":""},{"$f":"IF($I$15=\"Show\",VLOOKUP($B214,Data!$A$4:$T$727,9,FALSE),VLOOKUP($B214,Data!$A$4:$T$727,7,FALSE))","v":{"$error":"#N/A"}},{"$f":"IF($B214=\"\",\"\",VLOOKUP($B214,Data!$A$4:$T$727,6,FALSE))","v":""},{"$f":"IF($A214=\"\",\"\",$A214/$M214)","v":""},{"$f":"IF($B214=\"\",\"\",IF(VLOOKUP($B214,Data!$A$4:$T$727,11,FALSE)<1,\"\",VLOOKUP(B214,Data!$A$4:$T$727,11,FALSE)))","v":""}]
[null,null,{"$f":"IF($B215=\"\",\"\",VLOOKUP($B215,Data!$A$4:$T$727,2,FALSE))","v":""},{"$f":"IF($B215=\"\",\"\",VLOOKUP($B215,Data!$A$4:$T$727,10,FALSE))","v":""},{"$f":"IF($B215=\"\",\"\",VLOOKUP($B215,Data!$A$4:$T$727,4,FALSE))","v":""},{"$f":"IF($B215=\"\",\"\",VLOOKUP($B215,Data!$A$4:$T$727,5,FALSE))","v":""},{"$f":"IF($B215=\"\",\"\",VLOOKUP($B215,Data!$A$4:$T$727,7,FALSE))","v":""},"","","","",{"$f":"IF($I$15=\"Show\",VLOOKUP($B215,Data!$A$4:$T$727,9,FALSE),VLOOKUP($B215,Data!$A$4:$T$727,7,FALSE))","v":{"$error":"#N/A"}},{"$f":"IF($B215=\"\",\"\",VLOOKUP($B215,Data!$A$4:$T$727,6,FALSE))","v":""},"",{"$f":"IF($B215=\"\",\"\",IF(VLOOKUP($B215,Data!$A$4:$T$727,11,FALSE)<1,\"\",VLOOKUP(B215,Data!$A$4:$T$727,11,FALSE)))","v":""}]
[null,null,{"$f":"IF($B216=\"\",\"\",VLOOKUP($B216,Data!$A$4:$T$727,2,FALSE))","v":""},{"$f":"IF($B216=\"\",\"\",VLOOKUP($B216,Data!$A$4:$T$727,10,FALSE))","v":""},{"$f":"IF($B216=\"\",\"\",VLOOKUP($B216,Data!$A$4:$T$727,4,FALSE))","v":""},{"$f":"IF($B216=\"\",\"\",VLOOKUP($B216,Data!$A$4:$T$727,5,FALSE))","v":""},{"$f":"IF($B216=\"\",\"\",VLOOKUP($B216,Data!$A$4:$T$727,7,FALSE))","v":""},"","","","",{"$f":"IF($I$15=\"Show\",VLOOKUP($B216,Data!$A$4:$T$727,9,FALSE),VLOOKUP($B216,Data!$A$4:$T$727,7,FALSE))","v":{"$error":"#N/A"}},{"$f":"IF($B216=\"\",\"\",VLOOKUP($B216,Data!$A$4:$T$727,6,FALSE))","v":""},"",{"$f":"IF($B216=\"\",\"\",IF(VLOOKUP($B216,Data!$A$4:$T$727,11,FALSE)<1,\"\",VLOOKUP(B216,Data!$A$4:$T$727,11,FALSE)))","v":""}]
[null,null,{"$f":"IF($B217=\"\",\"\",VLOOKUP($B217,Data!$A$4:$T$727,2,FALSE))","v":""},{"$f":"IF($B217=\"\",\"\",VLOOKUP($B217,Data!$A$4:$T$727,10,FALSE))","v":""},{"$f":"IF($B217=\"\",\"\",VLOOKUP($B217,Data!$A$4:$T$727,4,FALSE))","v":""},{"$f":"IF($B217=\"\",\"\",VLOOKUP($B217,Data!$A$4:$T$727,5,FALSE))","v":""},{"$f":"IF($B217=\"\",\"\",VLOOKUP($B217,Data!$A$4:$T$727,7,FALSE))","v":""},"","","","",{"$f":"IF($I$15=\"Show\",VLOOKUP($B217,Data!$A$4:$T$727,9,FALSE),VLOOKUP($B217,Data!$A$4:$T$727,7,FALSE))","v":{"$error":"#N/A"}},{"$f":"IF($B217=\"\",\"\",VLOOKUP($B217,Data!$A$4:$T$727,6,FALSE))","v":""},"",{"$f":"IF($B217=\"\",\"\",IF(VLOOKUP($B217,Data!$A$4:$T$727,11,FALSE)<1,\"\",VLOOKUP(B217,Data!$A$4:$T$727,11,FALSE)))","v":""}]
[null,null,{"$f":"IF($B218=\"\",\"\",VLOOKUP($B218,Data!$A$4:$T$727,2,FALSE))","v":""},{"$f":"IF($B218=\"\",\"\",VLOOKUP($B218,Data!$A$4:$T$727,10,FALSE))","v":""},{"$f":"IF($B218=\"\",\"\",VLOOKUP($B218,Data!$A$4:$T$727,4,FALSE))","v":""},{"$f":"IF($B218=\"\",\"\",VLOOKUP($B218,Data!$A$4:$T$727,5,FALSE))","v":""},{"$f":"IF($B218=\"\",\"\",VLOOKUP($B218,Data!$A$4:$T$727,7,FALSE))","v":""},"","","","",{"$f":"IF($I$15=\"Show\",VLOOKUP($B218,Data!$A$4:$T$727,9,FALSE),VLOOKUP($B218,Data!$A$4:$T$727,7,FALSE))","v":{"$error":"#N/A"}},{"$f":"IF($B218=\"\",\"\",VLOOKUP($B218,Data!$A$4:$T$727,6,FALSE))","v":""},"",{"$f":"IF($B218=\"\",\"\",IF(VLOOKUP($B218,Data!$A$4:$T$727,11,FALSE)<1,\"\",VLOOKUP(B218,Data!$A$4:$T$727,11,FALSE)))","v":""}]
[null,null,{"$f":"IF($B219=\"\",\"\",VLOOKUP($B219,Data!$A$4:$T$727,2,FALSE))","v":""},{"$f":"IF($B219=\"\",\"\",VLOOKUP($B219,Data!$A$4:$T$727,10,FALSE))","v":""},{"$f":"IF($B219=\"\",\"\",VLOOKUP($B219,Data!$A$4:$T$727,4,FALSE))","v":""},{"$f":"IF($B219=\"\",\"\",VLOOKUP($B219,Data!$A$4:$T$727,5,FALSE))","v":""},{"$f":"IF($B219=\"\",\"\",VLOOKUP($B219,Data!$A$4:$T$727,7,FALSE))","v":""},"","","","",{"$f":"IF($I$15=\"Show\",VLOOKUP($B219,Data!$A$4:$T$727,9,FALSE),VLOOKUP($B219,Data!$A$4:$T$727,7,FALSE))","v":{"$error":"#N/A"}},{"$f":"IF($B219=\"\",\"\",VLOOKUP($B219,Data!$A$4:$T$727,6,FALSE))","v":""},"",{"$f":"IF($B219=\"\",\"\",IF(VLOOKUP($B219,Data!$A$4:$T$727,11,FALSE)<1,\"\",VLOOKUP(B219,Data!$A$4:$T$727,11,FALSE)))","v":""}]
[null,null,{"$f":"IF($B220=\"\",\"\",VLOOKUP($B220,Data!$A$4:$T$727,2,FALSE))","v":""},{"$f":"IF($B220=\"\",\"\",VLOOKUP($B220,Data!$A$4:$T$727,10,FALSE))","v":""},{"$f":"IF($B220=\"\",\"\",VLOOKUP($B220,Data!$A$4:$T$727,4,FALSE))","v":""},{"$f":"IF($B220=\"\",\"\",VLOOKUP($B220,Data!$A$4:$T$727,5,FALSE))","v":""},{"$f":"IF($B220=\"\",\"\",VLOOKUP($B220,Data!$A$4:$T$727,7,FALSE))","v":""},"","","","",{"$f":"IF($I$15=\"Show\",VLOOKUP($B220,Data!$A$4:$T$727,9,FALSE),VLOOKUP($B220,Data!$A$4:$T$727,7,FALSE))","v":{"$error":"#N/A"}},{"$f":"IF($B220=\"\",\"\",VLOOKUP($B220,Data!$A$4:$T$727,6,FALSE))","v":""},"",{"$f":"IF($B220=\"\",\"\",IF(VLOOKUP($B220,Data!$A$4:$T$727,11,FALSE)<1,\"\",VLOOKUP(B220,Data!$A$4:$T$727,11,FALSE)))","v":""}]
[null,null,{"$f":"IF($B221=\"\",\"\",VLOOKUP($B221,Data!$A$4:$T$727,2,FALSE))","v":""},{"$f":"IF($B221=\"\",\"\",VLOOKUP($B221,Data!$A$4:$T$727,10,FALSE))","v":""},{"$f":"IF($B221=\"\",\"\",VLOOKUP($B221,Data!$A$4:$T$727,4,FALSE))","v":""},{"$f":"IF($B221=\"\",\"\",VLOOKUP($B221,Data!$A$4:$T$727,5,FALSE))","v":""},{"$f":"IF($B221=\"\",\"\",VLOOKUP($B221,Data!$A$4:$T$727,7,FALSE))","v":""},"","","","",{"$f":"IF($I$15=\"Show\",VLOOKUP($B221,Data!$A$4:$T$727,9,FALSE),VLOOKUP($B221,Data!$A$4:$T$727,7,FALSE))","v":{"$error":"#N/A"}},{"$f":"IF($B221=\"\",\"\",VLOOKUP($B221,Data!$A$4:$T$727,6,FALSE))","v":""},"",{"$f":"IF($B221=\"\",\"\",IF(VLOOKUP($B221,Data!$A$4:$T$727,11,FALSE)<1,\"\",VLOOKUP(B221,Data!$A$4:$T$727,11,FALSE)))","v":""}]
[null,null,{"$f":"IF($B222=\"\",\"\",VLOOKUP($B222,Data!$A$4:$T$727,2,FALSE))","v":""},{"$f":"IF($B222=\"\",\"\",VLOOKUP($B222,Data!$A$4:$T$727,10,FALSE))","v":""},{"$f":"IF($B222=\"\",\"\",VLOOKUP($B222,Data!$A$4:$T$727,4,FALSE))","v":""},{"$f":"IF($B222=\"\",\"\",VLOOKUP($B222,Data!$A$4:$T$727,5,FALSE))","v":""},{"$f":"IF($B222=\"\",\"\",VLOOKUP($B222,Data!$A$4:$T$727,7,FALSE))","v":""},"","","","",{"$f":"IF($I$15=\"Show\",VLOOKUP($B222,Data!$A$4:$T$727,9,FALSE),VLOOKUP($B222,Data!$A$4:$T$727,7,FALSE))","v":{"$error":"#N/A"}},{"$f":"IF($B222=\"\",\"\",VLOOKUP($B222,Data!$A$4:$T$727,6,FALSE))","v":""},"",{"$f":"IF($B222=\"\",\"\",IF(VLOOKUP($B222,Data!$A$4:$T$727,11,FALSE)<1,\"\",VLOOKUP(B222,Data!$A$4:$T$727,11,FALSE)))","v":""}]
[null,null,{"$f":"IF($B223=\"\",\"\",VLOOKUP($B223,Data!$A$4:$T$727,2,FALSE))","v":""},{"$f":"IF($B223=\"\",\"\",VLOOKUP($B223,Data!$A$4:$T$727,10,FALSE))","v":""},{"$f":"IF($B223=\"\",\"\",VLOOKUP($B223,Data!$A$4:$T$727,4,FALSE))","v":""},{"$f":"IF($B223=\"\",\"\",VLOOKUP($B223,Data!$A$4:$T$727,5,FALSE))","v":""},{"$f":"IF($B223=\"\",\"\",VLOOKUP($B223,Data!$A$4:$T$727,7,FALSE))","v":""},"","","","",{"$f":"IF($I$15=\"Show\",VLOOKUP($B223,Data!$A$4:$T$727,9,FALSE),VLOOKUP($B223,Data!$A$4:$T$727,7,FALSE))","v":{"$error":"#N/A"}},{"$f":"IF($B223=\"\",\"\",VLOOKUP($B223,Data!$A$4:$T$727,6,FALSE))","v":""},"",{"$f":"IF($B223=\"\",\"\",IF(VLOOKUP($B223,Data!$A$4:$T$727,11,FALSE)<1,\"\",VLOOKUP(B223,Data!$A$4:$T$727,11,FALSE)))","v":""}]
[null,null,{"$f":"IF($B224=\"\",\"\",VLOOKUP($B224,Data!$A$4:$T$727,2,FALSE))","v":""},{"$f":"IF($B224=\"\",\"\",VLOOKUP($B224,Data!$A$4:$T$727,10,FALSE))","v":""},{"$f":"IF($B224=\"\",\"\",VLOOKUP($B224,Data!$A$4:$T$727,4,FALSE))","v":""},{"$f":"IF($B224=\"\",\"\",VLOOKUP($B224,Data!$A$4:$T$727,5,FALSE))","v":""},{"$f":"IF($B224=\"\",\"\",VLOOKUP($B224,Data!$A$4:$T$727,7,FALSE))","v":""},"","","","",{"$f":"IF($I$15=\"Show\",VLOOKUP($B224,Data!$A$4:$T$727,9,FALSE),VLOOKUP($B224,Data!$A$4:$T$727,7,FALSE))","v":{"$error":"#N/A"}},{"$f":"IF($B224=\"\",\"\",VLOOKUP($B224,Data!$A$4:$T$727,6,FALSE))","v":""},"",{"$f":"IF($B224=\"\",\"\",IF(VLOOKUP($B224,Data!$A$4:$T$727,11,FALSE)<1,\"\",VLOOKUP(B224,Data!$A$4:$T$727,11,FALSE)))","v":""}]
[null,null,{"$f":"IF($B225=\"\",\"\",VLOOKUP($B225,Data!$A$4:$T$727,2,FALSE))","v":""},{"$f":"IF($B225=\"\",\"\",VLOOKUP($B225,Data!$A$4:$T$727,10,FALSE))","v":""},{"$f":"IF($B225=\"\",\"\",VLOOKUP($B225,Data!$A$4:$T$727,4,FALSE))","v":""},{"$f":"IF($B225=\"\",\"\",VLOOKUP($B225,Data!$A$4:$T$727,5,FALSE))","v":""},{"$f":"IF($B225=\"\",\"\",VLOOKUP($B225,Data!$A$4:$T$727,7,FALSE))","v":""},"","","","",{"$f":"IF($I$15=\"Show\",VLOOKUP($B225,Data!$A$4:$T$727,9,FALSE),VLOOKUP($B225,Data!$A$4:$T$727,7,FALSE))","v":{"$error":"#N/A"}},{"$f":"IF($B225=\"\",\"\",VLOOKUP($B225,Data!$A$4:$T$727,6,FALSE))","v":""},"",{"$f":"IF($B225=\"\",\"\",IF(VLOOKUP($B225,Data!$A$4:$T$727,11,FALSE)<1,\"\",VLOOKUP(B225,Data!$A$4:$T$727,11,FALSE)))","v":""}]
[null,null,{"$f":"IF($B226=\"\",\"\",VLOOKUP($B226,Data!$A$4:$T$727,2,FALSE))","v":""},{"$f":"IF($B226=\"\",\"\",VLOOKUP($B226,Data!$A$4:$T$727,10,FALSE))","v":""},{"$f":"IF($B226=\"\",\"\",VLOOKUP($B226,Data!$A$4:$T$727,4,FALSE))","v":""},{"$f":"IF($B226=\"\",\"\",VLOOKUP($B226,Data!$A$4:$T$727,5,FALSE))","v":""},{"$f":"IF($B226=\"\",\"\",VLOOKUP($B226,Data!$A$4:$T$727,7,FALSE))","v":""},"","","","",{"$f":"IF($I$15=\"Show\",VLOOKUP($B226,Data!$A$4:$T$727,9,FALSE),VLOOKUP($B226,Data!$A$4:$T$727,7,FALSE))","v":{"$error":"#N/A"}},{"$f":"IF($B226=\"\",\"\",VLOOKUP($B226,Data!$A$4:$T$727,6,FALSE))","v":""},"",{"$f":"IF($B226=\"\",\"\",IF(VLOOKUP($B226,Data!$A$4:$T$727,11,FALSE)<1,\"\",VLOOKUP(B226,Data!$A$4:$T$727,11,FALSE)))","v":""}]
[null,null,{"$f":"IF($B227=\"\",\"\",VLOOKUP($B227,Data!$A$4:$T$727,2,FALSE))","v":""},{"$f":"IF($B227=\"\",\"\",VLOOKUP($B227,Data!$A$4:$T$727,10,FALSE))","v":""},{"$f":"IF($B227=\"\",\"\",VLOOKUP($B227,Data!$A$4:$T$727,4,FALSE))","v":""},{"$f":"IF($B227=\"\",\"\",VLOOKUP($B227,Data!$A$4:$T$727,5,FALSE))","v":""},{"$f":"IF($B227=\"\",\"\",VLOOKUP($B227,Data!$A$4:$T$727,7,FALSE))","v":""},"","","","",{"$f":"IF($I$15=\"Show\",VLOOKUP($B227,Data!$A$4:$T$727,9,FALSE),VLOOKUP($B227,Data!$A$4:$T$727,7,FALSE))","v":{"$error":"#N/A"}},{"$f":"IF($B227=\"\",\"\",VLOOKUP($B227,Data!$A$4:$T$727,6,FALSE))","v":""},"",{"$f":"IF($B227=\"\",\"\",IF(VLOOKUP($B227,Data!$A$4:$T$727,11,FALSE)<1,\"\",VLOOKUP(B227,Data!$A$4:$T$727,11,FALSE)))","v":""}]
[null,null,{"$f":"IF($B228=\"\",\"\",VLOOKUP($B228,Data!$A$4:$T$727,2,FALSE))","v":""},{"$f":"IF($B228=\"\",\"\",VLOOKUP($B228,Data!$A$4:$T$727,10,FALSE))","v":""},{"$f":"IF($B228=\"\",\"\",VLOOKUP($B228,Data!$A$4:$T$727,4,FALSE))","v":""},{"$f":"IF($B228=\"\",\"\",VLOOKUP($B228,Data!$A$4:$T$727,5,FALSE))","v":""},{"$f":"IF($B228=\"\",\"\",VLOOKUP($B228,Data!$A$4:$T$727,7,FALSE))","v":""},"","","","",{"$f":"IF($I$15=\"Show\",VLOOKUP($B228,Data!$A$4:$T$727,9,FALSE),VLOOKUP($B228,Data!$A$4:$T$727,7,FALSE))","v":{"$error":"#N/A"}},{"$f":"IF($B228=\"\",\"\",VLOOKUP($B228,Data!$A$4:$T$727,6,FALSE))","v":""},"",{"$f":"IF($B228=\"\",\"\",IF(VLOOKUP($B228,Data!$A$4:$T$727,11,FALSE)<1,\"\",VLOOKUP(B228,Data!$A$4:$T$727,11,FALSE)))","v":""}]
[null,null,{"$f":"IF($B229=\"\",\"\",VLOOKUP($B229,Data!$A$4:$T$727,2,FALSE))","v":""},{"$f":"IF($B229=\"\",\"\",VLOOKUP($B229,Data!$A$4:$T$727,10,FALSE))","v":""},{"$f":"IF($B229=\"\",\"\",VLOOKUP($B229,Data!$A$4:$T$727,4,FALSE))","v":""},{"$f":"IF($B229=\"\",\"\",VLOOKUP($B229,Data!$A$4:$T$727,5,FALSE))","v":""},{"$f":"IF($B229=\"\",\"\",VLOOKUP($B229,Data!$A$4:$T$727,7,FALSE))","v":""},"","","","",{"$f":"IF($I$15=\"Show\",VLOOKUP($B229,Data!$A$4:$T$727,9,FALSE),VLOOKUP($B229,Data!$A$4:$T$727,7,FALSE))","v":{"$error":"#N/A"}},{"$f":"IF($B229=\"\",\"\",VLOOKUP($B229,Data!$A$4:$T$727,6,FALSE))","v":""},"",{"$f":"IF($B229=\"\",\"\",IF(VLOOKUP($B229,Data!$A$4:$T$727,11,FALSE)<1,\"\",VLOOKUP(B229,Data!$A$4:$T$727,11,FALSE)))","v":""}]
[null,null,{"$f":"IF($B230=\"\",\"\",VLOOKUP($B230,Data!$A$4:$T$727,2,FALSE))","v":""},{"$f":"IF($B230=\"\",\"\",VLOOKUP($B230,Data!$A$4:$T$727,10,FALSE))","v":""},{"$f":"IF($B230=\"\",\"\",VLOOKUP($B230,Data!$A$4:$T$727,4,FALSE))","v":""},{"$f":"IF($B230=\"\",\"\",VLOOKUP($B230,Data!$A$4:$T$727,5,FALSE))","v":""},{"$f":"IF($B230=\"\",\"\",VLOOKUP($B230,Data!$A$4:$T$727,7,FALSE))","v":""},"","","","",{"$f":"IF($I$15=\"Show\",VLOOKUP($B230,Data!$A$4:$T$727,9,FALSE),VLOOKUP($B230,Data!$A$4:$T$727,7,FALSE))","v":{"$error":"#N/A"}},{"$f":"IF($B230=\"\",\"\",VLOOKUP($B230,Data!$A$4:$T$727,6,FALSE))","v":""},"",{"$f":"IF($B230=\"\",\"\",IF(VLOOKUP($B230,Data!$A$4:$T$727,11,FALSE)<1,\"\",VLOOKUP(B230,Data!$A$4:$T$727,11,FALSE)))","v":""}]
[null,null,{"$f":"IF($B231=\"\",\"\",VLOOKUP($B231,Data!$A$4:$T$727,2,FALSE))","v":""},{"$f":"IF($B231=\"\",\"\",VLOOKUP($B231,Data!$A$4:$T$727,10,FALSE))","v":""},{"$f":"IF($B231=\"\",\"\",VLOOKUP($B231,Data!$A$4:$T$727,4,FALSE))","v":""},{"$f":"IF($B231=\"\",\"\",VLOOKUP($B231,Data!$A$4:$T$727,5,FALSE))","v":""},{"$f":"IF($B231=\"\",\"\",VLOOKUP($B231,Data!$A$4:$T$727,7,FALSE))","v":""},"","","","",{"$f":"IF($I$15=\"Show\",VLOOKUP($B231,Data!$A$4:$T$727,9,FALSE),VLOOKUP($B231,Data!$A$4:$T$727,7,FALSE))","v":{"$error":"#N/A"}},{"$f":"IF($B231=\"\",\"\",VLOOKUP($B231,Data!$A$4:$T$727,6,FALSE))","v":""},"",{"$f":"IF($B231=\"\",\"\",IF(VLOOKUP($B231,Data!$A$4:$T$727,11,FALSE)<1,\"\",VLOOKUP(B231,Data!$A$4:$T$727,11,FALSE)))","v":""}]
[null,null,{"$f":"IF($B232=\"\",\"\",VLOOKUP($B232,Data!$A$4:$T$727,2,FALSE))","v":""},{"$f":"IF($B232=\"\",\"\",VLOOKUP($B232,Data!$A$4:$T$727,10,FALSE))","v":""},{"$f":"IF($B232=\"\",\"\",VLOOKUP($B232,Data!$A$4:$T$727,4,FALSE))","v":""},{"$f":"IF($B232=\"\",\"\",VLOOKUP($B232,Data!$A$4:$T$727,5,FALSE))","v":""},{"$f":"IF($B232=\"\",\"\",VLOOKUP($B232,Data!$A$4:$T$727,7,FALSE))","v":""},"","","","",{"$f":"IF($I$15=\"Show\",VLOOKUP($B232,Data!$A$4:$T$727,9,FALSE),VLOOKUP($B232,Data!$A$4:$T$727,7,FALSE))","v":{"$error":"#N/A"}},{"$f":"IF($B232=\"\",\"\",VLOOKUP($B232,Data!$A$4:$T$727,6,FALSE))","v":""},"",{"$f":"IF($B232=\"\",\"\",IF(VLOOKUP($B232,Data!$A$4:$T$727,11,FALSE)<1,\"\",VLOOKUP(B232,Data!$A$4:$T$727,11,FALSE)))","v":""}]
[null,null,{"$f":"IF($B233=\"\",\"\",VLOOKUP($B233,Data!$A$4:$T$727,2,FALSE))","v":""},{"$f":"IF($B233=\"\",\"\",VLOOKUP($B233,Data!$A$4:$T$727,10,FALSE))","v":""},{"$f":"IF($B233=\"\",\"\",VLOOKUP($B233,Data!$A$4:$T$727,4,FALSE))","v":""},{"$f":"IF($B233=\"\",\"\",VLOOKUP($B233,Data!$A$4:$T$727,5,FALSE))","v":""},{"$f":"IF($B233=\"\",\"\",VLOOKUP($B233,Data!$A$4:$T$727,7,FALSE))","v":""},"","","","",{"$f":"IF($I$15=\"Show\",VLOOKUP($B233,Data!$A$4:$T$727,9,FALSE),VLOOKUP($B233,Data!$A$4:$T$727,7,FALSE))","v":{"$error":"#N/A"}},{"$f":"IF($B233=\"\",\"\",VLOOKUP($B233,Data!$A$4:$T$727,6,FALSE))","v":""},"",{"$f":"IF($B233=\"\",\"\",IF(VLOOKUP($B233,Data!$A$4:$T$727,11,FALSE)<1,\"\",VLOOKUP(B233,Data!$A$4:$T$727,11,FALSE)))","v":""}]
[null,null,{"$f":"IF($B234=\"\",\"\",VLOOKUP($B234,Data!$A$4:$T$727,2,FALSE))","v":""},{"$f":"IF($B234=\"\",\"\",VLOOKUP($B234,Data!$A$4:$T$727,10,FALSE))","v":""},{"$f":"IF($B234=\"\",\"\",VLOOKUP($B234,Data!$A$4:$T$727,4,FALSE))","v":""},{"$f":"IF($B234=\"\",\"\",VLOOKUP($B234,Data!$A$4:$T$727,5,FALSE))","v":""},{"$f":"IF($B234=\"\",\"\",VLOOKUP($B234,Data!$A$4:$T$727,7,FALSE))","v":""},"","","","",{"$f":"IF($I$15=\"Show\",VLOOKUP($B234,Data!$A$4:$T$727,9,FALSE),VLOOKUP($B234,Data!$A$4:$T$727,7,FALSE))","v":{"$error":"#N/A"}},{"$f":"IF($B234=\"\",\"\",VLOOKUP($B234,Data!$A$4:$T$727,6,FALSE))","v":""},"",{"$f":"IF($B234=\"\",\"\",IF(VLOOKUP($B234,Data!$A$4:$T$727,11,FALSE)<1,\"\",VLOOKUP(B234,Data!$A$4:$T$727,11,FALSE)))","v":""}]
[null,null,{"$f":"IF($B235=\"\",\"\",VLOOKUP($B235,Data!$A$4:$T$727,2,FALSE))","v":""},{"$f":"IF($B235=\"\",\"\",VLOOKUP($B235,Data!$A$4:$T$727,10,FALSE))","v":""},{"$f":"IF($B235=\"\",\"\",VLOOKUP($B235,Data!$A$4:$T$727,4,FALSE))","v":""},{"$f":"IF($B235=\"\",\"\",VLOOKUP($B235,Data!$A$4:$T$727,5,FALSE))","v":""},{"$f":"IF($B235=\"\",\"\",VLOOKUP($B235,Data!$A$4:$T$727,7,FALSE))","v":""},"","","","",{"$f":"IF($I$15=\"Show\",VLOOKUP($B235,Data!$A$4:$T$727,9,FALSE),VLOOKUP($B235,Data!$A$4:$T$727,7,FALSE))","v":{"$error":"#N/A"}},{"$f":"IF($B235=\"\",\"\",VLOOKUP($B235,Data!$A$4:$T$727,6,FALSE))","v":""},"",{"$f":"IF($B235=\"\",\"\",IF(VLOOKUP($B235,Data!$A$4:$T$727,11,FALSE)<1,\"\",VLOOKUP(B235,Data!$A$4:$T$727,11,FALSE)))","v":""}]
[null,null,{"$f":"IF($B236=\"\",\"\",VLOOKUP($B236,Data!$A$4:$T$727,2,FALSE))","v":""},{"$f":"IF($B236=\"\",\"\",VLOOKUP($B236,Data!$A$4:$T$727,10,FALSE))","v":""},{"$f":"IF($B236=\"\",\"\",VLOOKUP($B236,Data!$A$4:$T$727,4,FALSE))","v":""},{"$f":"IF($B236=\"\",\"\",VLOOKUP($B236,Data!$A$4:$T$727,5,FALSE))","v":""},{"$f":"IF($B236=\"\",\"\",VLOOKUP($B236,Data!$A$4:$T$727,7,FALSE))","v":""},"","","","",{"$f":"IF($I$15=\"Show\",VLOOKUP($B236,Data!$A$4:$T$727,9,FALSE),VLOOKUP($B236,Data!$A$4:$T$727,7,FALSE))","v":{"$error":"#N/A"}},{"$f":"IF($B236=\"\",\"\",VLOOKUP($B236,Data!$A$4:$T$727,6,FALSE))","v":""},"",{"$f":"IF($B236=\"\",\"\",IF(VLOOKUP($B236,Data!$A$4:$T$727,11,FALSE)<1,\"\",VLOOKUP(B236,Data!$A$4:$T$727,11,FALSE)))","v":""}]
[null,null,{"$f":"IF($B237=\"\",\"\",VLOOKUP($B237,Data!$A$4:$T$727,2,FALSE))","v":""},{"$f":"IF($B237=\"\",\"\",VLOOKUP($B237,Data!$A$4:$T$727,10,FALSE))","v":""},{"$f":"IF($B237=\"\",\"\",VLOOKUP($B237,Data!$A$4:$T$727,4,FALSE))","v":""},{"$f":"IF($B237=\"\",\"\",VLOOKUP($B237,Data!$A$4:$T$727,5,FALSE))","v":""},{"$f":"IF($B237=\"\",\"\",VLOOKUP($B237,Data!$A$4:$T$727,7,FALSE))","v":""},"","","","",{"$f":"IF($I$15=\"Show\",VLOOKUP($B237,Data!$A$4:$T$727,9,FALSE),VLOOKUP($B237,Data!$A$4:$T$727,7,FALSE))","v":{"$error":"#N/A"}},{"$f":"IF($B237=\"\",\"\",VLOOKUP($B237,Data!$A$4:$T$727,6,FALSE))","v":""},"",{"$f":"IF($B237=\"\",\"\",IF(VLOOKUP($B237,Data!$A$4:$T$727,11,FALSE)<1,\"\",VLOOKUP(B237,Data!$A$4:$T$727,11,FALSE)))","v":""}]
[null,null,{"$f":"IF($B238=\"\",\"\",VLOOKUP($B238,Data!$A$4:$T$727,2,FALSE))","v":""},{"$f":"IF($B238=\"\",\"\",VLOOKUP($B238,Data!$A$4:$T$727,10,FALSE))","v":""},{"$f":"IF($B238=\"\",\"\",VLOOKUP($B238,Data!$A$4:$T$727,4,FALSE))","v":""},{"$f":"IF($B238=\"\",\"\",VLOOKUP($B238,Data!$A$4:$T$727,5,FALSE))","v":""},{"$f":"IF($B238=\"\",\"\",VLOOKUP($B238,Data!$A$4:$T$727,7,FALSE))","v":""},"","","","",{"$f":"IF($I$15=\"Show\",VLOOKUP($B238,Data!$A$4:$T$727,9,FALSE),VLOOKUP($B238,Data!$A$4:$T$727,7,FALSE))","v":{"$error":"#N/A"}},{"$f":"IF($B238=\"\",\"\",VLOOKUP($B238,Data!$A$4:$T$727,6,FALSE))","v":""},"",{"$f":"IF($B238=\"\",\"\",IF(VLOOKUP($B238,Data!$A$4:$T$727,11,FALSE)<1,\"\",VLOOKUP(B238,Data!$A$4:$T$727,11,FALSE)))","v":""}]
[null,null,{"$f":"IF($B239=\"\",\"\",VLOOKUP($B239,Data!$A$4:$T$727,2,FALSE))","v":""},{"$f":"IF($B239=\"\",\"\",VLOOKUP($B239,Data!$A$4:$T$727,10,FALSE))","v":""},{"$f":"IF($B239=\"\",\"\",VLOOKUP($B239,Data!$A$4:$T$727,4,FALSE))","v":""},{"$f":"IF($B239=\"\",\"\",VLOOKUP($B239,Data!$A$4:$T$727,5,FALSE))","v":""},{"$f":"IF($B239=\"\",\"\",VLOOKUP($B239,Data!$A$4:$T$727,7,FALSE))","v":""},"","","","",{"$f":"IF($I$15=\"Show\",VLOOKUP($B239,Data!$A$4:$T$727,9,FALSE),VLOOKUP($B239,Data!$A$4:$T$727,7,FALSE))","v":{"$error":"#N/A"}},{"$f":"IF($B239=\"\",\"\",VLOOKUP($B239,Data!$A$4:$T$727,6,FALSE))","v":""},"",{"$f":"IF($B239=\"\",\"\",IF(VLOOKUP($B239,Data!$A$4:$T$727,11,FALSE)<1,\"\",VLOOKUP(B239,Data!$A$4:$T$727,11,FALSE)))","v":""}]
[null,null,{"$f":"IF($B240=\"\",\"\",VLOOKUP($B240,Data!$A$4:$T$727,2,FALSE))","v":""},{"$f":"IF($B240=\"\",\"\",VLOOKUP($B240,Data!$A$4:$T$727,10,FALSE))","v":""},{"$f":"IF($B240=\"\",\"\",VLOOKUP($B240,Data!$A$4:$T$727,4,FALSE))","v":""},{"$f":"IF($B240=\"\",\"\",VLOOKUP($B240,Data!$A$4:$T$727,5,FALSE))","v":""},{"$f":"IF($B240=\"\",\"\",VLOOKUP($B240,Data!$A$4:$T$727,7,FALSE))","v":""},"","","","",{"$f":"IF($I$15=\"Show\",VLOOKUP($B240,Data!$A$4:$T$727,9,FALSE),VLOOKUP($B240,Data!$A$4:$T$727,7,FALSE))","v":{"$error":"#N/A"}},{"$f":"IF($B240=\"\",\"\",VLOOKUP($B240,Data!$A$4:$T$727,6,FALSE))","v":""},"",{"$f":"IF($B240=\"\",\"\",IF(VLOOKUP($B240,Data!$A$4:$T$727,11,FALSE)<1,\"\",VLOOKUP(B240,Data!$A$4:$T$727,11,FALSE)))","v":""}]
[null,null,{"$f":"IF($B241=\"\",\"\",VLOOKUP($B241,Data!$A$4:$T$727,2,FALSE))","v":""},{"$f":"IF($B241=\"\",\"\",VLOOKUP($B241,Data!$A$4:$T$727,10,FALSE))","v":""},{"$f":"IF($B241=\"\",\"\",VLOOKUP($B241,Data!$A$4:$T$727,4,FALSE))","v":""},{"$f":"IF($B241=\"\",\"\",VLOOKUP($B241,Data!$A$4:$T$727,5,FALSE))","v":""},{"$f":"IF($B241=\"\",\"\",VLOOKUP($B241,Data!$A$4:$T$727,7,FALSE))","v":""},"","","","",{"$f":"IF($I$15=\"Show\",VLOOKUP($B241,Data!$A$4:$T$727,9,FALSE),VLOOKUP($B241,Data!$A$4:$T$727,7,FALSE))","v":{"$error":"#N/A"}},{"$f":"IF($B241=\"\",\"\",VLOOKUP($B241,Data!$A$4:$T$727,6,FALSE))","v":""},"",{"$f":"IF($B241=\"\",\"\",IF(VLOOKUP($B241,Data!$A$4:$T$727,11,FALSE)<1,\"\",VLOOKUP(B241,Data!$A$4:$T$727,11,FALSE)))","v":""}]
[null,null,{"$f":"IF($B242=\"\",\"\",VLOOKUP($B242,Data!$A$4:$T$727,2,FALSE))","v":""},{"$f":"IF($B242=\"\",\"\",VLOOKUP($B242,Data!$A$4:$T$727,10,FALSE))","v":""},{"$f":"IF($B242=\"\",\"\",VLOOKUP($B242,Data!$A$4:$T$727,4,FALSE))","v":""},{"$f":"IF($B242=\"\",\"\",VLOOKUP($B242,Data!$A$4:$T$727,5,FALSE))","v":""},{"$f":"IF($B242=\"\",\"\",VLOOKUP($B242,Data!$A$4:$T$727,7,FALSE))","v":""},"","","","",{"$f":"IF($I$15=\"Show\",VLOOKUP($B242,Data!$A$4:$T$727,9,FALSE),VLOOKUP($B242,Data!$A$4:$T$727,7,FALSE))","v":{"$error":"#N/A"}},{"$f":"IF($B242=\"\",\"\",VLOOKUP($B242,Data!$A$4:$T$727,6,FALSE))","v":""},"",{"$f":"IF($B242=\"\",\"\",IF(VLOOKUP($B242,Data!$A$4:$T$727,11,FALSE)<1,\"\",VLOOKUP(B242,Data!$A$4:$T$727,11,FALSE)))","v":""}]
[null,null,{"$f":"IF($B243=\"\",\"\",VLOOKUP($B243,Data!$A$4:$T$727,2,FALSE))","v":""},{"$f":"IF($B243=\"\",\"\",VLOOKUP($B243,Data!$A$4:$T$727,10,FALSE))","v":""},{"$f":"IF($B243=\"\",\"\",VLOOKUP($B243,Data!$A$4:$T$727,4,FALSE))","v":""},{"$f":"IF($B243=\"\",\"\",VLOOKUP($B243,Data!$A$4:$T$727,5,FALSE))","v":""},{"$f":"IF($B243=\"\",\"\",VLOOKUP($B243,Data!$A$4:$T$727,7,FALSE))","v":""},"","","","",{"$f":"IF($I$15=\"Show\",VLOOKUP($B243,Data!$A$4:$T$727,9,FALSE),VLOOKUP($B243,Data!$A$4:$T$727,7,FALSE))","v":{"$error":"#N/A"}},{"$f":"IF($B243=\"\",\"\",VLOOKUP($B243,Data!$A$4:$T$727,6,FALSE))","v":""},"",{"$f":"IF($B243=\"\",\"\",IF(VLOOKUP($B243,Data!$A$4:$T$727,11,FALSE)<1,\"\",VLOOKUP(B243,Data!$A$4:$T$727,11,FALSE)))","v":""}]
[null,null,{"$f":"IF($B244=\"\",\"\",VLOOKUP($B244,Data!$A$4:$T$727,2,FALSE))","v":""},{"$f":"IF($B244=\"\",\"\",VLOOKUP($B244,Data!$A$4:$T$727,10,FALSE))","v":""},{"$f":"IF($B244=\"\",\"\",VLOOKUP($B244,Data!$A$4:$T$727,4,FALSE))","v":""},{"$f":"IF($B244=\"\",\"\",VLOOKUP($B244,Data!$A$4:$T$727,5,FALSE))","v":""},{"$f":"IF($B244=\"\",\"\",VLOOKUP($B244,Data!$A$4:$T$727,7,FALSE))","v":""},"","","","",{"$f":"IF($I$15=\"Show\",VLOOKUP($B244,Data!$A$4:$T$727,9,FALSE),VLOOKUP($B244,Data!$A$4:$T$727,7,FALSE))","v":{"$error":"#N/A"}},{"$f":"IF($B244=\"\",\"\",VLOOKUP($B244,Data!$A$4:$T$727,6,FALSE))","v":""},"",{"$f":"IF($B244=\"\",\"\",IF(VLOOKUP($B244,Data!$A$4:$T$727,11,FALSE)<1,\"\",VLOOKUP(B244,Data!$A$4:$T$727,11,FALSE)))","v":""}]
[null,null,{"$f":"IF($B245=\"\",\"\",VLOOKUP($B245,Data!$A$4:$T$727,2,FALSE))","v":""},{"$f":"IF($B245=\"\",\"\",VLOOKUP($B245,Data!$A$4:$T$727,10,FALSE))","v":""},{"$f":"IF($B245=\"\",\"\",VLOOKUP($B245,Data!$A$4:$T$727,4,FALSE))","v":""},{"$f":"IF($B245=\"\",\"\",VLOOKUP($B245,Data!$A$4:$T$727,5,FALSE))","v":""},{"$f":"IF($B245=\"\",\"\",VLOOKUP($B245,Data!$A$4:$T$727,7,FALSE))","v":""},"","","","",{"$f":"IF($I$15=\"Show\",VLOOKUP($B245,Data!$A$4:$T$727,9,FALSE),VLOOKUP($B245,Data!$A$4:$T$727,7,FALSE))","v":{"$error":"#N/A"}},{"$f":"IF($B245=\"\",\"\",VLOOKUP($B245,Data!$A$4:$T$727,6,FALSE))","v":""},"",{"$f":"IF($B245=\"\",\"\",IF(VLOOKUP($B245,Data!$A$4:$T$727,11,FALSE)<1,\"\",VLOOKUP(B245,Data!$A$4:$T$727,11,FALSE)))","v":""}]
[null,null,{"$f":"IF($B246=\"\",\"\",VLOOKUP($B246,Data!$A$4:$T$727,2,FALSE))","v":""},{"$f":"IF($B246=\"\",\"\",VLOOKUP($B246,Data!$A$4:$T$727,10,FALSE))","v":""},{"$f":"IF($B246=\"\",\"\",VLOOKUP($B246,Data!$A$4:$T$727,4,FALSE))","v":""},{"$f":"IF($B246=\"\",\"\",VLOOKUP($B246,Data!$A$4:$T$727,5,FALSE))","v":""},{"$f":"IF($B246=\"\",\"\",VLOOKUP($B246,Data!$A$4:$T$727,7,FALSE))","v":""},"","","","",{"$f":"IF($I$15=\"Show\",VLOOKUP($B246,Data!$A$4:$T$727,9,FALSE),VLOOKUP($B246,Data!$A$4:$T$727,7,FALSE))","v":{"$error":"#N/A"}},{"$f":"IF($B246=\"\",\"\",VLOOKUP($B246,Data!$A$4:$T$727,6,FALSE))","v":""},"",{"$f":"IF($B246=\"\",\"\",IF(VLOOKUP($B246,Data!$A$4:$T$727,11,FALSE)<1,\"\",VLOOKUP(B246,Data!$A$4:$T$727,11,FALSE)))","v":""}]
[null,null,{"$f":"IF($B247=\"\",\"\",VLOOKUP($B247,Data!$A$4:$T$727,2,FALSE))","v":""},{"$f":"IF($B247=\"\",\"\",VLOOKUP($B247,Data!$A$4:$T$727,10,FALSE))","v":""},{"$f":"IF($B247=\"\",\"\",VLOOKUP($B247,Data!$A$4:$T$727,4,FALSE))","v":""},{"$f":"IF($B247=\"\",\"\",VLOOKUP($B247,Data!$A$4:$T$727,5,FALSE))","v":""},{"$f":"IF($B247=\"\",\"\",VLOOKUP($B247,Data!$A$4:$T$727,7,FALSE))","v":""},"","","","",{"$f":"IF($I$15=\"Show\",VLOOKUP($B247,Data!$A$4:$T$727,9,FALSE),VLOOKUP($B247,Data!$A$4:$T$727,7,FALSE))","v":{"$error":"#N/A"}},{"$f":"IF($B247=\"\",\"\",VLOOKUP($B247,Data!$A$4:$T$727,6,FALSE))","v":""},"",{"$f":"IF($B247=\"\",\"\",IF(VLOOKUP($B247,Data!$A$4:$T$727,11,FALSE)<1,\"\",VLOOKUP(B247,Data!$A$4:$T$727,11,FALSE)))","v":""}]
[null,null,{"$f":"IF($B248=\"\",\"\",VLOOKUP($B248,Data!$A$4:$T$727,2,FALSE))","v":""},{"$f":"IF($B248=\"\",\"\",VLOOKUP($B248,Data!$A$4:$T$727,10,FALSE))","v":""},{"$f":"IF($B248=\"\",\"\",VLOOKUP($B248,Data!$A$4:$T$727,4,FALSE))","v":""},{"$f":"IF($B248=\"\",\"\",VLOOKUP($B248,Data!$A$4:$T$727,5,FALSE))","v":""},{"$f":"IF($B248=\"\",\"\",VLOOKUP($B248,Data!$A$4:$T$727,7,FALSE))","v":""},"","","","",{"$f":"IF($I$15=\"Show\",VLOOKUP($B248,Data!$A$4:$T$727,9,FALSE),VLOOKUP($B248,Data!$A$4:$T$727,7,FALSE))","v":{"$error":"#N/A"}},{"$f":"IF($B248=\"\",\"\",VLOOKUP($B248,Data!$A$4:$T$727,6,FALSE))","v":""},"",{"$f":"IF($B248=\"\",\"\",IF(VLOOKUP($B248,Data!$A$4:$T$727,11,FALSE)<1,\"\",VLOOKUP(B248,Data!$A$4:$T$727,11,FALSE)))","v":""}]
[null,null,{"$f":"IF($B249=\"\",\"\",VLOOKUP($B249,Data!$A$4:$T$727,2,FALSE))","v":""},{"$f":"IF($B249=\"\",\"\",VLOOKUP($B249,Data!$A$4:$T$727,10,FALSE))","v":""},{"$f":"IF($B249=\"\",\"\",VLOOKUP($B249,Data!$A$4:$T$727,4,FALSE))","v":""},{"$f":"IF($B249=\"\",\"\",VLOOKUP($B249,Data!$A$4:$T$727,5,FALSE))","v":""},{"$f":"IF($B249=\"\",\"\",VLOOKUP($B249,Data!$A$4:$T$727,7,FALSE))","v":""},"","","","",{"$f":"IF($I$15=\"Show\",VLOOKUP($B249,Data!$A$4:$T$727,9,FALSE),VLOOKUP($B249,Data!$A$4:$T$727,7,FALSE))","v":{"$error":"#N/A"}},{"$f":"IF($B249=\"\",\"\",VLOOKUP($B249,Data!$A$4:$T$727,6,FALSE))","v":""},"",{"$f":"IF($B249=\"\",\"\",IF(VLOOKUP($B249,Data!$A$4:$T$727,11,FALSE)<1,\"\",VLOOKUP(B249,Data!$A$4:$T$727,11,FALSE)))","v":""}]
[null,null,{"$f":"IF($B250=\"\",\"\",VLOOKUP($B250,Data!$A$4:$T$727,2,FALSE))","v":""},{"$f":"IF($B250=\"\",\"\",VLOOKUP($B250,Data!$A$4:$T$727,10,FALSE))","v":""},{"$f":"IF($B250=\"\",\"\",VLOOKUP($B250,Data!$A$4:$T$727,4,FALSE))","v":""},{"$f":"IF($B250=\"\",\"\",VLOOKUP($B250,Data!$A$4:$T$727,5,FALSE))","v":""},{"$f":"IF($B250=\"\",\"\",VLOOKUP($B250,Data!$A$4:$T$727,7,FALSE))","v":""},"","","","",{"$f":"IF($I$15=\"Show\",VLOOKUP($B250,Data!$A$4:$T$727,9,FALSE),VLOOKUP($B250,Data!$A$4:$T$727,7,FALSE))","v":{"$error":"#N/A"}},{"$f":"IF($B250=\"\",\"\",VLOOKUP($B250,Data!$A$4:$T$727,6,FALSE))","v":""},"",{"$f":"IF($B250=\"\",\"\",IF(VLOOKUP($B250,Data!$A$4:$T$727,11,FALSE)<1,\"\",VLOOKUP(B250,Data!$A$4:$T$727,11,FALSE)))","v":""}]
[null,null,{"$f":"IF($B251=\"\",\"\",VLOOKUP($B251,Data!$A$4:$T$727,2,FALSE))","v":""},{"$f":"IF($B251=\"\",\"\",VLOOKUP($B251,Data!$A$4:$T$727,10,FALSE))","v":""},{"$f":"IF($B251=\"\",\"\",VLOOKUP($B251,Data!$A$4:$T$727,4,FALSE))","v":""},{"$f":"IF($B251=\"\",\"\",VLOOKUP($B251,Data!$A$4:$T$727,5,FALSE))","v":""},{"$f":"IF($B251=\"\",\"\",VLOOKUP($B251,Data!$A$4:$T$727,7,FALSE))","v":""},"","","","",{"$f":"IF($I$15=\"Show\",VLOOKUP($B251,Data!$A$4:$T$727,9,FALSE),VLOOKUP($B251,Data!$A$4:$T$727,7,FALSE))","v":{"$error":"#N/A"}},{"$f":"IF($B251=\"\",\"\",VLOOKUP($B251,Data!$A$4:$T$727,6,FALSE))","v":""},"",{"$f":"IF($B251=\"\",\"\",IF(VLOOKUP($B251,Data!$A$4:$T$727,11,FALSE)<1,\"\",VLOOKUP(B251,Data!$A$4:$T$727,11,FALSE)))","v":""}]
[null,null,{"$f":"IF($B252=\"\",\"\",VLOOKUP($B252,Data!$A$4:$T$727,2,FALSE))","v":""},{"$f":"IF($B252=\"\",\"\",VLOOKUP($B252,Data!$A$4:$T$727,10,FALSE))","v":""},{"$f":"IF($B252=\"\",\"\",VLOOKUP($B252,Data!$A$4:$T$727,4,FALSE))","v":""},{"$f":"IF($B252=\"\",\"\",VLOOKUP($B252,Data!$A$4:$T$727,5,FALSE))","v":""},{"$f":"IF($B252=\"\",\"\",VLOOKUP($B252,Data!$A$4:$T$727,7,FALSE))","v":""},"","","","",{"$f":"IF($I$15=\"Show\",VLOOKUP($B252,Data!$A$4:$T$727,9,FALSE),VLOOKUP($B252,Data!$A$4:$T$727,7,FALSE))","v":{"$error":"#N/A"}},{"$f":"IF($B252=\"\",\"\",VLOOKUP($B252,Data!$A$4:$T$727,6,FALSE))","v":""},"",{"$f":"IF($B252=\"\",\"\",IF(VLOOKUP($B252,Data!$A$4:$T$727,11,FALSE)<1,\"\",VLOOKUP(B252,Data!$A$4:$T$727,11,FALSE)))","v":""}]
[null,null,{"$f":"IF($B253=\"\",\"\",VLOOKUP($B253,Data!$A$4:$T$727,2,FALSE))","v":""},{"$f":"IF($B253=\"\",\"\",VLOOKUP($B253,Data!$A$4:$T$727,10,FALSE))","v":""},{"$f":"IF($B253=\"\",\"\",VLOOKUP($B253,Data!$A$4:$T$727,4,FALSE))","v":""},{"$f":"IF($B253=\"\",\"\",VLOOKUP($B253,Data!$A$4:$T$727,5,FALSE))","v":""},{"$f":"IF($B253=\"\",\"\",VLOOKUP($B253,Data!$A$4:$T$727,7,FALSE))","v":""},"","","","",{"$f":"IF($I$15=\"Show\",VLOOKUP($B253,Data!$A$4:$T$727,9,FALSE),VLOOKUP($B253,Data!$A$4:$T$727,7,FALSE))","v":{"$error":"#N/A"}},{"$f":"IF($B253=\"\",\"\",VLOOKUP($B253,Data!$A$4:$T$727,6,FALSE))","v":""},"",{"$f":"IF($B253=\"\",\"\",IF(VLOOKUP($B253,Data!$A$4:$T$727,11,FALSE)<1,\"\",VLOOKUP(B253,Data!$A$4:$T$727,11,FALSE)))","v":""}]
[null,null,{"$f":"IF($B254=\"\",\"\",VLOOKUP($B254,Data!$A$4:$T$727,2,FALSE))","v":""},{"$f":"IF($B254=\"\",\"\",VLOOKUP($B254,Data!$A$4:$T$727,10,FALSE))","v":""},{"$f":"IF($B254=\"\",\"\",VLOOKUP($B254,Data!$A$4:$T$727,4,FALSE))","v":""},{"$f":"IF($B254=\"\",\"\",VLOOKUP($B254,Data!$A$4:$T$727,5,FALSE))","v":""},{"$f":"IF($B254=\"\",\"\",VLOOKUP($B254,Data!$A$4:$T$727,7,FALSE))","v":""},"","","","",{"$f":"IF($I$15=\"Show\",VLOOKUP($B254,Data!$A$4:$T$727,9,FALSE),VLOOKUP($B254,Data!$A$4:$T$727,7,FALSE))","v":{"$error":"#N/A"}},{"$f":"IF($B254=\"\",\"\",VLOOKUP($B254,Data!$A$4:$T$727,6,FALSE))","v":""},"",{"$f":"IF($B254=\"\",\"\",IF(VLOOKUP($B254,Data!$A$4:$T$727,11,FALSE)<1,\"\",VLOOKUP(B254,Data!$A$4:$T$727,11,FALSE)))","v":""}]
[null,null,{"$f":"IF($B255=\"\",\"\",VLOOKUP($B255,Data!$A$4:$T$727,2,FALSE))","v":""},{"$f":"IF($B255=\"\",\"\",VLOOKUP($B255,Data!$A$4:$T$727,10,FALSE))","v":""},{"$f":"IF($B255=\"\",\"\",VLOOKUP($B255,Data!$A$4:$T$727,4,FALSE))","v":""},{"$f":"IF($B255=\"\",\"\",VLOOKUP($B255,Data!$A$4:$T$727,5,FALSE))","v":""},{"$f":"IF($B255=\"\",\"\",VLOOKUP($B255,Data!$A$4:$T$727,7,FALSE))","v":""},"","","","",{"$f":"IF($I$15=\"Show\",VLOOKUP($B255,Data!$A$4:$T$727,9,FALSE),VLOOKUP($B255,Data!$A$4:$T$727,7,FALSE))","v":{"$error":"#N/A"}},{"$f":"IF($B255=\"\",\"\",VLOOKUP($B255,Data!$A$4:$T$727,6,FALSE))","v":""},"",{"$f":"IF($B255=\"\",\"\",IF(VLOOKUP($B255,Data!$A$4:$T$727,11,FALSE)<1,\"\",VLOOKUP(B255,Data!$A$4:$T$727,11,FALSE)))","v":""}]
[null,null,{"$f":"IF($B256=\"\",\"\",VLOOKUP($B256,Data!$A$4:$T$727,2,FALSE))","v":""},{"$f":"IF($B256=\"\",\"\",VLOOKUP($B256,Data!$A$4:$T$727,10,FALSE))","v":""},{"$f":"IF($B256=\"\",\"\",VLOOKUP($B256,Data!$A$4:$T$727,4,FALSE))","v":""},{"$f":"IF($B256=\"\",\"\",VLOOKUP($B256,Data!$A$4:$T$727,5,FALSE))","v":""},{"$f":"IF($B256=\"\",\"\",VLOOKUP($B256,Data!$A$4:$T$727,7,FALSE))","v":""},"","","","",{"$f":"IF($I$15=\"Show\",VLOOKUP($B256,Data!$A$4:$T$727,9,FALSE),VLOOKUP($B256,Data!$A$4:$T$727,7,FALSE))","v":{"$error":"#N/A"}},{"$f":"IF($B256=\"\",\"\",VLOOKUP($B256,Data!$A$4:$T$727,6,FALSE))","v":""},"",{"$f":"IF($B256=\"\",\"\",IF(VLOOKUP($B256,Data!$A$4:$T$727,11,FALSE)<1,\"\",VLOOKUP(B256,Data!$A$4:$T$727,11,FALSE)))","v":""}]
[null,null,{"$f":"IF($B257=\"\",\"\",VLOOKUP($B257,Data!$A$4:$T$727,2,FALSE))","v":""},{"$f":"IF($B257=\"\",\"\",VLOOKUP($B257,Data!$A$4:$T$727,10,FALSE))","v":""},{"$f":"IF($B257=\"\",\"\",VLOOKUP($B257,Data!$A$4:$T$727,4,FALSE))","v":""},{"$f":"IF($B257=\"\",\"\",VLOOKUP($B257,Data!$A$4:$T$727,5,FALSE))","v":""},{"$f":"IF($B257=\"\",\"\",VLOOKUP($B257,Data!$A$4:$T$727,7,FALSE))","v":""},"","","","",{"$f":"IF($I$15=\"Show\",VLOOKUP($B257,Data!$A$4:$T$727,9,FALSE),VLOOKUP($B257,Data!$A$4:$T$727,7,FALSE))","v":{"$error":"#N/A"}},{"$f":"IF($B257=\"\",\"\",VLOOKUP($B257,Data!$A$4:$T$727,6,FALSE))","v":""},"",{"$f":"IF($B257=\"\",\"\",IF(VLOOKUP($B257,Data!$A$4:$T$727,11,FALSE)<1,\"\",VLOOKUP(B257,Data!$A$4:$T$727,11,FALSE)))","v":""}]
[null,null,{"$f":"IF($B258=\"\",\"\",VLOOKUP($B258,Data!$A$4:$T$727,2,FALSE))","v":""},{"$f":"IF($B258=\"\",\"\",VLOOKUP($B258,Data!$A$4:$T$727,10,FALSE))","v":""},{"$f":"IF($B258=\"\",\"\",VLOOKUP($B258,Data!$A$4:$T$727,4,FALSE))","v":""},{"$f":"IF($B258=\"\",\"\",VLOOKUP($B258,Data!$A$4:$T$727,5,FALSE))","v":""},{"$f":"IF($B258=\"\",\"\",VLOOKUP($B258,Data!$A$4:$T$727,7,FALSE))","v":""},"","","","",{"$f":"IF($I$15=\"Show\",VLOOKUP($B258,Data!$A$4:$T$727,9,FALSE),VLOOKUP($B258,Data!$A$4:$T$727,7,FALSE))","v":{"$error":"#N/A"}},{"$f":"IF($B258=\"\",\"\",VLOOKUP($B258,Data!$A$4:$T$727,6,FALSE))","v":""},"",{"$f":"IF($B258=\"\",\"\",IF(VLOOKUP($B258,Data!$A$4:$T$727,11,FALSE)<1,\"\",VLOOKUP(B258,Data!$A$4:$T$727,11,FALSE)))","v":""}]
[null,null,{"$f":"IF($B259=\"\",\"\",VLOOKUP($B259,Data!$A$4:$T$727,2,FALSE))","v":""},{"$f":"IF($B259=\"\",\"\",VLOOKUP($B259,Data!$A$4:$T$727,10,FALSE))","v":""},{"$f":"IF($B259=\"\",\"\",VLOOKUP($B259,Data!$A$4:$T$727,4,FALSE))","v":""},{"$f":"IF($B259=\"\",\"\",VLOOKUP($B259,Data!$A$4:$T$727,5,FALSE))","v":""},{"$f":"IF($B259=\"\",\"\",VLOOKUP($B259,Data!$A$4:$T$727,7,FALSE))","v":""},"","","","",{"$f":"IF($I$15=\"Show\",VLOOKUP($B259,Data!$A$4:$T$727,9,FALSE),VLOOKUP($B259,Data!$A$4:$T$727,7,FALSE))","v":{"$error":"#N/A"}},{"$f":"IF($B259=\"\",\"\",VLOOKUP($B259,Data!$A$4:$T$727,6,FALSE))","v":""},"",{"$f":"IF($B259=\"\",\"\",IF(VLOOKUP($B259,Data!$A$4:$T$727,11,FALSE)<1,\"\",VLOOKUP(B259,Data!$A$4:$T$727,11,FALSE)))","v":""}]
[null,null,{"$f":"IF($B260=\"\",\"\",VLOOKUP($B260,Data!$A$4:$T$727,2,FALSE))","v":""},{"$f":"IF($B260=\"\",\"\",VLOOKUP($B260,Data!$A$4:$T$727,10,FALSE))","v":""},{"$f":"IF($B260=\"\",\"\",VLOOKUP($B260,Data!$A$4:$T$727,4,FALSE))","v":""},{"$f":"IF($B260=\"\",\"\",VLOOKUP($B260,Data!$A$4:$T$727,5,FALSE))","v":""},{"$f":"IF($B260=\"\",\"\",VLOOKUP($B260,Data!$A$4:$T$727,7,FALSE))","v":""},"","","","",{"$f":"IF($I$15=\"Show\",VLOOKUP($B260,Data!$A$4:$T$727,9,FALSE),VLOOKUP($B260,Data!$A$4:$T$727,7,FALSE))","v":{"$error":"#N/A"}},{"$f":"IF($B260=\"\",\"\",VLOOKUP($B260,Data!$A$4:$T$727,6,FALSE))","v":""},"",{"$f":"IF($B260=\"\",\"\",IF(VLOOKUP($B260,Data!$A$4:$T$727,11,FALSE)<1,\"\",VLOOKUP(B260,Data!$A$4:$T$727,11,FALSE)))","v":""}]
[null,null,{"$f":"IF($B261=\"\",\"\",VLOOKUP($B261,Data!$A$4:$T$727,2,FALSE))","v":""},{"$f":"IF($B261=\"\",\"\",VLOOKUP($B261,Data!$A$4:$T$727,10,FALSE))","v":""},{"$f":"IF($B261=\"\",\"\",VLOOKUP($B261,Data!$A$4:$T$727,4,FALSE))","v":""},{"$f":"IF($B261=\"\",\"\",VLOOKUP($B261,Data!$A$4:$T$727,5,FALSE))","v":""},{"$f":"IF($B261=\"\",\"\",VLOOKUP($B261,Data!$A$4:$T$727,7,FALSE))","v":""},"","","","",{"$f":"IF($I$15=\"Show\",VLOOKUP($B261,Data!$A$4:$T$727,9,FALSE),VLOOKUP($B261,Data!$A$4:$T$727,7,FALSE))","v":{"$error":"#N/A"}},{"$f":"IF($B261=\"\",\"\",VLOOKUP($B261,Data!$A$4:$T$727,6,FALSE))","v":""},"",{"$f":"IF($B261=\"\",\"\",IF(VLOOKUP($B261,Data!$A$4:$T$727,11,FALSE)<1,\"\",VLOOKUP(B261,Data!$A$4:$T$727,11,FALSE)))","v":""}]
[null,null,{"$f":"IF($B262=\"\",\"\",VLOOKUP($B262,Data!$A$4:$T$727,2,FALSE))","v":""},{"$f":"IF($B262=\"\",\"\",VLOOKUP($B262,Data!$A$4:$T$727,10,FALSE))","v":""},{"$f":"IF($B262=\"\",\"\",VLOOKUP($B262,Data!$A$4:$T$727,4,FALSE))","v":""},{"$f":"IF($B262=\"\",\"\",VLOOKUP($B262,Data!$A$4:$T$727,5,FALSE))","v":""},{"$f":"IF($B262=\"\",\"\",VLOOKUP($B262,Data!$A$4:$T$727,7,FALSE))","v":""},"","","","",{"$f":"IF($I$15=\"Show\",VLOOKUP($B262,Data!$A$4:$T$727,9,FALSE),VLOOKUP($B262,Data!$A$4:$T$727,7,FALSE))","v":{"$error":"#N/A"}},{"$f":"IF($B262=\"\",\"\",VLOOKUP($B262,Data!$A$4:$T$727,6,FALSE))","v":""},"",{"$f":"IF($B262=\"\",\"\",IF(VLOOKUP($B262,Data!$A$4:$T$727,11,FALSE)<1,\"\",VLOOKUP(B262,Data!$A$4:$T$727,11,FALSE)))","v":""}]
[null,null,{"$f":"IF($B263=\"\",\"\",VLOOKUP($B263,Data!$A$4:$T$727,2,FALSE))","v":""},{"$f":"IF($B263=\"\",\"\",VLOOKUP($B263,Data!$A$4:$T$727,10,FALSE))","v":""},{"$f":"IF($B263=\"\",\"\",VLOOKUP($B263,Data!$A$4:$T$727,4,FALSE))","v":""},{"$f":"IF($B263=\"\",\"\",VLOOKUP($B263,Data!$A$4:$T$727,5,FALSE))","v":""},{"$f":"IF($B263=\"\",\"\",VLOOKUP($B263,Data!$A$4:$T$727,7,FALSE))","v":""},"","","","",{"$f":"IF($I$15=\"Show\",VLOOKUP($B263,Data!$A$4:$T$727,9,FALSE),VLOOKUP($B263,Data!$A$4:$T$727,7,FALSE))","v":{"$error":"#N/A"}},{"$f":"IF($B263=\"\",\"\",VLOOKUP($B263,Data!$A$4:$T$727,6,FALSE))","v":""},"",{"$f":"IF($B263=\"\",\"\",IF(VLOOKUP($B263,Data!$A$4:$T$727,11,FALSE)<1,\"\",VLOOKUP(B263,Data!$A$4:$T$727,11,FALSE)))","v":""}]
[null,null,{"$f":"IF($B264=\"\",\"\",VLOOKUP($B264,Data!$A$4:$T$727,2,FALSE))","v":""},{"$f":"IF($B264=\"\",\"\",VLOOKUP($B264,Data!$A$4:$T$727,10,FALSE))","v":""},{"$f":"IF($B264=\"\",\"\",VLOOKUP($B264,Data!$A$4:$T$727,4,FALSE))","v":""},{"$f":"IF($B264=\"\",\"\",VLOOKUP($B264,Data!$A$4:$T$727,5,FALSE))","v":""},{"$f":"IF($B264=\"\",\"\",VLOOKUP($B264,Data!$A$4:$T$727,7,FALSE))","v":""},"","","","",{"$f":"IF($I$15=\"Show\",VLOOKUP($B264,Data!$A$4:$T$727,9,FALSE),VLOOKUP($B264,Data!$A$4:$T$727,7,FALSE))","v":{"$error":"#N/A"}},{"$f":"IF($B264=\"\",\"\",VLOOKUP($B264,Data!$A$4:$T$727,6,FALSE))","v":""},"",{"$f":"IF($B264=\"\",\"\",IF(VLOOKUP($B264,Data!$A$4:$T$727,11,FALSE)<1,\"\",VLOOKUP(B264,Data!$A$4:$T$727,11,FALSE)))","v":""}]
[null,null,{"$f":"IF($B265=\"\",\"\",VLOOKUP($B265,Data!$A$4:$T$727,2,FALSE))","v":""},{"$f":"IF($B265=\"\",\"\",VLOOKUP($B265,Data!$A$4:$T$727,10,FALSE))","v":""},{"$f":"IF($B265=\"\",\"\",VLOOKUP($B265,Data!$A$4:$T$727,4,FALSE))","v":""},{"$f":"IF($B265=\"\",\"\",VLOOKUP($B265,Data!$A$4:$T$727,5,FALSE))","v":""},{"$f":"IF($B265=\"\",\"\",VLOOKUP($B265,Data!$A$4:$T$727,7,FALSE))","v":""},"","","","",{"$f":"IF($I$15=\"Show\",VLOOKUP($B265,Data!$A$4:$T$727,9,FALSE),VLOOKUP($B265,Data!$A$4:$T$727,7,FALSE))","v":{"$error":"#N/A"}},{"$f":"IF($B265=\"\",\"\",VLOOKUP($B265,Data!$A$4:$T$727,6,FALSE))","v":""},"",{"$f":"IF($B265=\"\",\"\",IF(VLOOKUP($B265,Data!$A$4:$T$727,11,FALSE)<1,\"\",VLOOKUP(B265,Data!$A$4:$T$727,11,FALSE)))","v":""}]
[null,null,{"$f":"IF($B266=\"\",\"\",VLOOKUP($B266,Data!$A$4:$T$727,2,FALSE))","v":""},{"$f":"IF($B266=\"\",\"\",VLOOKUP($B266,Data!$A$4:$T$727,10,FALSE))","v":""},{"$f":"IF($B266=\"\",\"\",VLOOKUP($B266,Data!$A$4:$T$727,4,FALSE))","v":""},{"$f":"IF($B266=\"\",\"\",VLOOKUP($B266,Data!$A$4:$T$727,5,FALSE))","v":""},{"$f":"IF($B266=\"\",\"\",VLOOKUP($B266,Data!$A$4:$T$727,7,FALSE))","v":""},"","","","",{"$f":"IF($I$15=\"Show\",VLOOKUP($B266,Data!$A$4:$T$727,9,FALSE),VLOOKUP($B266,Data!$A$4:$T$727,7,FALSE))","v":{"$error":"#N/A"}},{"$f":"IF($B266=\"\",\"\",VLOOKUP($B266,Data!$A$4:$T$727,6,FALSE))","v":""},"",{"$f":"IF($B266=\"\",\"\",IF(VLOOKUP($B266,Data!$A$4:$T$727,11,FALSE)<1,\"\",VLOOKUP(B266,Data!$A$4:$T$727,11,FALSE)))","v":""}]
[null,null,{"$f":"IF($B267=\"\",\"\",VLOOKUP($B267,Data!$A$4:$T$727,2,FALSE))","v":""},{"$f":"IF($B267=\"\",\"\",VLOOKUP($B267,Data!$A$4:$T$727,10,FALSE))","v":""},{"$f":"IF($B267=\"\",\"\",VLOOKUP($B267,Data!$A$4:$T$727,4,FALSE))","v":""},{"$f":"IF($B267=\"\",\"\",VLOOKUP($B267,Data!$A$4:$T$727,5,FALSE))","v":""},{"$f":"IF($B267=\"\",\"\",VLOOKUP($B267,Data!$A$4:$T$727,7,FALSE))","v":""},"","","","",{"$f":"IF($I$15=\"Show\",VLOOKUP($B267,Data!$A$4:$T$727,9,FALSE),VLOOKUP($B267,Data!$A$4:$T$727,7,FALSE))","v":{"$error":"#N/A"}},{"$f":"IF($B267=\"\",\"\",VLOOKUP($B267,Data!$A$4:$T$727,6,FALSE))","v":""},"",{"$f":"IF($B267=\"\",\"\",IF(VLOOKUP($B267,Data!$A$4:$T$727,11,FALSE)<1,\"\",VLOOKUP(B267,Data!$A$4:$T$727,11,FALSE)))","v":""}]
[null,null,{"$f":"IF($B268=\"\",\"\",VLOOKUP($B268,Data!$A$4:$T$727,2,FALSE))","v":""},{"$f":"IF($B268=\"\",\"\",VLOOKUP($B268,Data!$A$4:$T$727,10,FALSE))","v":""},{"$f":"IF($B268=\"\",\"\",VLOOKUP($B268,Data!$A$4:$T$727,4,FALSE))","v":""},{"$f":"IF($B268=\"\",\"\",VLOOKUP($B268,Data!$A$4:$T$727,5,FALSE))","v":""},{"$f":"IF($B268=\"\",\"\",VLOOKUP($B268,Data!$A$4:$T$727,7,FALSE))","v":""},"","","","",{"$f":"IF($I$15=\"Show\",VLOOKUP($B268,Data!$A$4:$T$727,9,FALSE),VLOOKUP($B268,Data!$A$4:$T$727,7,FALSE))","v":{"$error":"#N/A"}},{"$f":"IF($B268=\"\",\"\",VLOOKUP($B268,Data!$A$4:$T$727,6,FALSE))","v":""},"",{"$f":"IF($B268=\"\",\"\",IF(VLOOKUP($B268,Data!$A$4:$T$727,11,FALSE)<1,\"\",VLOOKUP(B268,Data!$A$4:$T$727,11,FALSE)))","v":""}]
[null,null,{"$f":"IF($B269=\"\",\"\",VLOOKUP($B269,Data!$A$4:$T$727,2,FALSE))","v":""},{"$f":"IF($B269=\"\",\"\",VLOOKUP($B269,Data!$A$4:$T$727,10,FALSE))","v":""},{"$f":"IF($B269=\"\",\"\",VLOOKUP($B269,Data!$A$4:$T$727,4,FALSE))","v":""},{"$f":"IF($B269=\"\",\"\",VLOOKUP($B269,Data!$A$4:$T$727,5,FALSE))","v":""},{"$f":"IF($B269=\"\",\"\",VLOOKUP($B269,Data!$A$4:$T$727,7,FALSE))","v":""},"","","","",{"$f":"IF($I$15=\"Show\",VLOOKUP($B269,Data!$A$4:$T$727,9,FALSE),VLOOKUP($B269,Data!$A$4:$T$727,7,FALSE))","v":{"$error":"#N/A"}},{"$f":"IF($B269=\"\",\"\",VLOOKUP($B269,Data!$A$4:$T$727,6,FALSE))","v":""},"",{"$f":"IF($B269=\"\",\"\",IF(VLOOKUP($B269,Data!$A$4:$T$727,11,FALSE)<1,\"\",VLOOKUP(B269,Data!$A$4:$T$727,11,FALSE)))","v":""}]
[null,null,{"$f":"IF($B270=\"\",\"\",VLOOKUP($B270,Data!$A$4:$T$727,2,FALSE))","v":""},{"$f":"IF($B270=\"\",\"\",VLOOKUP($B270,Data!$A$4:$T$727,10,FALSE))","v":""},{"$f":"IF($B270=\"\",\"\",VLOOKUP($B270,Data!$A$4:$T$727,4,FALSE))","v":""},{"$f":"IF($B270=\"\",\"\",VLOOKUP($B270,Data!$A$4:$T$727,5,FALSE))","v":""},{"$f":"IF($B270=\"\",\"\",VLOOKUP($B270,Data!$A$4:$T$727,7,FALSE))","v":""},"","","","",{"$f":"IF($I$15=\"Show\",VLOOKUP($B270,Data!$A$4:$T$727,9,FALSE),VLOOKUP($B270,Data!$A$4:$T$727,7,FALSE))","v":{"$error":"#N/A"}},{"$f":"IF($B270=\"\",\"\",VLOOKUP($B270,Data!$A$4:$T$727,6,FALSE))","v":""},"",{"$f":"IF($B270=\"\",\"\",IF(VLOOKUP($B270,Data!$A$4:$T$727,11,FALSE)<1,\"\",VLOOKUP(B270,Data!$A$4:$T$727,11,FALSE)))","v":""}]
[null,null,{"$f":"IF($B271=\"\",\"\",VLOOKUP($B271,Data!$A$4:$T$727,2,FALSE))","v":""},{"$f":"IF($B271=\"\",\"\",VLOOKUP($B271,Data!$A$4:$T$727,10,FALSE))","v":""},{"$f":"IF($B271=\"\",\"\",VLOOKUP($B271,Data!$A$4:$T$727,4,FALSE))","v":""},{"$f":"IF($B271=\"\",\"\",VLOOKUP($B271,Data!$A$4:$T$727,5,FALSE))","v":""},{"$f":"IF($B271=\"\",\"\",VLOOKUP($B271,Data!$A$4:$T$727,7,FALSE))","v":""},"","","","",{"$f":"IF($I$15=\"Show\",VLOOKUP($B271,Data!$A$4:$T$727,9,FALSE),VLOOKUP($B271,Data!$A$4:$T$727,7,FALSE))","v":{"$error":"#N/A"}},{"$f":"IF($B271=\"\",\"\",VLOOKUP($B271,Data!$A$4:$T$727,6,FALSE))","v":""},"",{"$f":"IF($B271=\"\",\"\",IF(VLOOKUP($B271,Data!$A$4:$T$727,11,FALSE)<1,\"\",VLOOKUP(B271,Data!$A$4:$T$727,11,FALSE)))","v":""}]
[null,null,{"$f":"IF($B272=\"\",\"\",VLOOKUP($B272,Data!$A$4:$T$727,2,FALSE))","v":""},{"$f":"IF($B272=\"\",\"\",VLOOKUP($B272,Data!$A$4:$T$727,10,FALSE))","v":""},{"$f":"IF($B272=\"\",\"\",VLOOKUP($B272,Data!$A$4:$T$727,4,FALSE))","v":""},{"$f":"IF($B272=\"\",\"\",VLOOKUP($B272,Data!$A$4:$T$727,5,FALSE))","v":""},{"$f":"IF($B272=\"\",\"\",VLOOKUP($B272,Data!$A$4:$T$727,7,FALSE))","v":""},"","","","",{"$f":"IF($I$15=\"Show\",VLOOKUP($B272,Data!$A$4:$T$727,9,FALSE),VLOOKUP($B272,Data!$A$4:$T$727,7,FALSE))","v":{"$error":"#N/A"}},{"$f":"IF($B272=\"\",\"\",VLOOKUP($B272,Data!$A$4:$T$727,6,FALSE))","v":""},"",{"$f":"IF($B272=\"\",\"\",IF(VLOOKUP($B272,Data!$A$4:$T$727,11,FALSE)<1,\"\",VLOOKUP(B272,Data!$A$4:$T$727,11,FALSE)))","v":""}]
[null,null,{"$f":"IF($B273=\"\",\"\",VLOOKUP($B273,Data!$A$4:$T$727,2,FALSE))","v":""},{"$f":"IF($B273=\"\",\"\",VLOOKUP($B273,Data!$A$4:$T$727,10,FALSE))","v":""},{"$f":"IF($B273=\"\",\"\",VLOOKUP($B273,Data!$A$4:$T$727,4,FALSE))","v":""},{"$f":"IF($B273=\"\",\"\",VLOOKUP($B273,Data!$A$4:$T$727,5,FALSE))","v":""},{"$f":"IF($B273=\"\",\"\",VLOOKUP($B273,Data!$A$4:$T$727,7,FALSE))","v":""},"","","","",{"$f":"IF($I$15=\"Show\",VLOOKUP($B273,Data!$A$4:$T$727,9,FALSE),VLOOKUP($B273,Data!$A$4:$T$727,7,FALSE))","v":{"$error":"#N/A"}},{"$f":"IF($B273=\"\",\"\",VLOOKUP($B273,Data!$A$4:$T$727,6,FALSE))","v":""},"",{"$f":"IF($B273=\"\",\"\",IF(VLOOKUP($B273,Data!$A$4:$T$727,11,FALSE)<1,\"\",VLOOKUP(B273,Data!$A$4:$T$727,11,FALSE)))","v":""}]
[null,null,{"$f":"IF($B274=\"\",\"\",VLOOKUP($B274,Data!$A$4:$T$727,2,FALSE))","v":""},{"$f":"IF($B274=\"\",\"\",VLOOKUP($B274,Data!$A$4:$T$727,10,FALSE))","v":""},{"$f":"IF($B274=\"\",\"\",VLOOKUP($B274,Data!$A$4:$T$727,4,FALSE))","v":""},{"$f":"IF($B274=\"\",\"\",VLOOKUP($B274,Data!$A$4:$T$727,5,FALSE))","v":""},{"$f":"IF($B274=\"\",\"\",VLOOKUP($B274,Data!$A$4:$T$727,7,FALSE))","v":""},"","","","",{"$f":"IF($I$15=\"Show\",VLOOKUP($B274,Data!$A$4:$T$727,9,FALSE),VLOOKUP($B274,Data!$A$4:$T$727,7,FALSE))","v":{"$error":"#N/A"}},{"$f":"IF($B274=\"\",\"\",VLOOKUP($B274,Data!$A$4:$T$727,6,FALSE))","v":""},"",{"$f":"IF($B274=\"\",\"\",IF(VLOOKUP($B274,Data!$A$4:$T$727,11,FALSE)<1,\"\",VLOOKUP(B274,Data!$A$4:$T$727,11,FALSE)))","v":""}]
[null,null,{"$f":"IF($B275=\"\",\"\",VLOOKUP($B275,Data!$A$4:$T$727,2,FALSE))","v":""},{"$f":"IF($B275=\"\",\"\",VLOOKUP($B275,Data!$A$4:$T$727,10,FALSE))","v":""},{"$f":"IF($B275=\"\",\"\",VLOOKUP($B275,Data!$A$4:$T$727,4,FALSE))","v":""},{"$f":"IF($B275=\"\",\"\",VLOOKUP($B275,Data!$A$4:$T$727,5,FALSE))","v":""},{"$f":"IF($B275=\"\",\"\",VLOOKUP($B275,Data!$A$4:$T$727,7,FALSE))","v":""},"","","","",{"$f":"IF($I$15=\"Show\",VLOOKUP($B275,Data!$A$4:$T$727,9,FALSE),VLOOKUP($B275,Data!$A$4:$T$727,7,FALSE))","v":{"$error":"#N/A"}},{"$f":"IF($B275=\"\",\"\",VLOOKUP($B275,Data!$A$4:$T$727,6,FALSE))","v":""},"",{"$f":"IF($B275=\"\",\"\",IF(VLOOKUP($B275,Data!$A$4:$T$727,11,FALSE)<1,\"\",VLOOKUP(B275,Data!$A$4:$T$727,11,FALSE)))","v":""}]
[null,null,{"$f":"IF($B276=\"\",\"\",VLOOKUP($B276,Data!$A$4:$T$727,2,FALSE))","v":""},{"$f":"IF($B276=\"\",\"\",VLOOKUP($B276,Data!$A$4:$T$727,10,FALSE))","v":""},{"$f":"IF($B276=\"\",\"\",VLOOKUP($B276,Data!$A$4:$T$727,4,FALSE))","v":""},{"$f":"IF($B276=\"\",\"\",VLOOKUP($B276,Data!$A$4:$T$727,5,FALSE))","v":""},{"$f":"IF($B276=\"\",\"\",VLOOKUP($B276,Data!$A$4:$T$727,7,FALSE))","v":""},"","","","",{"$f":"IF($I$15=\"Show\",VLOOKUP($B276,Data!$A$4:$T$727,9,FALSE),VLOOKUP($B276,Data!$A$4:$T$727,7,FALSE))","v":{"$error":"#N/A"}},{"$f":"IF($B276=\"\",\"\",VLOOKUP($B276,Data!$A$4:$T$727,6,FALSE))","v":""},"",{"$f":"IF($B276=\"\",\"\",IF(VLOOKUP($B276,Data!$A$4:$T$727,11,FALSE)<1,\"\",VLOOKUP(B276,Data!$A$4:$T$727,11,FALSE)))","v":""}]
[null,null,{"$f":"IF($B277=\"\",\"\",VLOOKUP($B277,Data!$A$4:$T$727,2,FALSE))","v":""},{"$f":"IF($B277=\"\",\"\",VLOOKUP($B277,Data!$A$4:$T$727,10,FALSE))","v":""},{"$f":"IF($B277=\"\",\"\",VLOOKUP($B277,Data!$A$4:$T$727,4,FALSE))","v":""},{"$f":"IF($B277=\"\",\"\",VLOOKUP($B277,Data!$A$4:$T$727,5,FALSE))","v":""},{"$f":"IF($B277=\"\",\"\",VLOOKUP($B277,Data!$A$4:$T$727,7,FALSE))","v":""},"","","","",{"$f":"IF($I$15=\"Show\",VLOOKUP($B277,Data!$A$4:$T$727,9,FALSE),VLOOKUP($B277,Data!$A$4:$T$727,7,FALSE))","v":{"$error":"#N/A"}},{"$f":"IF($B277=\"\",\"\",VLOOKUP($B277,Data!$A$4:$T$727,6,FALSE))","v":""},"",{"$f":"IF($B277=\"\",\"\",IF(VLOOKUP($B277,Data!$A$4:$T$727,11,FALSE)<1,\"\",VLOOKUP(B277,Data!$A$4:$T$727,11,FALSE)))","v":""}]
[null,null,{"$f":"IF($B278=\"\",\"\",VLOOKUP($B278,Data!$A$4:$T$727,2,FALSE))","v":""},{"$f":"IF($B278=\"\",\"\",VLOOKUP($B278,Data!$A$4:$T$727,10,FALSE))","v":""},{"$f":"IF($B278=\"\",\"\",VLOOKUP($B278,Data!$A$4:$T$727,4,FALSE))","v":""},{"$f":"IF($B278=\"\",\"\",VLOOKUP($B278,Data!$A$4:$T$727,5,FALSE))","v":""},{"$f":"IF($B278=\"\",\"\",VLOOKUP($B278,Data!$A$4:$T$727,7,FALSE))","v":""},{"$f":"IF($B278=\"\",\"\",IF($K$15=\"\",\"\",ROUND($G278*(1-($K$15*0.01)),2)))","v":""},{"$f":"IF($B278=\"\",\"\",IF($G278=$L278,\"\",L278))","v":""},{"$f":"IF($B278=\"\",\"\",IF($H278<$L278,$H278,$L278))","v":""},{"$f":"IF(A278=\"\",\"\",J278*A278)","v":""},{"$f":"IF($I$15=\"Show\",VLOOKUP($B278,Data!$A$4:$T$727,9,FALSE),VLOOKUP($B278,Data!$A$4:$T$727,7,FALSE))","v":{"$error":"#N/A"}},{"$f":"IF($B278=\"\",\"\",VLOOKUP($B278,Data!$A$4:$T$727,6,FALSE))","v":""},{"$f":"IF($A278=\"\",\"\",$A278/$M278)","v":""},{"$f":"IF($B278=\"\",\"\",IF(VLOOKUP($B278,Data!$A$4:$T$727,11,FALSE)<1,\"\",VLOOKUP(B278,Data!$A$4:$T$727,11,FALSE)))","v":""}]
[null,null,{"$f":"IF($B279=\"\",\"\",VLOOKUP($B279,Data!$A$4:$T$727,2,FALSE))","v":""},{"$f":"IF($B279=\"\",\"\",VLOOKUP($B279,Data!$A$4:$T$727,10,FALSE))","v":""},{"$f":"IF($B279=\"\",\"\",VLOOKUP($B279,Data!$A$4:$T$727,4,FALSE))","v":""},{"$f":"IF($B279=\"\",\"\",VLOOKUP($B279,Data!$A$4:$T$727,5,FALSE))","v":""},{"$f":"IF($B279=\"\",\"\",VLOOKUP($B279,Data!$A$4:$T$727,7,FALSE))","v":""},"","","","",{"$f":"IF($I$15=\"Show\",VLOOKUP($B279,Data!$A$4:$T$727,9,FALSE),VLOOKUP($B279,Data!$A$4:$T$727,7,FALSE))","v":{"$error":"#N/A"}},{"$f":"IF($B279=\"\",\"\",VLOOKUP($B279,Data!$A$4:$T$727,6,FALSE))","v":""},"",{"$f":"IF($B279=\"\",\"\",IF(VLOOKUP($B279,Data!$A$4:$T$727,11,FALSE)<1,\"\",VLOOKUP(B279,Data!$A$4:$T$727,11,FALSE)))","v":""}]
[null,null,{"$f":"IF($B280=\"\",\"\",VLOOKUP($B280,Data!$A$4:$T$727,2,FALSE))","v":""},{"$f":"IF($B280=\"\",\"\",VLOOKUP($B280,Data!$A$4:$T$727,10,FALSE))","v":""},{"$f":"IF($B280=\"\",\"\",VLOOKUP($B280,Data!$A$4:$T$727,4,FALSE))","v":""},{"$f":"IF($B280=\"\",\"\",VLOOKUP($B280,Data!$A$4:$T$727,5,FALSE))","v":""},{"$f":"IF($B280=\"\",\"\",VLOOKUP($B280,Data!$A$4:$T$727,7,FALSE))","v":""},"","","","",{"$f":"IF($I$15=\"Show\",VLOOKUP($B280,Data!$A$4:$T$727,9,FALSE),VLOOKUP($B280,Data!$A$4:$T$727,7,FALSE))","v":{"$error":"#N/A"}},{"$f":"IF($B280=\"\",\"\",VLOOKUP($B280,Data!$A$4:$T$727,6,FALSE))","v":""},"",{"$f":"IF($B280=\"\",\"\",IF(VLOOKUP($B280,Data!$A$4:$T$727,11,FALSE)<1,\"\",VLOOKUP(B280,Data!$A$4:$T$727,11,FALSE)))","v":""}]
[null,null,{"$f":"IF($B281=\"\",\"\",VLOOKUP($B281,Data!$A$4:$T$727,2,FALSE))","v":""},{"$f":"IF($B281=\"\",\"\",VLOOKUP($B281,Data!$A$4:$T$727,10,FALSE))","v":""},{"$f":"IF($B281=\"\",\"\",VLOOKUP($B281,Data!$A$4:$T$727,4,FALSE))","v":""},{"$f":"IF($B281=\"\",\"\",VLOOKUP($B281,Data!$A$4:$T$727,5,FALSE))","v":""},{"$f":"IF($B281=\"\",\"\",VLOOKUP($B281,Data!$A$4:$T$727,7,FALSE))","v":""},"","","","",{"$f":"IF($I$15=\"Show\",VLOOKUP($B281,Data!$A$4:$T$727,9,FALSE),VLOOKUP($B281,Data!$A$4:$T$727,7,FALSE))","v":{"$error":"#N/A"}},{"$f":"IF($B281=\"\",\"\",VLOOKUP($B281,Data!$A$4:$T$727,6,FALSE))","v":""},"",{"$f":"IF($B281=\"\",\"\",IF(VLOOKUP($B281,Data!$A$4:$T$727,11,FALSE)<1,\"\",VLOOKUP(B281,Data!$A$4:$T$727,11,FALSE)))","v":""}]
[null,null,{"$f":"IF($B282=\"\",\"\",VLOOKUP($B282,Data!$A$4:$T$727,2,FALSE))","v":""},{"$f":"IF($B282=\"\",\"\",VLOOKUP($B282,Data!$A$4:$T$727,10,FALSE))","v":""},{"$f":"IF($B282=\"\",\"\",VLOOKUP($B282,Data!$A$4:$T$727,4,FALSE))","v":""},{"$f":"IF($B282=\"\",\"\",VLOOKUP($B282,Data!$A$4:$T$727,5,FALSE))","v":""},{"$f":"IF($B282=\"\",\"\",VLOOKUP($B282,Data!$A$4:$T$727,7,FALSE))","v":""},"","","","",{"$f":"IF($I$15=\"Show\",VLOOKUP($B282,Data!$A$4:$T$727,9,FALSE),VLOOKUP($B282,Data!$A$4:$T$727,7,FALSE))","v":{"$error":"#N/A"}},{"$f":"IF($B282=\"\",\"\",VLOOKUP($B282,Data!$A$4:$T$727,6,FALSE))","v":""},"",{"$f":"IF($B282=\"\",\"\",IF(VLOOKUP($B282,Data!$A$4:$T$727,11,FALSE)<1,\"\",VLOOKUP(B282,Data!$A$4:$T$727,11,FALSE)))","v":""}]
[null,null,{"$f":"IF($B283=\"\",\"\",VLOOKUP($B283,Data!$A$4:$T$727,2,FALSE))","v":""},{"$f":"IF($B283=\"\",\"\",VLOOKUP($B283,Data!$A$4:$T$727,10,FALSE))","v":""},{"$f":"IF($B283=\"\",\"\",VLOOKUP($B283,Data!$A$4:$T$727,4,FALSE))","v":""},{"$f":"IF($B283=\"\",\"\",VLOOKUP($B283,Data!$A$4:$T$727,5,FALSE))","v":""},{"$f":"IF($B283=\"\",\"\",VLOOKUP($B283,Data!$A$4:$T$727,7,FALSE))","v":""},"","","","",{"$f":"IF($I$15=\"Show\",VLOOKUP($B283,Data!$A$4:$T$727,9,FALSE),VLOOKUP($B283,Data!$A$4:$T$727,7,FALSE))","v":{"$error":"#N/A"}},{"$f":"IF($B283=\"\",\"\",VLOOKUP($B283,Data!$A$4:$T$727,6,FALSE))","v":""},"",{"$f":"IF($B283=\"\",\"\",IF(VLOOKUP($B283,Data!$A$4:$T$727,11,FALSE)<1,\"\",VLOOKUP(B283,Data!$A$4:$T$727,11,FALSE)))","v":""}]
[null,null,{"$f":"IF($B284=\"\",\"\",VLOOKUP($B284,Data!$A$4:$T$727,2,FALSE))","v":""},{"$f":"IF($B284=\"\",\"\",VLOOKUP($B284,Data!$A$4:$T$727,10,FALSE))","v":""},{"$f":"IF($B284=\"\",\"\",VLOOKUP($B284,Data!$A$4:$T$727,4,FALSE))","v":""},{"$f":"IF($B284=\"\",\"\",VLOOKUP($B284,Data!$A$4:$T$727,5,FALSE))","v":""},{"$f":"IF($B284=\"\",\"\",VLOOKUP($B284,Data!$A$4:$T$727,7,FALSE))","v":""},"","","","",{"$f":"IF($I$15=\"Show\",VLOOKUP($B284,Data!$A$4:$T$727,9,FALSE),VLOOKUP($B284,Data!$A$4:$T$727,7,FALSE))","v":{"$error":"#N/A"}},{"$f":"IF($B284=\"\",\"\",VLOOKUP($B284,Data!$A$4:$T$727,6,FALSE))","v":""},"",{"$f":"IF($B284=\"\",\"\",IF(VLOOKUP($B284,Data!$A$4:$T$727,11,FALSE)<1,\"\",VLOOKUP(B284,Data!$A$4:$T$727,11,FALSE)))","v":""}]
[null,null,{"$f":"IF($B285=\"\",\"\",VLOOKUP($B285,Data!$A$4:$T$727,2,FALSE))","v":""},{"$f":"IF($B285=\"\",\"\",VLOOKUP($B285,Data!$A$4:$T$727,10,FALSE))","v":""},{"$f":"IF($B285=\"\",\"\",VLOOKUP($B285,Data!$A$4:$T$727,4,FALSE))","v":""},{"$f":"IF($B285=\"\",\"\",VLOOKUP($B285,Data!$A$4:$T$727,5,FALSE))","v":""},{"$f":"IF($B285=\"\",\"\",VLOOKUP($B285,Data!$A$4:$T$727,7,FALSE))","v":""},"","","","",{"$f":"IF($I$15=\"Show\",VLOOKUP($B285,Data!$A$4:$T$727,9,FALSE),VLOOKUP($B285,Data!$A$4:$T$727,7,FALSE))","v":{"$error":"#N/A"}},{"$f":"IF($B285=\"\",\"\",VLOOKUP($B285,Data!$A$4:$T$727,6,FALSE))","v":""},"",{"$f":"IF($B285=\"\",\"\",IF(VLOOKUP($B285,Data!$A$4:$T$727,11,FALSE)<1,\"\",VLOOKUP(B285,Data!$A$4:$T$727,11,FALSE)))","v":""}]
[null,null,{"$f":"IF($B286=\"\",\"\",VLOOKUP($B286,Data!$A$4:$T$727,2,FALSE))","v":""},{"$f":"IF($B286=\"\",\"\",VLOOKUP($B286,Data!$A$4:$T$727,10,FALSE))","v":""},{"$f":"IF($B286=\"\",\"\",VLOOKUP($B286,Data!$A$4:$T$727,4,FALSE))","v":""},{"$f":"IF($B286=\"\",\"\",VLOOKUP($B286,Data!$A$4:$T$727,5,FALSE))","v":""},{"$f":"IF($B286=\"\",\"\",VLOOKUP($B286,Data!$A$4:$T$727,7,FALSE))","v":""},"","","","",{"$f":"IF($I$15=\"Show\",VLOOKUP($B286,Data!$A$4:$T$727,9,FALSE),VLOOKUP($B286,Data!$A$4:$T$727,7,FALSE))","v":{"$error":"#N/A"}},{"$f":"IF($B286=\"\",\"\",VLOOKUP($B286,Data!$A$4:$T$727,6,FALSE))","v":""},"",{"$f":"IF($B286=\"\",\"\",IF(VLOOKUP($B286,Data!$A$4:$T$727,11,FALSE)<1,\"\",VLOOKUP(B286,Data!$A$4:$T$727,11,FALSE)))","v":""}]
[null,null,{"$f":"IF($B287=\"\",\"\",VLOOKUP($B287,Data!$A$4:$T$727,2,FALSE))","v":""},{"$f":"IF($B287=\"\",\"\",VLOOKUP($B287,Data!$A$4:$T$727,10,FALSE))","v":""},{"$f":"IF($B287=\"\",\"\",VLOOKUP($B287,Data!$A$4:$T$727,4,FALSE))","v":""},{"$f":"IF($B287=\"\",\"\",VLOOKUP($B287,Data!$A$4:$T$727,5,FALSE))","v":""},{"$f":"IF($B287=\"\",\"\",VLOOKUP($B287,Data!$A$4:$T$727,7,FALSE))","v":""},"","","","",{"$f":"IF($I$15=\"Show\",VLOOKUP($B287,Data!$A$4:$T$727,9,FALSE),VLOOKUP($B287,Data!$A$4:$T$727,7,FALSE))","v":{"$error":"#N/A"}},{"$f":"IF($B287=\"\",\"\",VLOOKUP($B287,Data!$A$4:$T$727,6,FALSE))","v":""},"",{"$f":"IF($B287=\"\",\"\",IF(VLOOKUP($B287,Data!$A$4:$T$727,11,FALSE)<1,\"\",VLOOKUP(B287,Data!$A$4:$T$727,11,FALSE)))","v":""}]
[null,null,{"$f":"IF($B288=\"\",\"\",VLOOKUP($B288,Data!$A$4:$T$727,2,FALSE))","v":""},{"$f":"IF($B288=\"\",\"\",VLOOKUP($B288,Data!$A$4:$T$727,10,FALSE))","v":""},{"$f":"IF($B288=\"\",\"\",VLOOKUP($B288,Data!$A$4:$T$727,4,FALSE))","v":""},{"$f":"IF($B288=\"\",\"\",VLOOKUP($B288,Data!$A$4:$T$727,5,FALSE))","v":""},{"$f":"IF($B288=\"\",\"\",VLOOKUP($B288,Data!$A$4:$T$727,7,FALSE))","v":""},"","","","",{"$f":"IF($I$15=\"Show\",VLOOKUP($B288,Data!$A$4:$T$727,9,FALSE),VLOOKUP($B288,Data!$A$4:$T$727,7,FALSE))","v":{"$error":"#N/A"}},{"$f":"IF($B288=\"\",\"\",VLOOKUP($B288,Data!$A$4:$T$727,6,FALSE))","v":""},"",{"$f":"IF($B288=\"\",\"\",IF(VLOOKUP($B288,Data!$A$4:$T$727,11,FALSE)<1,\"\",VLOOKUP(B288,Data!$A$4:$T$727,11,FALSE)))","v":""}]
[null,null,{"$f":"IF($B289=\"\",\"\",VLOOKUP($B289,Data!$A$4:$T$727,2,FALSE))","v":""},{"$f":"IF($B289=\"\",\"\",VLOOKUP($B289,Data!$A$4:$T$727,10,FALSE))","v":""},{"$f":"IF($B289=\"\",\"\",VLOOKUP($B289,Data!$A$4:$T$727,4,FALSE))","v":""},{"$f":"IF($B289=\"\",\"\",VLOOKUP($B289,Data!$A$4:$T$727,5,FALSE))","v":""},{"$f":"IF($B289=\"\",\"\",VLOOKUP($B289,Data!$A$4:$T$727,7,FALSE))","v":""},"","","","",{"$f":"IF($I$15=\"Show\",VLOOKUP($B289,Data!$A$4:$T$727,9,FALSE),VLOOKUP($B289,Data!$A$4:$T$727,7,FALSE))","v":{"$error":"#N/A"}},{"$f":"IF($B289=\"\",\"\",VLOOKUP($B289,Data!$A$4:$T$727,6,FALSE))","v":""},"",{"$f":"IF($B289=\"\",\"\",IF(VLOOKUP($B289,Data!$A$4:$T$727,11,FALSE)<1,\"\",VLOOKUP(B289,Data!$A$4:$T$727,11,FALSE)))","v":""}]
[null,null,{"$f":"IF($B290=\"\",\"\",VLOOKUP($B290,Data!$A$4:$T$727,2,FALSE))","v":""},{"$f":"IF($B290=\"\",\"\",VLOOKUP($B290,Data!$A$4:$T$727,10,FALSE))","v":""},{"$f":"IF($B290=\"\",\"\",VLOOKUP($B290,Data!$A$4:$T$727,4,FALSE))","v":""},{"$f":"IF($B290=\"\",\"\",VLOOKUP($B290,Data!$A$4:$T$727,5,FALSE))","v":""},{"$f":"IF($B290=\"\",\"\",VLOOKUP($B290,Data!$A$4:$T$727,7,FALSE))","v":""},"","","","",{"$f":"IF($I$15=\"Show\",VLOOKUP($B290,Data!$A$4:$T$727,9,FALSE),VLOOKUP($B290,Data!$A$4:$T$727,7,FALSE))","v":{"$error":"#N/A"}},{"$f":"IF($B290=\"\",\"\",VLOOKUP($B290,Data!$A$4:$T$727,6,FALSE))","v":""},"",{"$f":"IF($B290=\"\",\"\",IF(VLOOKUP($B290,Data!$A$4:$T$727,11,FALSE)<1,\"\",VLOOKUP(B290,Data!$A$4:$T$727,11,FALSE)))","v":""}]
[null,null,{"$f":"IF($B291=\"\",\"\",VLOOKUP($B291,Data!$A$4:$T$727,2,FALSE))","v":""},{"$f":"IF($B291=\"\",\"\",VLOOKUP($B291,Data!$A$4:$T$727,10,FALSE))","v":""},{"$f":"IF($B291=\"\",\"\",VLOOKUP($B291,Data!$A$4:$T$727,4,FALSE))","v":""},{"$f":"IF($B291=\"\",\"\",VLOOKUP($B291,Data!$A$4:$T$727,5,FALSE))","v":""},{"$f":"IF($B291=\"\",\"\",VLOOKUP($B291,Data!$A$4:$T$727,7,FALSE))","v":""},"","","","",{"$f":"IF($I$15=\"Show\",VLOOKUP($B291,Data!$A$4:$T$727,9,FALSE),VLOOKUP($B291,Data!$A$4:$T$727,7,FALSE))","v":{"$error":"#N/A"}},{"$f":"IF($B291=\"\",\"\",VLOOKUP($B291,Data!$A$4:$T$727,6,FALSE))","v":""},"",{"$f":"IF($B291=\"\",\"\",IF(VLOOKUP($B291,Data!$A$4:$T$727,11,FALSE)<1,\"\",VLOOKUP(B291,Data!$A$4:$T$727,11,FALSE)))","v":""}]
[null,null,{"$f":"IF($B292=\"\",\"\",VLOOKUP($B292,Data!$A$4:$T$727,2,FALSE))","v":""},{"$f":"IF($B292=\"\",\"\",VLOOKUP($B292,Data!$A$4:$T$727,10,FALSE))","v":""},{"$f":"IF($B292=\"\",\"\",VLOOKUP($B292,Data!$A$4:$T$727,4,FALSE))","v":""},{"$f":"IF($B292=\"\",\"\",VLOOKUP($B292,Data!$A$4:$T$727,5,FALSE))","v":""},{"$f":"IF($B292=\"\",\"\",VLOOKUP($B292,Data!$A$4:$T$727,7,FALSE))","v":""},"","","","",{"$f":"IF($I$15=\"Show\",VLOOKUP($B292,Data!$A$4:$T$727,9,FALSE),VLOOKUP($B292,Data!$A$4:$T$727,7,FALSE))","v":{"$error":"#N/A"}},{"$f":"IF($B292=\"\",\"\",VLOOKUP($B292,Data!$A$4:$T$727,6,FALSE))","v":""},"",{"$f":"IF($B292=\"\",\"\",IF(VLOOKUP($B292,Data!$A$4:$T$727,11,FALSE)<1,\"\",VLOOKUP(B292,Data!$A$4:$T$727,11,FALSE)))","v":""}]
[null,null,{"$f":"IF($B293=\"\",\"\",VLOOKUP($B293,Data!$A$4:$T$727,2,FALSE))","v":""},{"$f":"IF($B293=\"\",\"\",VLOOKUP($B293,Data!$A$4:$T$727,10,FALSE))","v":""},{"$f":"IF($B293=\"\",\"\",VLOOKUP($B293,Data!$A$4:$T$727,4,FALSE))","v":""},{"$f":"IF($B293=\"\",\"\",VLOOKUP($B293,Data!$A$4:$T$727,5,FALSE))","v":""},{"$f":"IF($B293=\"\",\"\",VLOOKUP($B293,Data!$A$4:$T$727,7,FALSE))","v":""},"","","","",{"$f":"IF($I$15=\"Show\",VLOOKUP($B293,Data!$A$4:$T$727,9,FALSE),VLOOKUP($B293,Data!$A$4:$T$727,7,FALSE))","v":{"$error":"#N/A"}},{"$f":"IF($B293=\"\",\"\",VLOOKUP($B293,Data!$A$4:$T$727,6,FALSE))","v":""},"",{"$f":"IF($B293=\"\",\"\",IF(VLOOKUP($B293,Data!$A$4:$T$727,11,FALSE)<1,\"\",VLOOKUP(B293,Data!$A$4:$T$727,11,FALSE)))","v":""}]
[null,null,{"$f":"IF($B294=\"\",\"\",VLOOKUP($B294,Data!$A$4:$T$727,2,FALSE))","v":""},{"$f":"IF($B294=\"\",\"\",VLOOKUP($B294,Data!$A$4:$T$727,10,FALSE))","v":""},{"$f":"IF($B294=\"\",\"\",VLOOKUP($B294,Data!$A$4:$T$727,4,FALSE))","v":""},{"$f":"IF($B294=\"\",\"\",VLOOKUP($B294,Data!$A$4:$T$727,5,FALSE))","v":""},{"$f":"IF($B294=\"\",\"\",VLOOKUP($B294,Data!$A$4:$T$727,7,FALSE))","v":""},"","","","",{"$f":"IF($I$15=\"Show\",VLOOKUP($B294,Data!$A$4:$T$727,9,FALSE),VLOOKUP($B294,Data!$A$4:$T$727,7,FALSE))","v":{"$error":"#N/A"}},{"$f":"IF($B294=\"\",\"\",VLOOKUP($B294,Data!$A$4:$T$727,6,FALSE))","v":""},"",{"$f":"IF($B294=\"\",\"\",IF(VLOOKUP($B294,Data!$A$4:$T$727,11,FALSE)<1,\"\",VLOOKUP(B294,Data!$A$4:$T$727,11,FALSE)))","v":""}]
[null,null,{"$f":"IF($B295=\"\",\"\",VLOOKUP($B295,Data!$A$4:$T$727,2,FALSE))","v":""},{"$f":"IF($B295=\"\",\"\",VLOOKUP($B295,Data!$A$4:$T$727,10,FALSE))","v":""},{"$f":"IF($B295=\"\",\"\",VLOOKUP($B295,Data!$A$4:$T$727,4,FALSE))","v":""},{"$f":"IF($B295=\"\",\"\",VLOOKUP($B295,Data!$A$4:$T$727,5,FALSE))","v":""},{"$f":"IF($B295=\"\",\"\",VLOOKUP($B295,Data!$A$4:$T$727,7,FALSE))","v":""},"","","","",{"$f":"IF($I$15=\"Show\",VLOOKUP($B295,Data!$A$4:$T$727,9,FALSE),VLOOKUP($B295,Data!$A$4:$T$727,7,FALSE))","v":{"$error":"#N/A"}},{"$f":"IF($B295=\"\",\"\",VLOOKUP($B295,Data!$A$4:$T$727,6,FALSE))","v":""},"",{"$f":"IF($B295=\"\",\"\",IF(VLOOKUP($B295,Data!$A$4:$T$727,11,FALSE)<1,\"\",VLOOKUP(B295,Data!$A$4:$T$727,11,FALSE)))","v":""}]
[null,null,{"$f":"IF($B296=\"\",\"\",VLOOKUP($B296,Data!$A$4:$T$727,2,FALSE))","v":""},{"$f":"IF($B296=\"\",\"\",VLOOKUP($B296,Data!$A$4:$T$727,10,FALSE))","v":""},{"$f":"IF($B296=\"\",\"\",VLOOKUP($B296,Data!$A$4:$T$727,4,FALSE))","v":""},{"$f":"IF($B296=\"\",\"\",VLOOKUP($B296,Data!$A$4:$T$727,5,FALSE))","v":""},{"$f":"IF($B296=\"\",\"\",VLOOKUP($B296,Data!$A$4:$T$727,7,FALSE))","v":""},"","","","",{"$f":"IF($I$15=\"Show\",VLOOKUP($B296,Data!$A$4:$T$727,9,FALSE),VLOOKUP($B296,Data!$A$4:$T$727,7,FALSE))","v":{"$error":"#N/A"}},{"$f":"IF($B296=\"\",\"\",VLOOKUP($B296,Data!$A$4:$T$727,6,FALSE))","v":""},"",{"$f":"IF($B296=\"\",\"\",IF(VLOOKUP($B296,Data!$A$4:$T$727,11,FALSE)<1,\"\",VLOOKUP(B296,Data!$A$4:$T$727,11,FALSE)))","v":""}]
[null,null,{"$f":"IF($B297=\"\",\"\",VLOOKUP($B297,Data!$A$4:$T$727,2,FALSE))","v":""},{"$f":"IF($B297=\"\",\"\",VLOOKUP($B297,Data!$A$4:$T$727,10,FALSE))","v":""},{"$f":"IF($B297=\"\",\"\",VLOOKUP($B297,Data!$A$4:$T$727,4,FALSE))","v":""},{"$f":"IF($B297=\"\",\"\",VLOOKUP($B297,Data!$A$4:$T$727,5,FALSE))","v":""},{"$f":"IF($B297=\"\",\"\",VLOOKUP($B297,Data!$A$4:$T$727,7,FALSE))","v":""},"","","","",{"$f":"IF($I$15=\"Show\",VLOOKUP($B297,Data!$A$4:$T$727,9,FALSE),VLOOKUP($B297,Data!$A$4:$T$727,7,FALSE))","v":{"$error":"#N/A"}},{"$f":"IF($B297=\"\",\"\",VLOOKUP($B297,Data!$A$4:$T$727,6,FALSE))","v":""},"",{"$f":"IF($B297=\"\",\"\",IF(VLOOKUP($B297,Data!$A$4:$T$727,11,FALSE)<1,\"\",VLOOKUP(B297,Data!$A$4:$T$727,11,FALSE)))","v":""}]
[null,null,{"$f":"IF($B298=\"\",\"\",VLOOKUP($B298,Data!$A$4:$T$727,2,FALSE))","v":""},{"$f":"IF($B298=\"\",\"\",VLOOKUP($B298,Data!$A$4:$T$727,10,FALSE))","v":""},{"$f":"IF($B298=\"\",\"\",VLOOKUP($B298,Data!$A$4:$T$727,4,FALSE))","v":""},{"$f":"IF($B298=\"\",\"\",VLOOKUP($B298,Data!$A$4:$T$727,5,FALSE))","v":""},{"$f":"IF($B298=\"\",\"\",VLOOKUP($B298,Data!$A$4:$T$727,7,FALSE))","v":""},"","","","",{"$f":"IF($I$15=\"Show\",VLOOKUP($B298,Data!$A$4:$T$727,9,FALSE),VLOOKUP($B298,Data!$A$4:$T$727,7,FALSE))","v":{"$error":"#N/A"}},{"$f":"IF($B298=\"\",\"\",VLOOKUP($B298,Data!$A$4:$T$727,6,FALSE))","v":""},"",{"$f":"IF($B298=\"\",\"\",IF(VLOOKUP($B298,Data!$A$4:$T$727,11,FALSE)<1,\"\",VLOOKUP(B298,Data!$A$4:$T$727,11,FALSE)))","v":""}]
[null,null,{"$f":"IF($B299=\"\",\"\",VLOOKUP($B299,Data!$A$4:$T$727,2,FALSE))","v":""},{"$f":"IF($B299=\"\",\"\",VLOOKUP($B299,Data!$A$4:$T$727,10,FALSE))","v":""},{"$f":"IF($B299=\"\",\"\",VLOOKUP($B299,Data!$A$4:$T$727,4,FALSE))","v":""},{"$f":"IF($B299=\"\",\"\",VLOOKUP($B299,Data!$A$4:$T$727,5,FALSE))","v":""},{"$f":"IF($B299=\"\",\"\",VLOOKUP($B299,Data!$A$4:$T$727,7,FALSE))","v":""},"","","","",{"$f":"IF($I$15=\"Show\",VLOOKUP($B299,Data!$A$4:$T$727,9,FALSE),VLOOKUP($B299,Data!$A$4:$T$727,7,FALSE))","v":{"$error":"#N/A"}},{"$f":"IF($B299=\"\",\"\",VLOOKUP($B299,Data!$A$4:$T$727,6,FALSE))","v":""},"",{"$f":"IF($B299=\"\",\"\",IF(VLOOKUP($B299,Data!$A$4:$T$727,11,FALSE)<1,\"\",VLOOKUP(B299,Data!$A$4:$T$727,11,FALSE)))","v":""}]
[null,null,{"$f":"IF($B300=\"\",\"\",VLOOKUP($B300,Data!$A$4:$T$727,2,FALSE))","v":""},{"$f":"IF($B300=\"\",\"\",VLOOKUP($B300,Data!$A$4:$T$727,10,FALSE))","v":""},{"$f":"IF($B300=\"\",\"\",VLOOKUP($B300,Data!$A$4:$T$727,4,FALSE))","v":""},{"$f":"IF($B300=\"\",\"\",VLOOKUP($B300,Data!$A$4:$T$727,5,FALSE))","v":""},{"$f":"IF($B300=\"\",\"\",VLOOKUP($B300,Data!$A$4:$T$727,7,FALSE))","v":""},"","","","",{"$f":"IF($I$15=\"Show\",VLOOKUP($B300,Data!$A$4:$T$727,9,FALSE),VLOOKUP($B300,Data!$A$4:$T$727,7,FALSE))","v":{"$error":"#N/A"}},{"$f":"IF($B300=\"\",\"\",VLOOKUP($B300,Data!$A$4:$T$727,6,FALSE))","v":""},"",{"$f":"IF($B300=\"\",\"\",IF(VLOOKUP($B300,Data!$A$4:$T$727,11,FALSE)<1,\"\",VLOOKUP(B300,Data!$A$4:$T$727,11,FALSE)))","v":""}]
[null,null,{"$f":"IF($B301=\"\",\"\",VLOOKUP($B301,Data!$A$4:$T$727,2,FALSE))","v":""},{"$f":"IF($B301=\"\",\"\",VLOOKUP($B301,Data!$A$4:$T$727,10,FALSE))","v":""},{"$f":"IF($B301=\"\",\"\",VLOOKUP($B301,Data!$A$4:$T$727,4,FALSE))","v":""},{"$f":"IF($B301=\"\",\"\",VLOOKUP($B301,Data!$A$4:$T$727,5,FALSE))","v":""},{"$f":"IF($B301=\"\",\"\",VLOOKUP($B301,Data!$A$4:$T$727,7,FALSE))","v":""},"","","","",{"$f":"IF($I$15=\"Show\",VLOOKUP($B301,Data!$A$4:$T$727,9,FALSE),VLOOKUP($B301,Data!$A$4:$T$727,7,FALSE))","v":{"$error":"#N/A"}},{"$f":"IF($B301=\"\",\"\",VLOOKUP($B301,Data!$A$4:$T$727,6,FALSE))","v":""},"",{"$f":"IF($B301=\"\",\"\",IF(VLOOKUP($B301,Data!$A$4:$T$727,11,FALSE)<1,\"\",VLOOKUP(B301,Data!$A$4:$T$727,11,FALSE)))","v":""}]
[null,null,{"$f":"IF($B302=\"\",\"\",VLOOKUP($B302,Data!$A$4:$T$727,2,FALSE))","v":""},{"$f":"IF($B302=\"\",\"\",VLOOKUP($B302,Data!$A$4:$T$727,10,FALSE))","v":""},{"$f":"IF($B302=\"\",\"\",VLOOKUP($B302,Data!$A$4:$T$727,4,FALSE))","v":""},{"$f":"IF($B302=\"\",\"\",VLOOKUP($B302,Data!$A$4:$T$727,5,FALSE))","v":""},{"$f":"IF($B302=\"\",\"\",VLOOKUP($B302,Data!$A$4:$T$727,7,FALSE))","v":""},"","","","",{"$f":"IF($I$15=\"Show\",VLOOKUP($B302,Data!$A$4:$T$727,9,FALSE),VLOOKUP($B302,Data!$A$4:$T$727,7,FALSE))","v":{"$error":"#N/A"}},{"$f":"IF($B302=\"\",\"\",VLOOKUP($B302,Data!$A$4:$T$727,6,FALSE))","v":""},"",{"$f":"IF($B302=\"\",\"\",IF(VLOOKUP($B302,Data!$A$4:$T$727,11,FALSE)<1,\"\",VLOOKUP(B302,Data!$A$4:$T$727,11,FALSE)))","v":""}]
[null,null,{"$f":"IF($B303=\"\",\"\",VLOOKUP($B303,Data!$A$4:$T$727,2,FALSE))","v":""},{"$f":"IF($B303=\"\",\"\",VLOOKUP($B303,Data!$A$4:$T$727,10,FALSE))","v":""},{"$f":"IF($B303=\"\",\"\",VLOOKUP($B303,Data!$A$4:$T$727,4,FALSE))","v":""},{"$f":"IF($B303=\"\",\"\",VLOOKUP($B303,Data!$A$4:$T$727,5,FALSE))","v":""},{"$f":"IF($B303=\"\",\"\",VLOOKUP($B303,Data!$A$4:$T$727,7,FALSE))","v":""},"","","","",{"$f":"IF($I$15=\"Show\",VLOOKUP($B303,Data!$A$4:$T$727,9,FALSE),VLOOKUP($B303,Data!$A$4:$T$727,7,FALSE))","v":{"$error":"#N/A"}},{"$f":"IF($B303=\"\",\"\",VLOOKUP($B303,Data!$A$4:$T$727,6,FALSE))","v":""},"",{"$f":"IF($B303=\"\",\"\",IF(VLOOKUP($B303,Data!$A$4:$T$727,11,FALSE)<1,\"\",VLOOKUP(B303,Data!$A$4:$T$727,11,FALSE)))","v":""}]
[null,null,{"$f":"IF($B304=\"\",\"\",VLOOKUP($B304,Data!$A$4:$T$727,2,FALSE))","v":""},{"$f":"IF($B304=\"\",\"\",VLOOKUP($B304,Data!$A$4:$T$727,10,FALSE))","v":""},{"$f":"IF($B304=\"\",\"\",VLOOKUP($B304,Data!$A$4:$T$727,4,FALSE))","v":""},{"$f":"IF($B304=\"\",\"\",VLOOKUP($B304,Data!$A$4:$T$727,5,FALSE))","v":""},{"$f":"IF($B304=\"\",\"\",VLOOKUP($B304,Data!$A$4:$T$727,7,FALSE))","v":""},"","","","",{"$f":"IF($I$15=\"Show\",VLOOKUP($B304,Data!$A$4:$T$727,9,FALSE),VLOOKUP($B304,Data!$A$4:$T$727,7,FALSE))","v":{"$error":"#N/A"}},{"$f":"IF($B304=\"\",\"\",VLOOKUP($B304,Data!$A$4:$T$727,6,FALSE))","v":""},"",{"$f":"IF($B304=\"\",\"\",IF(VLOOKUP($B304,Data!$A$4:$T$727,11,FALSE)<1,\"\",VLOOKUP(B304,Data!$A$4:$T$727,11,FALSE)))","v":""}]
[null,null,{"$f":"IF($B305=\"\",\"\",VLOOKUP($B305,Data!$A$4:$T$727,2,FALSE))","v":""},{"$f":"IF($B305=\"\",\"\",VLOOKUP($B305,Data!$A$4:$T$727,10,FALSE))","v":""},{"$f":"IF($B305=\"\",\"\",VLOOKUP($B305,Data!$A$4:$T$727,4,FALSE))","v":""},{"$f":"IF($B305=\"\",\"\",VLOOKUP($B305,Data!$A$4:$T$727,5,FALSE))","v":""},{"$f":"IF($B305=\"\",\"\",VLOOKUP($B305,Data!$A$4:$T$727,7,FALSE))","v":""},"","","","",{"$f":"IF($I$15=\"Show\",VLOOKUP($B305,Data!$A$4:$T$727,9,FALSE),VLOOKUP($B305,Data!$A$4:$T$727,7,FALSE))","v":{"$error":"#N/A"}},{"$f":"IF($B305=\"\",\"\",VLOOKUP($B305,Data!$A$4:$T$727,6,FALSE))","v":""},"",{"$f":"IF($B305=\"\",\"\",IF(VLOOKUP($B305,Data!$A$4:$T$727,11,FALSE)<1,\"\",VLOOKUP(B305,Data!$A$4:$T$727,11,FALSE)))","v":""}]
[null,null,{"$f":"IF($B306=\"\",\"\",VLOOKUP($B306,Data!$A$4:$T$727,2,FALSE))","v":""},{"$f":"IF($B306=\"\",\"\",VLOOKUP($B306,Data!$A$4:$T$727,10,FALSE))","v":""},{"$f":"IF($B306=\"\",\"\",VLOOKUP($B306,Data!$A$4:$T$727,4,FALSE))","v":""},{"$f":"IF($B306=\"\",\"\",VLOOKUP($B306,Data!$A$4:$T$727,5,FALSE))","v":""},{"$f":"IF($B306=\"\",\"\",VLOOKUP($B306,Data!$A$4:$T$727,7,FALSE))","v":""},"","","","",{"$f":"IF($I$15=\"Show\",VLOOKUP($B306,Data!$A$4:$T$727,9,FALSE),VLOOKUP($B306,Data!$A$4:$T$727,7,FALSE))","v":{"$error":"#N/A"}},{"$f":"IF($B306=\"\",\"\",VLOOKUP($B306,Data!$A$4:$T$727,6,FALSE))","v":""},"",{"$f":"IF($B306=\"\",\"\",IF(VLOOKUP($B306,Data!$A$4:$T$727,11,FALSE)<1,\"\",VLOOKUP(B306,Data!$A$4:$T$727,11,FALSE)))","v":""}]
[null,null,{"$f":"IF($B307=\"\",\"\",VLOOKUP($B307,Data!$A$4:$T$727,2,FALSE))","v":""},{"$f":"IF($B307=\"\",\"\",VLOOKUP($B307,Data!$A$4:$T$727,10,FALSE))","v":""},{"$f":"IF($B307=\"\",\"\",VLOOKUP($B307,Data!$A$4:$T$727,4,FALSE))","v":""},{"$f":"IF($B307=\"\",\"\",VLOOKUP($B307,Data!$A$4:$T$727,5,FALSE))","v":""},{"$f":"IF($B307=\"\",\"\",VLOOKUP($B307,Data!$A$4:$T$727,7,FALSE))","v":""},"","","","",{"$f":"IF($I$15=\"Show\",VLOOKUP($B307,Data!$A$4:$T$727,9,FALSE),VLOOKUP($B307,Data!$A$4:$T$727,7,FALSE))","v":{"$error":"#N/A"}},{"$f":"IF($B307=\"\",\"\",VLOOKUP($B307,Data!$A$4:$T$727,6,FALSE))","v":""},"",{"$f":"IF($B307=\"\",\"\",IF(VLOOKUP($B307,Data!$A$4:$T$727,11,FALSE)<1,\"\",VLOOKUP(B307,Data!$A$4:$T$727,11,FALSE)))","v":""}]
[null,null,{"$f":"IF($B308=\"\",\"\",VLOOKUP($B308,Data!$A$4:$T$727,2,FALSE))","v":""},{"$f":"IF($B308=\"\",\"\",VLOOKUP($B308,Data!$A$4:$T$727,10,FALSE))","v":""},{"$f":"IF($B308=\"\",\"\",VLOOKUP($B308,Data!$A$4:$T$727,4,FALSE))","v":""},{"$f":"IF($B308=\"\",\"\",VLOOKUP($B308,Data!$A$4:$T$727,5,FALSE))","v":""},{"$f":"IF($B308=\"\",\"\",VLOOKUP($B308,Data!$A$4:$T$727,7,FALSE))","v":""},"","","","",{"$f":"IF($I$15=\"Show\",VLOOKUP($B308,Data!$A$4:$T$727,9,FALSE),VLOOKUP($B308,Data!$A$4:$T$727,7,FALSE))","v":{"$error":"#N/A"}},{"$f":"IF($B308=\"\",\"\",VLOOKUP($B308,Data!$A$4:$T$727,6,FALSE))","v":""},"",{"$f":"IF($B308=\"\",\"\",IF(VLOOKUP($B308,Data!$A$4:$T$727,11,FALSE)<1,\"\",VLOOKUP(B308,Data!$A$4:$T$727,11,FALSE)))","v":""}]
[null,null,{"$f":"IF($B309=\"\",\"\",VLOOKUP($B309,Data!$A$4:$T$727,2,FALSE))","v":""},{"$f":"IF($B309=\"\",\"\",VLOOKUP($B309,Data!$A$4:$T$727,10,FALSE))","v":""},{"$f":"IF($B309=\"\",\"\",VLOOKUP($B309,Data!$A$4:$T$727,4,FALSE))","v":""},{"$f":"IF($B309=\"\",\"\",VLOOKUP($B309,Data!$A$4:$T$727,5,FALSE))","v":""},{"$f":"IF($B309=\"\",\"\",VLOOKUP($B309,Data!$A$4:$T$727,7,FALSE))","v":""},"","","","",{"$f":"IF($I$15=\"Show\",VLOOKUP($B309,Data!$A$4:$T$727,9,FALSE),VLOOKUP($B309,Data!$A$4:$T$727,7,FALSE))","v":{"$error":"#N/A"}},{"$f":"IF($B309=\"\",\"\",VLOOKUP($B309,Data!$A$4:$T$727,6,FALSE))","v":""},"",{"$f":"IF($B309=\"\",\"\",IF(VLOOKUP($B309,Data!$A$4:$T$727,11,FALSE)<1,\"\",VLOOKUP(B309,Data!$A$4:$T$727,11,FALSE)))","v":""}]
[null,null,{"$f":"IF($B310=\"\",\"\",VLOOKUP($B310,Data!$A$4:$T$727,2,FALSE))","v":""},{"$f":"IF($B310=\"\",\"\",VLOOKUP($B310,Data!$A$4:$T$727,10,FALSE))","v":""},{"$f":"IF($B310=\"\",\"\",VLOOKUP($B310,Data!$A$4:$T$727,4,FALSE))","v":""},{"$f":"IF($B310=\"\",\"\",VLOOKUP($B310,Data!$A$4:$T$727,5,FALSE))","v":""},{"$f":"IF($B310=\"\",\"\",VLOOKUP($B310,Data!$A$4:$T$727,7,FALSE))","v":""},"","","","",{"$f":"IF($I$15=\"Show\",VLOOKUP($B310,Data!$A$4:$T$727,9,FALSE),VLOOKUP($B310,Data!$A$4:$T$727,7,FALSE))","v":{"$error":"#N/A"}},{"$f":"IF($B310=\"\",\"\",VLOOKUP($B310,Data!$A$4:$T$727,6,FALSE))","v":""},"",{"$f":"IF($B310=\"\",\"\",IF(VLOOKUP($B310,Data!$A$4:$T$727,11,FALSE)<1,\"\",VLOOKUP(B310,Data!$A$4:$T$727,11,FALSE)))","v":""}]
[null,null,{"$f":"IF($B311=\"\",\"\",VLOOKUP($B311,Data!$A$4:$T$727,2,FALSE))","v":""},{"$f":"IF($B311=\"\",\"\",VLOOKUP($B311,Data!$A$4:$T$727,10,FALSE))","v":""},{"$f":"IF($B311=\"\",\"\",VLOOKUP($B311,Data!$A$4:$T$727,4,FALSE))","v":""},{"$f":"IF($B311=\"\",\"\",VLOOKUP($B311,Data!$A$4:$T$727,5,FALSE))","v":""},{"$f":"IF($B311=\"\",\"\",VLOOKUP($B311,Data!$A$4:$T$727,7,FALSE))","v":""},"","","","",{"$f":"IF($I$15=\"Show\",VLOOKUP($B311,Data!$A$4:$T$727,9,FALSE),VLOOKUP($B311,Data!$A$4:$T$727,7,FALSE))","v":{"$error":"#N/A"}},{"$f":"IF($B311=\"\",\"\",VLOOKUP($B311,Data!$A$4:$T$727,6,FALSE))","v":""},"",{"$f":"IF($B311=\"\",\"\",IF(VLOOKUP($B311,Data!$A$4:$T$727,11,FALSE)<1,\"\",VLOOKUP(B311,Data!$A$4:$T$727,11,FALSE)))","v":""}]
[null,null,{"$f":"IF($B312=\"\",\"\",VLOOKUP($B312,Data!$A$4:$T$727,2,FALSE))","v":""},{"$f":"IF($B312=\"\",\"\",VLOOKUP($B312,Data!$A$4:$T$727,10,FALSE))","v":""},{"$f":"IF($B312=\"\",\"\",VLOOKUP($B312,Data!$A$4:$T$727,4,FALSE))","v":""},{"$f":"IF($B312=\"\",\"\",VLOOKUP($B312,Data!$A$4:$T$727,5,FALSE))","v":""},{"$f":"IF($B312=\"\",\"\",VLOOKUP($B312,Data!$A$4:$T$727,7,FALSE))","v":""},"","","","",{"$f":"IF($I$15=\"Show\",VLOOKUP($B312,Data!$A$4:$T$727,9,FALSE),VLOOKUP($B312,Data!$A$4:$T$727,7,FALSE))","v":{"$error":"#N/A"}},{"$f":"IF($B312=\"\",\"\",VLOOKUP($B312,Data!$A$4:$T$727,6,FALSE))","v":""},"",{"$f":"IF($B312=\"\",\"\",IF(VLOOKUP($B312,Data!$A$4:$T$727,11,FALSE)<1,\"\",VLOOKUP(B312,Data!$A$4:$T$727,11,FALSE)))","v":""}]
[null,null,{"$f":"IF($B313=\"\",\"\",VLOOKUP($B313,Data!$A$4:$T$727,2,FALSE))","v":""},{"$f":"IF($B313=\"\",\"\",VLOOKUP($B313,Data!$A$4:$T$727,10,FALSE))","v":""},{"$f":"IF($B313=\"\",\"\",VLOOKUP($B313,Data!$A$4:$T$727,4,FALSE))","v":""},{"$f":"IF($B313=\"\",\"\",VLOOKUP($B313,Data!$A$4:$T$727,5,FALSE))","v":""},{"$f":"IF($B313=\"\",\"\",VLOOKUP($B313,Data!$A$4:$T$727,7,FALSE))","v":""},"","","","",{"$f":"IF($I$15=\"Show\",VLOOKUP($B313,Data!$A$4:$T$727,9,FALSE),VLOOKUP($B313,Data!$A$4:$T$727,7,FALSE))","v":{"$error":"#N/A"}},{"$f":"IF($B313=\"\",\"\",VLOOKUP($B313,Data!$A$4:$T$727,6,FALSE))","v":""},"",{"$f":"IF($B313=\"\",\"\",IF(VLOOKUP($B313,Data!$A$4:$T$727,11,FALSE)<1,\"\",VLOOKUP(B313,Data!$A$4:$T$727,11,FALSE)))","v":""}]
[null,null,{"$f":"IF($B314=\"\",\"\",VLOOKUP($B314,Data!$A$4:$T$727,2,FALSE))","v":""},{"$f":"IF($B314=\"\",\"\",VLOOKUP($B314,Data!$A$4:$T$727,10,FALSE))","v":""},{"$f":"IF($B314=\"\",\"\",VLOOKUP($B314,Data!$A$4:$T$727,4,FALSE))","v":""},{"$f":"IF($B314=\"\",\"\",VLOOKUP($B314,Data!$A$4:$T$727,5,FALSE))","v":""},{"$f":"IF($B314=\"\",\"\",VLOOKUP($B314,Data!$A$4:$T$727,7,FALSE))","v":""},"","","","",{"$f":"IF($I$15=\"Show\",VLOOKUP($B314,Data!$A$4:$T$727,9,FALSE),VLOOKUP($B314,Data!$A$4:$T$727,7,FALSE))","v":{"$error":"#N/A"}},{"$f":"IF($B314=\"\",\"\",VLOOKUP($B314,Data!$A$4:$T$727,6,FALSE))","v":""},"",{"$f":"IF($B314=\"\",\"\",IF(VLOOKUP($B314,Data!$A$4:$T$727,11,FALSE)<1,\"\",VLOOKUP(B314,Data!$A$4:$T$727,11,FALSE)))","v":""}]
[null,null,{"$f":"IF($B315=\"\",\"\",VLOOKUP($B315,Data!$A$4:$T$727,2,FALSE))","v":""},{"$f":"IF($B315=\"\",\"\",VLOOKUP($B315,Data!$A$4:$T$727,10,FALSE))","v":""},{"$f":"IF($B315=\"\",\"\",VLOOKUP($B315,Data!$A$4:$T$727,4,FALSE))","v":""},{"$f":"IF($B315=\"\",\"\",VLOOKUP($B315,Data!$A$4:$T$727,5,FALSE))","v":""},{"$f":"IF($B315=\"\",\"\",VLOOKUP($B315,Data!$A$4:$T$727,7,FALSE))","v":""},"","","","",{"$f":"IF($I$15=\"Show\",VLOOKUP($B315,Data!$A$4:$T$727,9,FALSE),VLOOKUP($B315,Data!$A$4:$T$727,7,FALSE))","v":{"$error":"#N/A"}},{"$f":"IF($B315=\"\",\"\",VLOOKUP($B315,Data!$A$4:$T$727,6,FALSE))","v":""},"",{"$f":"IF($B315=\"\",\"\",IF(VLOOKUP($B315,Data!$A$4:$T$727,11,FALSE)<1,\"\",VLOOKUP(B315,Data!$A$4:$T$727,11,FALSE)))","v":""}]
[null,null,{"$f":"IF($B316=\"\",\"\",VLOOKUP($B316,Data!$A$4:$T$727,2,FALSE))","v":""},{"$f":"IF($B316=\"\",\"\",VLOOKUP($B316,Data!$A$4:$T$727,10,FALSE))","v":""},{"$f":"IF($B316=\"\",\"\",VLOOKUP($B316,Data!$A$4:$T$727,4,FALSE))","v":""},{"$f":"IF($B316=\"\",\"\",VLOOKUP($B316,Data!$A$4:$T$727,5,FALSE))","v":""},{"$f":"IF($B316=\"\",\"\",VLOOKUP($B316,Data!$A$4:$T$727,7,FALSE))","v":""},"","","","",{"$f":"IF($I$15=\"Show\",VLOOKUP($B316,Data!$A$4:$T$727,9,FALSE),VLOOKUP($B316,Data!$A$4:$T$727,7,FALSE))","v":{"$error":"#N/A"}},{"$f":"IF($B316=\"\",\"\",VLOOKUP($B316,Data!$A$4:$T$727,6,FALSE))","v":""},"",{"$f":"IF($B316=\"\",\"\",IF(VLOOKUP($B316,Data!$A$4:$T$727,11,FALSE)<1,\"\",VLOOKUP(B316,Data!$A$4:$T$727,11,FALSE)))","v":""}]
[null,null,{"$f":"IF($B317=\"\",\"\",VLOOKUP($B317,Data!$A$4:$T$727,2,FALSE))","v":""},{"$f":"IF($B317=\"\",\"\",VLOOKUP($B317,Data!$A$4:$T$727,10,FALSE))","v":""},{"$f":"IF($B317=\"\",\"\",VLOOKUP($B317,Data!$A$4:$T$727,4,FALSE))","v":""},{"$f":"IF($B317=\"\",\"\",VLOOKUP($B317,Data!$A$4:$T$727,5,FALSE))","v":""},{"$f":"IF($B317=\"\",\"\",VLOOKUP($B317,Data!$A$4:$T$727,7,FALSE))","v":""},"","","","",{"$f":"IF($I$15=\"Show\",VLOOKUP($B317,Data!$A$4:$T$727,9,FALSE),VLOOKUP($B317,Data!$A$4:$T$727,7,FALSE))","v":{"$error":"#N/A"}},{"$f":"IF($B317=\"\",\"\",VLOOKUP($B317,Data!$A$4:$T$727,6,FALSE))","v":""},"",{"$f":"IF($B317=\"\",\"\",IF(VLOOKUP($B317,Data!$A$4:$T$727,11,FALSE)<1,\"\",VLOOKUP(B317,Data!$A$4:$T$727,11,FALSE)))","v":""}]
[null,null,{"$f":"IF($B318=\"\",\"\",VLOOKUP($B318,Data!$A$4:$T$727,2,FALSE))","v":""},{"$f":"IF($B318=\"\",\"\",VLOOKUP($B318,Data!$A$4:$T$727,10,FALSE))","v":""},{"$f":"IF($B318=\"\",\"\",VLOOKUP($B318,Data!$A$4:$T$727,4,FALSE))","v":""},{"$f":"IF($B318=\"\",\"\",VLOOKUP($B318,Data!$A$4:$T$727,5,FALSE))","v":""},{"$f":"IF($B318=\"\",\"\",VLOOKUP($B318,Data!$A$4:$T$727,7,FALSE))","v":""},"","","","",{"$f":"IF($I$15=\"Show\",VLOOKUP($B318,Data!$A$4:$T$727,9,FALSE),VLOOKUP($B318,Data!$A$4:$T$727,7,FALSE))","v":{"$error":"#N/A"}},{"$f":"IF($B318=\"\",\"\",VLOOKUP($B318,Data!$A$4:$T$727,6,FALSE))","v":""},"",{"$f":"IF($B318=\"\",\"\",IF(VLOOKUP($B318,Data!$A$4:$T$727,11,FALSE)<1,\"\",VLOOKUP(B318,Data!$A$4:$T$727,11,FALSE)))","v":""}]
[null,null,{"$f":"IF($B319=\"\",\"\",VLOOKUP($B319,Data!$A$4:$T$727,2,FALSE))","v":""},{"$f":"IF($B319=\"\",\"\",VLOOKUP($B319,Data!$A$4:$T$727,10,FALSE))","v":""},{"$f":"IF($B319=\"\",\"\",VLOOKUP($B319,Data!$A$4:$T$727,4,FALSE))","v":""},{"$f":"IF($B319=\"\",\"\",VLOOKUP($B319,Data!$A$4:$T$727,5,FALSE))","v":""},{"$f":"IF($B319=\"\",\"\",VLOOKUP($B319,Data!$A$4:$T$727,7,FALSE))","v":""},"","","","",{"$f":"IF($I$15=\"Show\",VLOOKUP($B319,Data!$A$4:$T$727,9,FALSE),VLOOKUP($B319,Data!$A$4:$T$727,7,FALSE))","v":{"$error":"#N/A"}},{"$f":"IF($B319=\"\",\"\",VLOOKUP($B319,Data!$A$4:$T$727,6,FALSE))","v":""},"",{"$f":"IF($B319=\"\",\"\",IF(VLOOKUP($B319,Data!$A$4:$T$727,11,FALSE)<1,\"\",VLOOKUP(B319,Data!$A$4:$T$727,11,FALSE)))","v":""}]
[null,null,{"$f":"IF($B320=\"\",\"\",VLOOKUP($B320,Data!$A$4:$T$727,2,FALSE))","v":""},{"$f":"IF($B320=\"\",\"\",VLOOKUP($B320,Data!$A$4:$T$727,10,FALSE))","v":""},{"$f":"IF($B320=\"\",\"\",VLOOKUP($B320,Data!$A$4:$T$727,4,FALSE))","v":""},{"$f":"IF($B320=\"\",\"\",VLOOKUP($B320,Data!$A$4:$T$727,5,FALSE))","v":""},{"$f":"IF($B320=\"\",\"\",VLOOKUP($B320,Data!$A$4:$T$727,7,FALSE))","v":""},"","","","",{"$f":"IF($I$15=\"Show\",VLOOKUP($B320,Data!$A$4:$T$727,9,FALSE),VLOOKUP($B320,Data!$A$4:$T$727,7,FALSE))","v":{"$error":"#N/A"}},{"$f":"IF($B320=\"\",\"\",VLOOKUP($B320,Data!$A$4:$T$727,6,FALSE))","v":""},"",{"$f":"IF($B320=\"\",\"\",IF(VLOOKUP($B320,Data!$A$4:$T$727,11,FALSE)<1,\"\",VLOOKUP(B320,Data!$A$4:$T$727,11,FALSE)))","v":""}]
[null,null,{"$f":"IF($B321=\"\",\"\",VLOOKUP($B321,Data!$A$4:$T$727,2,FALSE))","v":""},{"$f":"IF($B321=\"\",\"\",VLOOKUP($B321,Data!$A$4:$T$727,10,FALSE))","v":""},{"$f":"IF($B321=\"\",\"\",VLOOKUP($B321,Data!$A$4:$T$727,4,FALSE))","v":""},{"$f":"IF($B321=\"\",\"\",VLOOKUP($B321,Data!$A$4:$T$727,5,FALSE))","v":""},{"$f":"IF($B321=\"\",\"\",VLOOKUP($B321,Data!$A$4:$T$727,7,FALSE))","v":""},"","","","",{"$f":"IF($I$15=\"Show\",VLOOKUP($B321,Data!$A$4:$T$727,9,FALSE),VLOOKUP($B321,Data!$A$4:$T$727,7,FALSE))","v":{"$error":"#N/A"}},{"$f":"IF($B321=\"\",\"\",VLOOKUP($B321,Data!$A$4:$T$727,6,FALSE))","v":""},"",{"$f":"IF($B321=\"\",\"\",IF(VLOOKUP($B321,Data!$A$4:$T$727,11,FALSE)<1,\"\",VLOOKUP(B321,Data!$A$4:$T$727,11,FALSE)))","v":""}]
[null,null,{"$f":"IF($B322=\"\",\"\",VLOOKUP($B322,Data!$A$4:$T$727,2,FALSE))","v":""},{"$f":"IF($B322=\"\",\"\",VLOOKUP($B322,Data!$A$4:$T$727,10,FALSE))","v":""},{"$f":"IF($B322=\"\",\"\",VLOOKUP($B322,Data!$A$4:$T$727,4,FALSE))","v":""},{"$f":"IF($B322=\"\",\"\",VLOOKUP($B322,Data!$A$4:$T$727,5,FALSE))","v":""},{"$f":"IF($B322=\"\",\"\",VLOOKUP($B322,Data!$A$4:$T$727,7,FALSE))","v":""},"","","","",{"$f":"IF($I$15=\"Show\",VLOOKUP($B322,Data!$A$4:$T$727,9,FALSE),VLOOKUP($B322,Data!$A$4:$T$727,7,FALSE))","v":{"$error":"#N/A"}},{"$f":"IF($B322=\"\",\"\",VLOOKUP($B322,Data!$A$4:$T$727,6,FALSE))","v":""},"",{"$f":"IF($B322=\"\",\"\",IF(VLOOKUP($B322,Data!$A$4:$T$727,11,FALSE)<1,\"\",VLOOKUP(B322,Data!$A$4:$T$727,11,FALSE)))","v":""}]
[null,null,{"$f":"IF($B323=\"\",\"\",VLOOKUP($B323,Data!$A$4:$T$727,2,FALSE))","v":""},{"$f":"IF($B323=\"\",\"\",VLOOKUP($B323,Data!$A$4:$T$727,10,FALSE))","v":""},{"$f":"IF($B323=\"\",\"\",VLOOKUP($B323,Data!$A$4:$T$727,4,FALSE))","v":""},{"$f":"IF($B323=\"\",\"\",VLOOKUP($B323,Data!$A$4:$T$727,5,FALSE))","v":""},{"$f":"IF($B323=\"\",\"\",VLOOKUP($B323,Data!$A$4:$T$727,7,FALSE))","v":""},"","","","",{"$f":"IF($I$15=\"Show\",VLOOKUP($B323,Data!$A$4:$T$727,9,FALSE),VLOOKUP($B323,Data!$A$4:$T$727,7,FALSE))","v":{"$error":"#N/A"}},{"$f":"IF($B323=\"\",\"\",VLOOKUP($B323,Data!$A$4:$T$727,6,FALSE))","v":""},"",{"$f":"IF($B323=\"\",\"\",IF(VLOOKUP($B323,Data!$A$4:$T$727,11,FALSE)<1,\"\",VLOOKUP(B323,Data!$A$4:$T$727,11,FALSE)))","v":""}]
[null,null,{"$f":"IF($B324=\"\",\"\",VLOOKUP($B324,Data!$A$4:$T$727,2,FALSE))","v":""},{"$f":"IF($B324=\"\",\"\",VLOOKUP($B324,Data!$A$4:$T$727,10,FALSE))","v":""},{"$f":"IF($B324=\"\",\"\",VLOOKUP($B324,Data!$A$4:$T$727,4,FALSE))","v":""},{"$f":"IF($B324=\"\",\"\",VLOOKUP($B324,Data!$A$4:$T$727,5,FALSE))","v":""},{"$f":"IF($B324=\"\",\"\",VLOOKUP($B324,Data!$A$4:$T$727,7,FALSE))","v":""},"","","","",{"$f":"IF($I$15=\"Show\",VLOOKUP($B324,Data!$A$4:$T$727,9,FALSE),VLOOKUP($B324,Data!$A$4:$T$727,7,FALSE))","v":{"$error":"#N/A"}},{"$f":"IF($B324=\"\",\"\",VLOOKUP($B324,Data!$A$4:$T$727,6,FALSE))","v":""},"",{"$f":"IF($B324=\"\",\"\",IF(VLOOKUP($B324,Data!$A$4:$T$727,11,FALSE)<1,\"\",VLOOKUP(B324,Data!$A$4:$T$727,11,FALSE)))","v":""}]
[null,null,{"$f":"IF($B325=\"\",\"\",VLOOKUP($B325,Data!$A$4:$T$727,2,FALSE))","v":""},{"$f":"IF($B325=\"\",\"\",VLOOKUP($B325,Data!$A$4:$T$727,10,FALSE))","v":""},{"$f":"IF($B325=\"\",\"\",VLOOKUP($B325,Data!$A$4:$T$727,4,FALSE))","v":""},{"$f":"IF($B325=\"\",\"\",VLOOKUP($B325,Data!$A$4:$T$727,5,FALSE))","v":""},{"$f":"IF($B325=\"\",\"\",VLOOKUP($B325,Data!$A$4:$T$727,7,FALSE))","v":""},"","","","",{"$f":"IF($I$15=\"Show\",VLOOKUP($B325,Data!$A$4:$T$727,9,FALSE),VLOOKUP($B325,Data!$A$4:$T$727,7,FALSE))","v":{"$error":"#N/A"}},{"$f":"IF($B325=\"\",\"\",VLOOKUP($B325,Data!$A$4:$T$727,6,FALSE))","v":""},"",{"$f":"IF($B325=\"\",\"\",IF(VLOOKUP($B325,Data!$A$4:$T$727,11,FALSE)<1,\"\",VLOOKUP(B325,Data!$A$4:$T$727,11,FALSE)))","v":""}]
[null,null,{"$f":"IF($B326=\"\",\"\",VLOOKUP($B326,Data!$A$4:$T$727,2,FALSE))","v":""},{"$f":"IF($B326=\"\",\"\",VLOOKUP($B326,Data!$A$4:$T$727,10,FALSE))","v":""},{"$f":"IF($B326=\"\",\"\",VLOOKUP($B326,Data!$A$4:$T$727,4,FALSE))","v":""},{"$f":"IF($B326=\"\",\"\",VLOOKUP($B326,Data!$A$4:$T$727,5,FALSE))","v":""},{"$f":"IF($B326=\"\",\"\",VLOOKUP($B326,Data!$A$4:$T$727,7,FALSE))","v":""},"","","","",{"$f":"IF($I$15=\"Show\",VLOOKUP($B326,Data!$A$4:$T$727,9,FALSE),VLOOKUP($B326,Data!$A$4:$T$727,7,FALSE))","v":{"$error":"#N/A"}},{"$f":"IF($B326=\"\",\"\",VLOOKUP($B326,Data!$A$4:$T$727,6,FALSE))","v":""},"",{"$f":"IF($B326=\"\",\"\",IF(VLOOKUP($B326,Data!$A$4:$T$727,11,FALSE)<1,\"\",VLOOKUP(B326,Data!$A$4:$T$727,11,FALSE)))","v":""}]
[null,null,{"$f":"IF($B327=\"\",\"\",VLOOKUP($B327,Data!$A$4:$T$727,2,FALSE))","v":""},{"$f":"IF($B327=\"\",\"\",VLOOKUP($B327,Data!$A$4:$T$727,10,FALSE))","v":""},{"$f":"IF($B327=\"\",\"\",VLOOKUP($B327,Data!$A$4:$T$727,4,FALSE))","v":""},{"$f":"IF($B327=\"\",\"\",VLOOKUP($B327,Data!$A$4:$T$727,5,FALSE))","v":""},{"$f":"IF($B327=\"\",\"\",VLOOKUP($B327,Data!$A$4:$T$727,7,FALSE))","v":""},"","","","",{"$f":"IF($I$15=\"Show\",VLOOKUP($B327,Data!$A$4:$T$727,9,FALSE),VLOOKUP($B327,Data!$A$4:$T$727,7,FALSE))","v":{"$error":"#N/A"}},{"$f":"IF($B327=\"\",\"\",VLOOKUP($B327,Data!$A$4:$T$727,6,FALSE))","v":""},"",{"$f":"IF($B327=\"\",\"\",IF(VLOOKUP($B327,Data!$A$4:$T$727,11,FALSE)<1,\"\",VLOOKUP(B327,Data!$A$4:$T$727,11,FALSE)))","v":""}]
[null,null,{"$f":"IF($B328=\"\",\"\",VLOOKUP($B328,Data!$A$4:$T$727,2,FALSE))","v":""},{"$f":"IF($B328=\"\",\"\",VLOOKUP($B328,Data!$A$4:$T$727,10,FALSE))","v":""},{"$f":"IF($B328=\"\",\"\",VLOOKUP($B328,Data!$A$4:$T$727,4,FALSE))","v":""},{"$f":"IF($B328=\"\",\"\",VLOOKUP($B328,Data!$A$4:$T$727,5,FALSE))","v":""},{"$f":"IF($B328=\"\",\"\",VLOOKUP($B328,Data!$A$4:$T$727,7,FALSE))","v":""},"","","","",{"$f":"IF($I$15=\"Show\",VLOOKUP($B328,Data!$A$4:$T$727,9,FALSE),VLOOKUP($B328,Data!$A$4:$T$727,7,FALSE))","v":{"$error":"#N/A"}},{"$f":"IF($B328=\"\",\"\",VLOOKUP($B328,Data!$A$4:$T$727,6,FALSE))","v":""},"",{"$f":"IF($B328=\"\",\"\",IF(VLOOKUP($B328,Data!$A$4:$T$727,11,FALSE)<1,\"\",VLOOKUP(B328,Data!$A$4:$T$727,11,FALSE)))","v":""}]
[null,null,{"$f":"IF($B329=\"\",\"\",VLOOKUP($B329,Data!$A$4:$T$727,2,FALSE))","v":""},{"$f":"IF($B329=\"\",\"\",VLOOKUP($B329,Data!$A$4:$T$727,10,FALSE))","v":""},{"$f":"IF($B329=\"\",\"\",VLOOKUP($B329,Data!$A$4:$T$727,4,FALSE))","v":""},{"$f":"IF($B329=\"\",\"\",VLOOKUP($B329,Data!$A$4:$T$727,5,FALSE))","v":""},{"$f":"IF($B329=\"\",\"\",VLOOKUP($B329,Data!$A$4:$T$727,7,FALSE))","v":""},"","","","",{"$f":"IF($I$15=\"Show\",VLOOKUP($B329,Data!$A$4:$T$727,9,FALSE),VLOOKUP($B329,Data!$A$4:$T$727,7,FALSE))","v":{"$error":"#N/A"}},{"$f":"IF($B329=\"\",\"\",VLOOKUP($B329,Data!$A$4:$T$727,6,FALSE))","v":""},"",{"$f":"IF($B329=\"\",\"\",IF(VLOOKUP($B329,Data!$A$4:$T$727,11,FALSE)<1,\"\",VLOOKUP(B329,Data!$A$4:$T$727,11,FALSE)))","v":""}]
[null,null,{"$f":"IF($B330=\"\",\"\",VLOOKUP($B330,Data!$A$4:$T$727,2,FALSE))","v":""},{"$f":"IF($B330=\"\",\"\",VLOOKUP($B330,Data!$A$4:$T$727,10,FALSE))","v":""},{"$f":"IF($B330=\"\",\"\",VLOOKUP($B330,Data!$A$4:$T$727,4,FALSE))","v":""},{"$f":"IF($B330=\"\",\"\",VLOOKUP($B330,Data!$A$4:$T$727,5,FALSE))","v":""},{"$f":"IF($B330=\"\",\"\",VLOOKUP($B330,Data!$A$4:$T$727,7,FALSE))","v":""},"","","","",{"$f":"IF($I$15=\"Show\",VLOOKUP($B330,Data!$A$4:$T$727,9,FALSE),VLOOKUP($B330,Data!$A$4:$T$727,7,FALSE))","v":{"$error":"#N/A"}},{"$f":"IF($B330=\"\",\"\",VLOOKUP($B330,Data!$A$4:$T$727,6,FALSE))","v":""},"",{"$f":"IF($B330=\"\",\"\",IF(VLOOKUP($B330,Data!$A$4:$T$727,11,FALSE)<1,\"\",VLOOKUP(B330,Data!$A$4:$T$727,11,FALSE)))","v":""}]
[null,null,{"$f":"IF($B331=\"\",\"\",VLOOKUP($B331,Data!$A$4:$T$727,2,FALSE))","v":""},{"$f":"IF($B331=\"\",\"\",VLOOKUP($B331,Data!$A$4:$T$727,10,FALSE))","v":""},{"$f":"IF($B331=\"\",\"\",VLOOKUP($B331,Data!$A$4:$T$727,4,FALSE))","v":""},{"$f":"IF($B331=\"\",\"\",VLOOKUP($B331,Data!$A$4:$T$727,5,FALSE))","v":""},{"$f":"IF($B331=\"\",\"\",VLOOKUP($B331,Data!$A$4:$T$727,7,FALSE))","v":""},"","","","",{"$f":"IF($I$15=\"Show\",VLOOKUP($B331,Data!$A$4:$T$727,9,FALSE),VLOOKUP($B331,Data!$A$4:$T$727,7,FALSE))","v":{"$error":"#N/A"}},{"$f":"IF($B331=\"\",\"\",VLOOKUP($B331,Data!$A$4:$T$727,6,FALSE))","v":""},"",{"$f":"IF($B331=\"\",\"\",IF(VLOOKUP($B331,Data!$A$4:$T$727,11,FALSE)<1,\"\",VLOOKUP(B331,Data!$A$4:$T$727,11,FALSE)))","v":""}]
[null,null,{"$f":"IF($B332=\"\",\"\",VLOOKUP($B332,Data!$A$4:$T$727,2,FALSE))","v":""},{"$f":"IF($B332=\"\",\"\",VLOOKUP($B332,Data!$A$4:$T$727,10,FALSE))","v":""},{"$f":"IF($B332=\"\",\"\",VLOOKUP($B332,Data!$A$4:$T$727,4,FALSE))","v":""},{"$f":"IF($B332=\"\",\"\",VLOOKUP($B332,Data!$A$4:$T$727,5,FALSE))","v":""},{"$f":"IF($B332=\"\",\"\",VLOOKUP($B332,Data!$A$4:$T$727,7,FALSE))","v":""},"","","","",{"$f":"IF($I$15=\"Show\",VLOOKUP($B332,Data!$A$4:$T$727,9,FALSE),VLOOKUP($B332,Data!$A$4:$T$727,7,FALSE))","v":{"$error":"#N/A"}},{"$f":"IF($B332=\"\",\"\",VLOOKUP($B332,Data!$A$4:$T$727,6,FALSE))","v":""},"",{"$f":"IF($B332=\"\",\"\",IF(VLOOKUP($B332,Data!$A$4:$T$727,11,FALSE)<1,\"\",VLOOKUP(B332,Data!$A$4:$T$727,11,FALSE)))","v":""}]
[null,null,{"$f":"IF($B333=\"\",\"\",VLOOKUP($B333,Data!$A$4:$T$727,2,FALSE))","v":""},{"$f":"IF($B333=\"\",\"\",VLOOKUP($B333,Data!$A$4:$T$727,10,FALSE))","v":""},{"$f":"IF($B333=\"\",\"\",VLOOKUP($B333,Data!$A$4:$T$727,4,FALSE))","v":""},{"$f":"IF($B333=\"\",\"\",VLOOKUP($B333,Data!$A$4:$T$727,5,FALSE))","v":""},{"$f":"IF($B333=\"\",\"\",VLOOKUP($B333,Data!$A$4:$T$727,7,FALSE))","v":""},"","","","",{"$f":"IF($I$15=\"Show\",VLOOKUP($B333,Data!$A$4:$T$727,9,FALSE),VLOOKUP($B333,Data!$A$4:$T$727,7,FALSE))","v":{"$error":"#N/A"}},{"$f":"IF($B333=\"\",\"\",VLOOKUP($B333,Data!$A$4:$T$727,6,FALSE))","v":""},"",{"$f":"IF($B333=\"\",\"\",IF(VLOOKUP($B333,Data!$A$4:$T$727,11,FALSE)<1,\"\",VLOOKUP(B333,Data!$A$4:$T$727,11,FALSE)))","v":""}]
[null,null,{"$f":"IF($B334=\"\",\"\",VLOOKUP($B334,Data!$A$4:$T$727,2,FALSE))","v":""},{"$f":"IF($B334=\"\",\"\",VLOOKUP($B334,Data!$A$4:$T$727,10,FALSE))","v":""},{"$f":"IF($B334=\"\",\"\",VLOOKUP($B334,Data!$A$4:$T$727,4,FALSE))","v":""},{"$f":"IF($B334=\"\",\"\",VLOOKUP($B334,Data!$A$4:$T$727,5,FALSE))","v":""},{"$f":"IF($B334=\"\",\"\",VLOOKUP($B334,Data!$A$4:$T$727,7,FALSE))","v":""},"","","","",{"$f":"IF($I$15=\"Show\",VLOOKUP($B334,Data!$A$4:$T$727,9,FALSE),VLOOKUP($B334,Data!$A$4:$T$727,7,FALSE))","v":{"$error":"#N/A"}},{"$f":"IF($B334=\"\",\"\",VLOOKUP($B334,Data!$A$4:$T$727,6,FALSE))","v":""},"",{"$f":"IF($B334=\"\",\"\",IF(VLOOKUP($B334,Data!$A$4:$T$727,11,FALSE)<1,\"\",VLOOKUP(B334,Data!$A$4:$T$727,11,FALSE)))","v":""}]
[null,null,{"$f":"IF($B335=\"\",\"\",VLOOKUP($B335,Data!$A$4:$T$727,2,FALSE))","v":""},{"$f":"IF($B335=\"\",\"\",VLOOKUP($B335,Data!$A$4:$T$727,10,FALSE))","v":""},{"$f":"IF($B335=\"\",\"\",VLOOKUP($B335,Data!$A$4:$T$727,4,FALSE))","v":""},{"$f":"IF($B335=\"\",\"\",VLOOKUP($B335,Data!$A$4:$T$727,5,FALSE))","v":""},{"$f":"IF($B335=\"\",\"\",VLOOKUP($B335,Data!$A$4:$T$727,7,FALSE))","v":""},"","","","",{"$f":"IF($I$15=\"Show\",VLOOKUP($B335,Data!$A$4:$T$727,9,FALSE),VLOOKUP($B335,Data!$A$4:$T$727,7,FALSE))","v":{"$error":"#N/A"}},{"$f":"IF($B335=\"\",\"\",VLOOKUP($B335,Data!$A$4:$T$727,6,FALSE))","v":""},"",{"$f":"IF($B335=\"\",\"\",IF(VLOOKUP($B335,Data!$A$4:$T$727,11,FALSE)<1,\"\",VLOOKUP(B335,Data!$A$4:$T$727,11,FALSE)))","v":""}]
[null,null,{"$f":"IF($B336=\"\",\"\",VLOOKUP($B336,Data!$A$4:$T$727,2,FALSE))","v":""},{"$f":"IF($B336=\"\",\"\",VLOOKUP($B336,Data!$A$4:$T$727,10,FALSE))","v":""},{"$f":"IF($B336=\"\",\"\",VLOOKUP($B336,Data!$A$4:$T$727,4,FALSE))","v":""},{"$f":"IF($B336=\"\",\"\",VLOOKUP($B336,Data!$A$4:$T$727,5,FALSE))","v":""},{"$f":"IF($B336=\"\",\"\",VLOOKUP($B336,Data!$A$4:$T$727,7,FALSE))","v":""},"","","","",{"$f":"IF($I$15=\"Show\",VLOOKUP($B336,Data!$A$4:$T$727,9,FALSE),VLOOKUP($B336,Data!$A$4:$T$727,7,FALSE))","v":{"$error":"#N/A"}},{"$f":"IF($B336=\"\",\"\",VLOOKUP($B336,Data!$A$4:$T$727,6,FALSE))","v":""},"",{"$f":"IF($B336=\"\",\"\",IF(VLOOKUP($B336,Data!$A$4:$T$727,11,FALSE)<1,\"\",VLOOKUP(B336,Data!$A$4:$T$727,11,FALSE)))","v":""}]
[null,null,{"$f":"IF($B337=\"\",\"\",VLOOKUP($B337,Data!$A$4:$T$727,2,FALSE))","v":""},{"$f":"IF($B337=\"\",\"\",VLOOKUP($B337,Data!$A$4:$T$727,10,FALSE))","v":""},{"$f":"IF($B337=\"\",\"\",VLOOKUP($B337,Data!$A$4:$T$727,4,FALSE))","v":""},{"$f":"IF($B337=\"\",\"\",VLOOKUP($B337,Data!$A$4:$T$727,5,FALSE))","v":""},{"$f":"IF($B337=\"\",\"\",VLOOKUP($B337,Data!$A$4:$T$727,7,FALSE))","v":""},"","","","",{"$f":"IF($I$15=\"Show\",VLOOKUP($B337,Data!$A$4:$T$727,9,FALSE),VLOOKUP($B337,Data!$A$4:$T$727,7,FALSE))","v":{"$error":"#N/A"}},{"$f":"IF($B337=\"\",\"\",VLOOKUP($B337,Data!$A$4:$T$727,6,FALSE))","v":""},"",{"$f":"IF($B337=\"\",\"\",IF(VLOOKUP($B337,Data!$A$4:$T$727,11,FALSE)<1,\"\",VLOOKUP(B337,Data!$A$4:$T$727,11,FALSE)))","v":""}]
[null,null,{"$f":"IF($B338=\"\",\"\",VLOOKUP($B338,Data!$A$4:$T$727,2,FALSE))","v":""},{"$f":"IF($B338=\"\",\"\",VLOOKUP($B338,Data!$A$4:$T$727,10,FALSE))","v":""},{"$f":"IF($B338=\"\",\"\",VLOOKUP($B338,Data!$A$4:$T$727,4,FALSE))","v":""},{"$f":"IF($B338=\"\",\"\",VLOOKUP($B338,Data!$A$4:$T$727,5,FALSE))","v":""},{"$f":"IF($B338=\"\",\"\",VLOOKUP($B338,Data!$A$4:$T$727,7,FALSE))","v":""},"","","","",{"$f":"IF($I$15=\"Show\",VLOOKUP($B338,Data!$A$4:$T$727,9,FALSE),VLOOKUP($B338,Data!$A$4:$T$727,7,FALSE))","v":{"$error":"#N/A"}},{"$f":"IF($B338=\"\",\"\",VLOOKUP($B338,Data!$A$4:$T$727,6,FALSE))","v":""},"",{"$f":"IF($B338=\"\",\"\",IF(VLOOKUP($B338,Data!$A$4:$T$727,11,FALSE)<1,\"\",VLOOKUP(B338,Data!$A$4:$T$727,11,FALSE)))","v":""}]
[null,null,{"$f":"IF($B339=\"\",\"\",VLOOKUP($B339,Data!$A$4:$T$727,2,FALSE))","v":""},{"$f":"IF($B339=\"\",\"\",VLOOKUP($B339,Data!$A$4:$T$727,10,FALSE))","v":""},{"$f":"IF($B339=\"\",\"\",VLOOKUP($B339,Data!$A$4:$T$727,4,FALSE))","v":""},{"$f":"IF($B339=\"\",\"\",VLOOKUP($B339,Data!$A$4:$T$727,5,FALSE))","v":""},{"$f":"IF($B339=\"\",\"\",VLOOKUP($B339,Data!$A$4:$T$727,7,FALSE))","v":""},"","","","",{"$f":"IF($I$15=\"Show\",VLOOKUP($B339,Data!$A$4:$T$727,9,FALSE),VLOOKUP($B339,Data!$A$4:$T$727,7,FALSE))","v":{"$error":"#N/A"}},{"$f":"IF($B339=\"\",\"\",VLOOKUP($B339,Data!$A$4:$T$727,6,FALSE))","v":""},"",{"$f":"IF($B339=\"\",\"\",IF(VLOOKUP($B339,Data!$A$4:$T$727,11,FALSE)<1,\"\",VLOOKUP(B339,Data!$A$4:$T$727,11,FALSE)))","v":""}]
[null,null,{"$f":"IF($B340=\"\",\"\",VLOOKUP($B340,Data!$A$4:$T$727,2,FALSE))","v":""},{"$f":"IF($B340=\"\",\"\",VLOOKUP($B340,Data!$A$4:$T$727,10,FALSE))","v":""},{"$f":"IF($B340=\"\",\"\",VLOOKUP($B340,Data!$A$4:$T$727,4,FALSE))","v":""},{"$f":"IF($B340=\"\",\"\",VLOOKUP($B340,Data!$A$4:$T$727,5,FALSE))","v":""},{"$f":"IF($B340=\"\",\"\",VLOOKUP($B340,Data!$A$4:$T$727,7,FALSE))","v":""},"","","","",{"$f":"IF($I$15=\"Show\",VLOOKUP($B340,Data!$A$4:$T$727,9,FALSE),VLOOKUP($B340,Data!$A$4:$T$727,7,FALSE))","v":{"$error":"#N/A"}},{"$f":"IF($B340=\"\",\"\",VLOOKUP($B340,Data!$A$4:$T$727,6,FALSE))","v":""},"",{"$f":"IF($B340=\"\",\"\",IF(VLOOKUP($B340,Data!$A$4:$T$727,11,FALSE)<1,\"\",VLOOKUP(B340,Data!$A$4:$T$727,11,FALSE)))","v":""}]
[null,null,{"$f":"IF($B341=\"\",\"\",VLOOKUP($B341,Data!$A$4:$T$727,2,FALSE))","v":""},{"$f":"IF($B341=\"\",\"\",VLOOKUP($B341,Data!$A$4:$T$727,10,FALSE))","v":""},{"$f":"IF($B341=\"\",\"\",VLOOKUP($B341,Data!$A$4:$T$727,4,FALSE))","v":""},{"$f":"IF($B341=\"\",\"\",VLOOKUP($B341,Data!$A$4:$T$727,5,FALSE))","v":""},{"$f":"IF($B341=\"\",\"\",VLOOKUP($B341,Data!$A$4:$T$727,7,FALSE))","v":""},"","","","",{"$f":"IF($I$15=\"Show\",VLOOKUP($B341,Data!$A$4:$T$727,9,FALSE),VLOOKUP($B341,Data!$A$4:$T$727,7,FALSE))","v":{"$error":"#N/A"}},{"$f":"IF($B341=\"\",\"\",VLOOKUP($B341,Data!$A$4:$T$727,6,FALSE))","v":""},"",{"$f":"IF($B341=\"\",\"\",IF(VLOOKUP($B341,Data!$A$4:$T$727,11,FALSE)<1,\"\",VLOOKUP(B341,Data!$A$4:$T$727,11,FALSE)))","v":""}]
[null,null,{"$f":"IF($B342=\"\",\"\",VLOOKUP($B342,Data!$A$4:$T$727,2,FALSE))","v":""},{"$f":"IF($B342=\"\",\"\",VLOOKUP($B342,Data!$A$4:$T$727,10,FALSE))","v":""},{"$f":"IF($B342=\"\",\"\",VLOOKUP($B342,Data!$A$4:$T$727,4,FALSE))","v":""},{"$f":"IF($B342=\"\",\"\",VLOOKUP($B342,Data!$A$4:$T$727,5,FALSE))","v":""},{"$f":"IF($B342=\"\",\"\",VLOOKUP($B342,Data!$A$4:$T$727,7,FALSE))","v":""},{"$f":"IF($B342=\"\",\"\",IF($K$15=\"\",\"\",ROUND($G342*(1-($K$15*0.01)),2)))","v":""},{"$f":"IF($B342=\"\",\"\",IF($G342=$L342,\"\",L342))","v":""},{"$f":"IF($B342=\"\",\"\",IF($H342<$L342,$H342,$L342))","v":""},{"$f":"IF(A342=\"\",\"\",J342*A342)","v":""},{"$f":"IF($I$15=\"Show\",VLOOKUP($B342,Data!$A$4:$T$727,9,FALSE),VLOOKUP($B342,Data!$A$4:$T$727,7,FALSE))","v":{"$error":"#N/A"}},{"$f":"IF($B342=\"\",\"\",VLOOKUP($B342,Data!$A$4:$T$727,6,FALSE))","v":""},{"$f":"IF($A342=\"\",\"\",$A342/$M342)","v":""},{"$f":"IF($B342=\"\",\"\",IF(VLOOKUP($B342,Data!$A$4:$T$727,11,FALSE)<1,\"\",VLOOKUP(B342,Data!$A$4:$T$727,11,FALSE)))","v":""}]
[null,null,{"$f":"IF($B343=\"\",\"\",VLOOKUP($B343,Data!$A$4:$T$727,2,FALSE))","v":""},{"$f":"IF($B343=\"\",\"\",VLOOKUP($B343,Data!$A$4:$T$727,10,FALSE))","v":""},{"$f":"IF($B343=\"\",\"\",VLOOKUP($B343,Data!$A$4:$T$727,4,FALSE))","v":""},{"$f":"IF($B343=\"\",\"\",VLOOKUP($B343,Data!$A$4:$T$727,5,FALSE))","v":""},{"$f":"IF($B343=\"\",\"\",VLOOKUP($B343,Data!$A$4:$T$727,7,FALSE))","v":""},"","","","",{"$f":"IF($I$15=\"Show\",VLOOKUP($B343,Data!$A$4:$T$727,9,FALSE),VLOOKUP($B343,Data!$A$4:$T$727,7,FALSE))","v":{"$error":"#N/A"}},{"$f":"IF($B343=\"\",\"\",VLOOKUP($B343,Data!$A$4:$T$727,6,FALSE))","v":""},"",{"$f":"IF($B343=\"\",\"\",IF(VLOOKUP($B343,Data!$A$4:$T$727,11,FALSE)<1,\"\",VLOOKUP(B343,Data!$A$4:$T$727,11,FALSE)))","v":""}]
[null,null,{"$f":"IF($B344=\"\",\"\",VLOOKUP($B344,Data!$A$4:$T$727,2,FALSE))","v":""},{"$f":"IF($B344=\"\",\"\",VLOOKUP($B344,Data!$A$4:$T$727,10,FALSE))","v":""},{"$f":"IF($B344=\"\",\"\",VLOOKUP($B344,Data!$A$4:$T$727,4,FALSE))","v":""},{"$f":"IF($B344=\"\",\"\",VLOOKUP($B344,Data!$A$4:$T$727,5,FALSE))","v":""},{"$f":"IF($B344=\"\",\"\",VLOOKUP($B344,Data!$A$4:$T$727,7,FALSE))","v":""},"","","","",{"$f":"IF($I$15=\"Show\",VLOOKUP($B344,Data!$A$4:$T$727,9,FALSE),VLOOKUP($B344,Data!$A$4:$T$727,7,FALSE))","v":{"$error":"#N/A"}},{"$f":"IF($B344=\"\",\"\",VLOOKUP($B344,Data!$A$4:$T$727,6,FALSE))","v":""},"",{"$f":"IF($B344=\"\",\"\",IF(VLOOKUP($B344,Data!$A$4:$T$727,11,FALSE)<1,\"\",VLOOKUP(B344,Data!$A$4:$T$727,11,FALSE)))","v":""}]
[null,null,{"$f":"IF($B345=\"\",\"\",VLOOKUP($B345,Data!$A$4:$T$727,2,FALSE))","v":""},{"$f":"IF($B345=\"\",\"\",VLOOKUP($B345,Data!$A$4:$T$727,10,FALSE))","v":""},{"$f":"IF($B345=\"\",\"\",VLOOKUP($B345,Data!$A$4:$T$727,4,FALSE))","v":""},{"$f":"IF($B345=\"\",\"\",VLOOKUP($B345,Data!$A$4:$T$727,5,FALSE))","v":""},{"$f":"IF($B345=\"\",\"\",VLOOKUP($B345,Data!$A$4:$T$727,7,FALSE))","v":""},"","","","",{"$f":"IF($I$15=\"Show\",VLOOKUP($B345,Data!$A$4:$T$727,9,FALSE),VLOOKUP($B345,Data!$A$4:$T$727,7,FALSE))","v":{"$error":"#N/A"}},{"$f":"IF($B345=\"\",\"\",VLOOKUP($B345,Data!$A$4:$T$727,6,FALSE))","v":""},"",{"$f":"IF($B345=\"\",\"\",IF(VLOOKUP($B345,Data!$A$4:$T$727,11,FALSE)<1,\"\",VLOOKUP(B345,Data!$A$4:$T$727,11,FALSE)))","v":""}]
[null,null,{"$f":"IF($B346=\"\",\"\",VLOOKUP($B346,Data!$A$4:$T$727,2,FALSE))","v":""},{"$f":"IF($B346=\"\",\"\",VLOOKUP($B346,Data!$A$4:$T$727,10,FALSE))","v":""},{"$f":"IF($B346=\"\",\"\",VLOOKUP($B346,Data!$A$4:$T$727,4,FALSE))","v":""},{"$f":"IF($B346=\"\",\"\",VLOOKUP($B346,Data!$A$4:$T$727,5,FALSE))","v":""},{"$f":"IF($B346=\"\",\"\",VLOOKUP($B346,Data!$A$4:$T$727,7,FALSE))","v":""},"","","","",{"$f":"IF($I$15=\"Show\",VLOOKUP($B346,Data!$A$4:$T$727,9,FALSE),VLOOKUP($B346,Data!$A$4:$T$727,7,FALSE))","v":{"$error":"#N/A"}},{"$f":"IF($B346=\"\",\"\",VLOOKUP($B346,Data!$A$4:$T$727,6,FALSE))","v":""},"",{"$f":"IF($B346=\"\",\"\",IF(VLOOKUP($B346,Data!$A$4:$T$727,11,FALSE)<1,\"\",VLOOKUP(B346,Data!$A$4:$T$727,11,FALSE)))","v":""}]
[null,null,{"$f":"IF($B347=\"\",\"\",VLOOKUP($B347,Data!$A$4:$T$727,2,FALSE))","v":""},{"$f":"IF($B347=\"\",\"\",VLOOKUP($B347,Data!$A$4:$T$727,10,FALSE))","v":""},{"$f":"IF($B347=\"\",\"\",VLOOKUP($B347,Data!$A$4:$T$727,4,FALSE))","v":""},{"$f":"IF($B347=\"\",\"\",VLOOKUP($B347,Data!$A$4:$T$727,5,FALSE))","v":""},{"$f":"IF($B347=\"\",\"\",VLOOKUP($B347,Data!$A$4:$T$727,7,FALSE))","v":""},"","","","",{"$f":"IF($I$15=\"Show\",VLOOKUP($B347,Data!$A$4:$T$727,9,FALSE),VLOOKUP($B347,Data!$A$4:$T$727,7,FALSE))","v":{"$error":"#N/A"}},{"$f":"IF($B347=\"\",\"\",VLOOKUP($B347,Data!$A$4:$T$727,6,FALSE))","v":""},"",{"$f":"IF($B347=\"\",\"\",IF(VLOOKUP($B347,Data!$A$4:$T$727,11,FALSE)<1,\"\",VLOOKUP(B347,Data!$A$4:$T$727,11,FALSE)))","v":""}]
[null,null,{"$f":"IF($B348=\"\",\"\",VLOOKUP($B348,Data!$A$4:$T$727,2,FALSE))","v":""},{"$f":"IF($B348=\"\",\"\",VLOOKUP($B348,Data!$A$4:$T$727,10,FALSE))","v":""},{"$f":"IF($B348=\"\",\"\",VLOOKUP($B348,Data!$A$4:$T$727,4,FALSE))","v":""},{"$f":"IF($B348=\"\",\"\",VLOOKUP($B348,Data!$A$4:$T$727,5,FALSE))","v":""},{"$f":"IF($B348=\"\",\"\",VLOOKUP($B348,Data!$A$4:$T$727,7,FALSE))","v":""},"","","","",{"$f":"IF($I$15=\"Show\",VLOOKUP($B348,Data!$A$4:$T$727,9,FALSE),VLOOKUP($B348,Data!$A$4:$T$727,7,FALSE))","v":{"$error":"#N/A"}},{"$f":"IF($B348=\"\",\"\",VLOOKUP($B348,Data!$A$4:$T$727,6,FALSE))","v":""},"",{"$f":"IF($B348=\"\",\"\",IF(VLOOKUP($B348,Data!$A$4:$T$727,11,FALSE)<1,\"\",VLOOKUP(B348,Data!$A$4:$T$727,11,FALSE)))","v":""}]
[null,null,{"$f":"IF($B349=\"\",\"\",VLOOKUP($B349,Data!$A$4:$T$727,2,FALSE))","v":""},{"$f":"IF($B349=\"\",\"\",VLOOKUP($B349,Data!$A$4:$T$727,10,FALSE))","v":""},{"$f":"IF($B349=\"\",\"\",VLOOKUP($B349,Data!$A$4:$T$727,4,FALSE))","v":""},{"$f":"IF($B349=\"\",\"\",VLOOKUP($B349,Data!$A$4:$T$727,5,FALSE))","v":""},{"$f":"IF($B349=\"\",\"\",VLOOKUP($B349,Data!$A$4:$T$727,7,FALSE))","v":""},"","","","",{"$f":"IF($I$15=\"Show\",VLOOKUP($B349,Data!$A$4:$T$727,9,FALSE),VLOOKUP($B349,Data!$A$4:$T$727,7,FALSE))","v":{"$error":"#N/A"}},{"$f":"IF($B349=\"\",\"\",VLOOKUP($B349,Data!$A$4:$T$727,6,FALSE))","v":""},"",{"$f":"IF($B349=\"\",\"\",IF(VLOOKUP($B349,Data!$A$4:$T$727,11,FALSE)<1,\"\",VLOOKUP(B349,Data!$A$4:$T$727,11,FALSE)))","v":""}]
[null,null,{"$f":"IF($B350=\"\",\"\",VLOOKUP($B350,Data!$A$4:$T$727,2,FALSE))","v":""},{"$f":"IF($B350=\"\",\"\",VLOOKUP($B350,Data!$A$4:$T$727,10,FALSE))","v":""},{"$f":"IF($B350=\"\",\"\",VLOOKUP($B350,Data!$A$4:$T$727,4,FALSE))","v":""},{"$f":"IF($B350=\"\",\"\",VLOOKUP($B350,Data!$A$4:$T$727,5,FALSE))","v":""},{"$f":"IF($B350=\"\",\"\",VLOOKUP($B350,Data!$A$4:$T$727,7,FALSE))","v":""},"","","","",{"$f":"IF($I$15=\"Show\",VLOOKUP($B350,Data!$A$4:$T$727,9,FALSE),VLOOKUP($B350,Data!$A$4:$T$727,7,FALSE))","v":{"$error":"#N/A"}},{"$f":"IF($B350=\"\",\"\",VLOOKUP($B350,Data!$A$4:$T$727,6,FALSE))","v":""},"",{"$f":"IF($B350=\"\",\"\",IF(VLOOKUP($B350,Data!$A$4:$T$727,11,FALSE)<1,\"\",VLOOKUP(B350,Data!$A$4:$T$727,11,FALSE)))","v":""}]
[null,null,{"$f":"IF($B351=\"\",\"\",VLOOKUP($B351,Data!$A$4:$T$727,2,FALSE))","v":""},{"$f":"IF($B351=\"\",\"\",VLOOKUP($B351,Data!$A$4:$T$727,10,FALSE))","v":""},{"$f":"IF($B351=\"\",\"\",VLOOKUP($B351,Data!$A$4:$T$727,4,FALSE))","v":""},{"$f":"IF($B351=\"\",\"\",VLOOKUP($B351,Data!$A$4:$T$727,5,FALSE))","v":""},{"$f":"IF($B351=\"\",\"\",VLOOKUP($B351,Data!$A$4:$T$727,7,FALSE))","v":""},"","","","",{"$f":"IF($I$15=\"Show\",VLOOKUP($B351,Data!$A$4:$T$727,9,FALSE),VLOOKUP($B351,Data!$A$4:$T$727,7,FALSE))","v":{"$error":"#N/A"}},{"$f":"IF($B351=\"\",\"\",VLOOKUP($B351,Data!$A$4:$T$727,6,FALSE))","v":""},"",{"$f":"IF($B351=\"\",\"\",IF(VLOOKUP($B351,Data!$A$4:$T$727,11,FALSE)<1,\"\",VLOOKUP(B351,Data!$A$4:$T$727,11,FALSE)))","v":""}]
[null,null,{"$f":"IF($B352=\"\",\"\",VLOOKUP($B352,Data!$A$4:$T$727,2,FALSE))","v":""},{"$f":"IF($B352=\"\",\"\",VLOOKUP($B352,Data!$A$4:$T$727,10,FALSE))","v":""},{"$f":"IF($B352=\"\",\"\",VLOOKUP($B352,Data!$A$4:$T$727,4,FALSE))","v":""},{"$f":"IF($B352=\"\",\"\",VLOOKUP($B352,Data!$A$4:$T$727,5,FALSE))","v":""},{"$f":"IF($B352=\"\",\"\",VLOOKUP($B352,Data!$A$4:$T$727,7,FALSE))","v":""},"","","","",{"$f":"IF($I$15=\"Show\",VLOOKUP($B352,Data!$A$4:$T$727,9,FALSE),VLOOKUP($B352,Data!$A$4:$T$727,7,FALSE))","v":{"$error":"#N/A"}},{"$f":"IF($B352=\"\",\"\",VLOOKUP($B352,Data!$A$4:$T$727,6,FALSE))","v":""},"",{"$f":"IF($B352=\"\",\"\",IF(VLOOKUP($B352,Data!$A$4:$T$727,11,FALSE)<1,\"\",VLOOKUP(B352,Data!$A$4:$T$727,11,FALSE)))","v":""}]
[null,null,{"$f":"IF($B353=\"\",\"\",VLOOKUP($B353,Data!$A$4:$T$727,2,FALSE))","v":""},{"$f":"IF($B353=\"\",\"\",VLOOKUP($B353,Data!$A$4:$T$727,10,FALSE))","v":""},{"$f":"IF($B353=\"\",\"\",VLOOKUP($B353,Data!$A$4:$T$727,4,FALSE))","v":""},{"$f":"IF($B353=\"\",\"\",VLOOKUP($B353,Data!$A$4:$T$727,5,FALSE))","v":""},{"$f":"IF($B353=\"\",\"\",VLOOKUP($B353,Data!$A$4:$T$727,7,FALSE))","v":""},"","","","",{"$f":"IF($I$15=\"Show\",VLOOKUP($B353,Data!$A$4:$T$727,9,FALSE),VLOOKUP($B353,Data!$A$4:$T$727,7,FALSE))","v":{"$error":"#N/A"}},{"$f":"IF($B353=\"\",\"\",VLOOKUP($B353,Data!$A$4:$T$727,6,FALSE))","v":""},"",{"$f":"IF($B353=\"\",\"\",IF(VLOOKUP($B353,Data!$A$4:$T$727,11,FALSE)<1,\"\",VLOOKUP(B353,Data!$A$4:$T$727,11,FALSE)))","v":""}]
[null,null,{"$f":"IF($B354=\"\",\"\",VLOOKUP($B354,Data!$A$4:$T$727,2,FALSE))","v":""},{"$f":"IF($B354=\"\",\"\",VLOOKUP($B354,Data!$A$4:$T$727,10,FALSE))","v":""},{"$f":"IF($B354=\"\",\"\",VLOOKUP($B354,Data!$A$4:$T$727,4,FALSE))","v":""},{"$f":"IF($B354=\"\",\"\",VLOOKUP($B354,Data!$A$4:$T$727,5,FALSE))","v":""},{"$f":"IF($B354=\"\",\"\",VLOOKUP($B354,Data!$A$4:$T$727,7,FALSE))","v":""},"","","","",{"$f":"IF($I$15=\"Show\",VLOOKUP($B354,Data!$A$4:$T$727,9,FALSE),VLOOKUP($B354,Data!$A$4:$T$727,7,FALSE))","v":{"$error":"#N/A"}},{"$f":"IF($B354=\"\",\"\",VLOOKUP($B354,Data!$A$4:$T$727,6,FALSE))","v":""},"",{"$f":"IF($B354=\"\",\"\",IF(VLOOKUP($B354,Data!$A$4:$T$727,11,FALSE)<1,\"\",VLOOKUP(B354,Data!$A$4:$T$727,11,FALSE)))","v":""}]
[null,null,{"$f":"IF($B355=\"\",\"\",VLOOKUP($B355,Data!$A$4:$T$727,2,FALSE))","v":""},{"$f":"IF($B355=\"\",\"\",VLOOKUP($B355,Data!$A$4:$T$727,10,FALSE))","v":""},{"$f":"IF($B355=\"\",\"\",VLOOKUP($B355,Data!$A$4:$T$727,4,FALSE))","v":""},{"$f":"IF($B355=\"\",\"\",VLOOKUP($B355,Data!$A$4:$T$727,5,FALSE))","v":""},{"$f":"IF($B355=\"\",\"\",VLOOKUP($B355,Data!$A$4:$T$727,7,FALSE))","v":""},"","","","",{"$f":"IF($I$15=\"Show\",VLOOKUP($B355,Data!$A$4:$T$727,9,FALSE),VLOOKUP($B355,Data!$A$4:$T$727,7,FALSE))","v":{"$error":"#N/A"}},{"$f":"IF($B355=\"\",\"\",VLOOKUP($B355,Data!$A$4:$T$727,6,FALSE))","v":""},"",{"$f":"IF($B355=\"\",\"\",IF(VLOOKUP($B355,Data!$A$4:$T$727,11,FALSE)<1,\"\",VLOOKUP(B355,Data!$A$4:$T$727,11,FALSE)))","v":""}]
[null,null,{"$f":"IF($B356=\"\",\"\",VLOOKUP($B356,Data!$A$4:$T$727,2,FALSE))","v":""},{"$f":"IF($B356=\"\",\"\",VLOOKUP($B356,Data!$A$4:$T$727,10,FALSE))","v":""},{"$f":"IF($B356=\"\",\"\",VLOOKUP($B356,Data!$A$4:$T$727,4,FALSE))","v":""},{"$f":"IF($B356=\"\",\"\",VLOOKUP($B356,Data!$A$4:$T$727,5,FALSE))","v":""},{"$f":"IF($B356=\"\",\"\",VLOOKUP($B356,Data!$A$4:$T$727,7,FALSE))","v":""},"","","","",{"$f":"IF($I$15=\"Show\",VLOOKUP($B356,Data!$A$4:$T$727,9,FALSE),VLOOKUP($B356,Data!$A$4:$T$727,7,FALSE))","v":{"$error":"#N/A"}},{"$f":"IF($B356=\"\",\"\",VLOOKUP($B356,Data!$A$4:$T$727,6,FALSE))","v":""},"",{"$f":"IF($B356=\"\",\"\",IF(VLOOKUP($B356,Data!$A$4:$T$727,11,FALSE)<1,\"\",VLOOKUP(B356,Data!$A$4:$T$727,11,FALSE)))","v":""}]
[null,null,{"$f":"IF($B357=\"\",\"\",VLOOKUP($B357,Data!$A$4:$T$727,2,FALSE))","v":""},{"$f":"IF($B357=\"\",\"\",VLOOKUP($B357,Data!$A$4:$T$727,10,FALSE))","v":""},{"$f":"IF($B357=\"\",\"\",VLOOKUP($B357,Data!$A$4:$T$727,4,FALSE))","v":""},{"$f":"IF($B357=\"\",\"\",VLOOKUP($B357,Data!$A$4:$T$727,5,FALSE))","v":""},{"$f":"IF($B357=\"\",\"\",VLOOKUP($B357,Data!$A$4:$T$727,7,FALSE))","v":""},"","","","",{"$f":"IF($I$15=\"Show\",VLOOKUP($B357,Data!$A$4:$T$727,9,FALSE),VLOOKUP($B357,Data!$A$4:$T$727,7,FALSE))","v":{"$error":"#N/A"}},{"$f":"IF($B357=\"\",\"\",VLOOKUP($B357,Data!$A$4:$T$727,6,FALSE))","v":""},"",{"$f":"IF($B357=\"\",\"\",IF(VLOOKUP($B357,Data!$A$4:$T$727,11,FALSE)<1,\"\",VLOOKUP(B357,Data!$A$4:$T$727,11,FALSE)))","v":""}]
[null,null,{"$f":"IF($B358=\"\",\"\",VLOOKUP($B358,Data!$A$4:$T$727,2,FALSE))","v":""},{"$f":"IF($B358=\"\",\"\",VLOOKUP($B358,Data!$A$4:$T$727,10,FALSE))","v":""},{"$f":"IF($B358=\"\",\"\",VLOOKUP($B358,Data!$A$4:$T$727,4,FALSE))","v":""},{"$f":"IF($B358=\"\",\"\",VLOOKUP($B358,Data!$A$4:$T$727,5,FALSE))","v":""},{"$f":"IF($B358=\"\",\"\",VLOOKUP($B358,Data!$A$4:$T$727,7,FALSE))","v":""},"","","","",{"$f":"IF($I$15=\"Show\",VLOOKUP($B358,Data!$A$4:$T$727,9,FALSE),VLOOKUP($B358,Data!$A$4:$T$727,7,FALSE))","v":{"$error":"#N/A"}},{"$f":"IF($B358=\"\",\"\",VLOOKUP($B358,Data!$A$4:$T$727,6,FALSE))","v":""},"",{"$f":"IF($B358=\"\",\"\",IF(VLOOKUP($B358,Data!$A$4:$T$727,11,FALSE)<1,\"\",VLOOKUP(B358,Data!$A$4:$T$727,11,FALSE)))","v":""}]
[null,null,{"$f":"IF($B359=\"\",\"\",VLOOKUP($B359,Data!$A$4:$T$727,2,FALSE))","v":""},{"$f":"IF($B359=\"\",\"\",VLOOKUP($B359,Data!$A$4:$T$727,10,FALSE))","v":""},{"$f":"IF($B359=\"\",\"\",VLOOKUP($B359,Data!$A$4:$T$727,4,FALSE))","v":""},{"$f":"IF($B359=\"\",\"\",VLOOKUP($B359,Data!$A$4:$T$727,5,FALSE))","v":""},{"$f":"IF($B359=\"\",\"\",VLOOKUP($B359,Data!$A$4:$T$727,7,FALSE))","v":""},"","","","",{"$f":"IF($I$15=\"Show\",VLOOKUP($B359,Data!$A$4:$T$727,9,FALSE),VLOOKUP($B359,Data!$A$4:$T$727,7,FALSE))","v":{"$error":"#N/A"}},{"$f":"IF($B359=\"\",\"\",VLOOKUP($B359,Data!$A$4:$T$727,6,FALSE))","v":""},"",{"$f":"IF($B359=\"\",\"\",IF(VLOOKUP($B359,Data!$A$4:$T$727,11,FALSE)<1,\"\",VLOOKUP(B359,Data!$A$4:$T$727,11,FALSE)))","v":""}]
[null,null,{"$f":"IF($B360=\"\",\"\",VLOOKUP($B360,Data!$A$4:$T$727,2,FALSE))","v":""},{"$f":"IF($B360=\"\",\"\",VLOOKUP($B360,Data!$A$4:$T$727,10,FALSE))","v":""},{"$f":"IF($B360=\"\",\"\",VLOOKUP($B360,Data!$A$4:$T$727,4,FALSE))","v":""},{"$f":"IF($B360=\"\",\"\",VLOOKUP($B360,Data!$A$4:$T$727,5,FALSE))","v":""},{"$f":"IF($B360=\"\",\"\",VLOOKUP($B360,Data!$A$4:$T$727,7,FALSE))","v":""},"","","","",{"$f":"IF($I$15=\"Show\",VLOOKUP($B360,Data!$A$4:$T$727,9,FALSE),VLOOKUP($B360,Data!$A$4:$T$727,7,FALSE))","v":{"$error":"#N/A"}},{"$f":"IF($B360=\"\",\"\",VLOOKUP($B360,Data!$A$4:$T$727,6,FALSE))","v":""},"",{"$f":"IF($B360=\"\",\"\",IF(VLOOKUP($B360,Data!$A$4:$T$727,11,FALSE)<1,\"\",VLOOKUP(B360,Data!$A$4:$T$727,11,FALSE)))","v":""}]
[null,null,{"$f":"IF($B361=\"\",\"\",VLOOKUP($B361,Data!$A$4:$T$727,2,FALSE))","v":""},{"$f":"IF($B361=\"\",\"\",VLOOKUP($B361,Data!$A$4:$T$727,10,FALSE))","v":""},{"$f":"IF($B361=\"\",\"\",VLOOKUP($B361,Data!$A$4:$T$727,4,FALSE))","v":""},{"$f":"IF($B361=\"\",\"\",VLOOKUP($B361,Data!$A$4:$T$727,5,FALSE))","v":""},{"$f":"IF($B361=\"\",\"\",VLOOKUP($B361,Data!$A$4:$T$727,7,FALSE))","v":""},"","","","",{"$f":"IF($I$15=\"Show\",VLOOKUP($B361,Data!$A$4:$T$727,9,FALSE),VLOOKUP($B361,Data!$A$4:$T$727,7,FALSE))","v":{"$error":"#N/A"}},{"$f":"IF($B361=\"\",\"\",VLOOKUP($B361,Data!$A$4:$T$727,6,FALSE))","v":""},"",{"$f":"IF($B361=\"\",\"\",IF(VLOOKUP($B361,Data!$A$4:$T$727,11,FALSE)<1,\"\",VLOOKUP(B361,Data!$A$4:$T$727,11,FALSE)))","v":""}]
[null,null,{"$f":"IF($B362=\"\",\"\",VLOOKUP($B362,Data!$A$4:$T$727,2,FALSE))","v":""},{"$f":"IF($B362=\"\",\"\",VLOOKUP($B362,Data!$A$4:$T$727,10,FALSE))","v":""},{"$f":"IF($B362=\"\",\"\",VLOOKUP($B362,Data!$A$4:$T$727,4,FALSE))","v":""},{"$f":"IF($B362=\"\",\"\",VLOOKUP($B362,Data!$A$4:$T$727,5,FALSE))","v":""},{"$f":"IF($B362=\"\",\"\",VLOOKUP($B362,Data!$A$4:$T$727,7,FALSE))","v":""},"","","","",{"$f":"IF($I$15=\"Show\",VLOOKUP($B362,Data!$A$4:$T$727,9,FALSE),VLOOKUP($B362,Data!$A$4:$T$727,7,FALSE))","v":{"$error":"#N/A"}},{"$f":"IF($B362=\"\",\"\",VLOOKUP($B362,Data!$A$4:$T$727,6,FALSE))","v":""},"",{"$f":"IF($B362=\"\",\"\",IF(VLOOKUP($B362,Data!$A$4:$T$727,11,FALSE)<1,\"\",VLOOKUP(B362,Data!$A$4:$T$727,11,FALSE)))","v":""}]
[null,null,{"$f":"IF($B363=\"\",\"\",VLOOKUP($B363,Data!$A$4:$T$727,2,FALSE))","v":""},{"$f":"IF($B363=\"\",\"\",VLOOKUP($B363,Data!$A$4:$T$727,10,FALSE))","v":""},{"$f":"IF($B363=\"\",\"\",VLOOKUP($B363,Data!$A$4:$T$727,4,FALSE))","v":""},{"$f":"IF($B363=\"\",\"\",VLOOKUP($B363,Data!$A$4:$T$727,5,FALSE))","v":""},{"$f":"IF($B363=\"\",\"\",VLOOKUP($B363,Data!$A$4:$T$727,7,FALSE))","v":""},"","","","",{"$f":"IF($I$15=\"Show\",VLOOKUP($B363,Data!$A$4:$T$727,9,FALSE),VLOOKUP($B363,Data!$A$4:$T$727,7,FALSE))","v":{"$error":"#N/A"}},{"$f":"IF($B363=\"\",\"\",VLOOKUP($B363,Data!$A$4:$T$727,6,FALSE))","v":""},"",{"$f":"IF($B363=\"\",\"\",IF(VLOOKUP($B363,Data!$A$4:$T$727,11,FALSE)<1,\"\",VLOOKUP(B363,Data!$A$4:$T$727,11,FALSE)))","v":""}]
[null,null,{"$f":"IF($B364=\"\",\"\",VLOOKUP($B364,Data!$A$4:$T$727,2,FALSE))","v":""},{"$f":"IF($B364=\"\",\"\",VLOOKUP($B364,Data!$A$4:$T$727,10,FALSE))","v":""},{"$f":"IF($B364=\"\",\"\",VLOOKUP($B364,Data!$A$4:$T$727,4,FALSE))","v":""},{"$f":"IF($B364=\"\",\"\",VLOOKUP($B364,Data!$A$4:$T$727,5,FALSE))","v":""},{"$f":"IF($B364=\"\",\"\",VLOOKUP($B364,Data!$A$4:$T$727,7,FALSE))","v":""},"","","","",{"$f":"IF($I$15=\"Show\",VLOOKUP($B364,Data!$A$4:$T$727,9,FALSE),VLOOKUP($B364,Data!$A$4:$T$727,7,FALSE))","v":{"$error":"#N/A"}},{"$f":"IF($B364=\"\",\"\",VLOOKUP($B364,Data!$A$4:$T$727,6,FALSE))","v":""},"",{"$f":"IF($B364=\"\",\"\",IF(VLOOKUP($B364,Data!$A$4:$T$727,11,FALSE)<1,\"\",VLOOKUP(B364,Data!$A$4:$T$727,11,FALSE)))","v":""}]
[null,null,{"$f":"IF($B365=\"\",\"\",VLOOKUP($B365,Data!$A$4:$T$727,2,FALSE))","v":""},{"$f":"IF($B365=\"\",\"\",VLOOKUP($B365,Data!$A$4:$T$727,10,FALSE))","v":""},{"$f":"IF($B365=\"\",\"\",VLOOKUP($B365,Data!$A$4:$T$727,4,FALSE))","v":""},{"$f":"IF($B365=\"\",\"\",VLOOKUP($B365,Data!$A$4:$T$727,5,FALSE))","v":""},{"$f":"IF($B365=\"\",\"\",VLOOKUP($B365,Data!$A$4:$T$727,7,FALSE))","v":""},"","","","",{"$f":"IF($I$15=\"Show\",VLOOKUP($B365,Data!$A$4:$T$727,9,FALSE),VLOOKUP($B365,Data!$A$4:$T$727,7,FALSE))","v":{"$error":"#N/A"}},{"$f":"IF($B365=\"\",\"\",VLOOKUP($B365,Data!$A$4:$T$727,6,FALSE))","v":""},"",{"$f":"IF($B365=\"\",\"\",IF(VLOOKUP($B365,Data!$A$4:$T$727,11,FALSE)<1,\"\",VLOOKUP(B365,Data!$A$4:$T$727,11,FALSE)))","v":""}]
[null,null,{"$f":"IF($B366=\"\",\"\",VLOOKUP($B366,Data!$A$4:$T$727,2,FALSE))","v":""},{"$f":"IF($B366=\"\",\"\",VLOOKUP($B366,Data!$A$4:$T$727,10,FALSE))","v":""},{"$f":"IF($B366=\"\",\"\",VLOOKUP($B366,Data!$A$4:$T$727,4,FALSE))","v":""},{"$f":"IF($B366=\"\",\"\",VLOOKUP($B366,Data!$A$4:$T$727,5,FALSE))","v":""},{"$f":"IF($B366=\"\",\"\",VLOOKUP($B366,Data!$A$4:$T$727,7,FALSE))","v":""},"","","","",{"$f":"IF($I$15=\"Show\",VLOOKUP($B366,Data!$A$4:$T$727,9,FALSE),VLOOKUP($B366,Data!$A$4:$T$727,7,FALSE))","v":{"$error":"#N/A"}},{"$f":"IF($B366=\"\",\"\",VLOOKUP($B366,Data!$A$4:$T$727,6,FALSE))","v":""},"",{"$f":"IF($B366=\"\",\"\",IF(VLOOKUP($B366,Data!$A$4:$T$727,11,FALSE)<1,\"\",VLOOKUP(B366,Data!$A$4:$T$727,11,FALSE)))","v":""}]
[null,null,{"$f":"IF($B367=\"\",\"\",VLOOKUP($B367,Data!$A$4:$T$727,2,FALSE))","v":""},{"$f":"IF($B367=\"\",\"\",VLOOKUP($B367,Data!$A$4:$T$727,10,FALSE))","v":""},{"$f":"IF($B367=\"\",\"\",VLOOKUP($B367,Data!$A$4:$T$727,4,FALSE))","v":""},{"$f":"IF($B367=\"\",\"\",VLOOKUP($B367,Data!$A$4:$T$727,5,FALSE))","v":""},{"$f":"IF($B367=\"\",\"\",VLOOKUP($B367,Data!$A$4:$T$727,7,FALSE))","v":""},"","","","",{"$f":"IF($I$15=\"Show\",VLOOKUP($B367,Data!$A$4:$T$727,9,FALSE),VLOOKUP($B367,Data!$A$4:$T$727,7,FALSE))","v":{"$error":"#N/A"}},{"$f":"IF($B367=\"\",\"\",VLOOKUP($B367,Data!$A$4:$T$727,6,FALSE))","v":""},"",{"$f":"IF($B367=\"\",\"\",IF(VLOOKUP($B367,Data!$A$4:$T$727,11,FALSE)<1,\"\",VLOOKUP(B367,Data!$A$4:$T$727,11,FALSE)))","v":""}]
[null,null,{"$f":"IF($B368=\"\",\"\",VLOOKUP($B368,Data!$A$4:$T$727,2,FALSE))","v":""},{"$f":"IF($B368=\"\",\"\",VLOOKUP($B368,Data!$A$4:$T$727,10,FALSE))","v":""},{"$f":"IF($B368=\"\",\"\",VLOOKUP($B368,Data!$A$4:$T$727,4,FALSE))","v":""},{"$f":"IF($B368=\"\",\"\",VLOOKUP($B368,Data!$A$4:$T$727,5,FALSE))","v":""},{"$f":"IF($B368=\"\",\"\",VLOOKUP($B368,Data!$A$4:$T$727,7,FALSE))","v":""},"","","","",{"$f":"IF($I$15=\"Show\",VLOOKUP($B368,Data!$A$4:$T$727,9,FALSE),VLOOKUP($B368,Data!$A$4:$T$727,7,FALSE))","v":{"$error":"#N/A"}},{"$f":"IF($B368=\"\",\"\",VLOOKUP($B368,Data!$A$4:$T$727,6,FALSE))","v":""},"",{"$f":"IF($B368=\"\",\"\",IF(VLOOKUP($B368,Data!$A$4:$T$727,11,FALSE)<1,\"\",VLOOKUP(B368,Data!$A$4:$T$727,11,FALSE)))","v":""}]
[null,null,{"$f":"IF($B369=\"\",\"\",VLOOKUP($B369,Data!$A$4:$T$727,2,FALSE))","v":""},{"$f":"IF($B369=\"\",\"\",VLOOKUP($B369,Data!$A$4:$T$727,10,FALSE))","v":""},{"$f":"IF($B369=\"\",\"\",VLOOKUP($B369,Data!$A$4:$T$727,4,FALSE))","v":""},{"$f":"IF($B369=\"\",\"\",VLOOKUP($B369,Data!$A$4:$T$727,5,FALSE))","v":""},{"$f":"IF($B369=\"\",\"\",VLOOKUP($B369,Data!$A$4:$T$727,7,FALSE))","v":""},"","","","",{"$f":"IF($I$15=\"Show\",VLOOKUP($B369,Data!$A$4:$T$727,9,FALSE),VLOOKUP($B369,Data!$A$4:$T$727,7,FALSE))","v":{"$error":"#N/A"}},{"$f":"IF($B369=\"\",\"\",VLOOKUP($B369,Data!$A$4:$T$727,6,FALSE))","v":""},"",{"$f":"IF($B369=\"\",\"\",IF(VLOOKUP($B369,Data!$A$4:$T$727,11,FALSE)<1,\"\",VLOOKUP(B369,Data!$A$4:$T$727,11,FALSE)))","v":""}]
[null,null,{"$f":"IF($B370=\"\",\"\",VLOOKUP($B370,Data!$A$4:$T$727,2,FALSE))","v":""},{"$f":"IF($B370=\"\",\"\",VLOOKUP($B370,Data!$A$4:$T$727,10,FALSE))","v":""},{"$f":"IF($B370=\"\",\"\",VLOOKUP($B370,Data!$A$4:$T$727,4,FALSE))","v":""},{"$f":"IF($B370=\"\",\"\",VLOOKUP($B370,Data!$A$4:$T$727,5,FALSE))","v":""},{"$f":"IF($B370=\"\",\"\",VLOOKUP($B370,Data!$A$4:$T$727,7,FALSE))","v":""},"","","","",{"$f":"IF($I$15=\"Show\",VLOOKUP($B370,Data!$A$4:$T$727,9,FALSE),VLOOKUP($B370,Data!$A$4:$T$727,7,FALSE))","v":{"$error":"#N/A"}},{"$f":"IF($B370=\"\",\"\",VLOOKUP($B370,Data!$A$4:$T$727,6,FALSE))","v":""},"",{"$f":"IF($B370=\"\",\"\",IF(VLOOKUP($B370,Data!$A$4:$T$727,11,FALSE)<1,\"\",VLOOKUP(B370,Data!$A$4:$T$727,11,FALSE)))","v":""}]
[null,null,{"$f":"IF($B371=\"\",\"\",VLOOKUP($B371,Data!$A$4:$T$727,2,FALSE))","v":""},{"$f":"IF($B371=\"\",\"\",VLOOKUP($B371,Data!$A$4:$T$727,10,FALSE))","v":""},{"$f":"IF($B371=\"\",\"\",VLOOKUP($B371,Data!$A$4:$T$727,4,FALSE))","v":""},{"$f":"IF($B371=\"\",\"\",VLOOKUP($B371,Data!$A$4:$T$727,5,FALSE))","v":""},{"$f":"IF($B371=\"\",\"\",VLOOKUP($B371,Data!$A$4:$T$727,7,FALSE))","v":""},"","","","",{"$f":"IF($I$15=\"Show\",VLOOKUP($B371,Data!$A$4:$T$727,9,FALSE),VLOOKUP($B371,Data!$A$4:$T$727,7,FALSE))","v":{"$error":"#N/A"}},{"$f":"IF($B371=\"\",\"\",VLOOKUP($B371,Data!$A$4:$T$727,6,FALSE))","v":""},"",{"$f":"IF($B371=\"\",\"\",IF(VLOOKUP($B371,Data!$A$4:$T$727,11,FALSE)<1,\"\",VLOOKUP(B371,Data!$A$4:$T$727,11,FALSE)))","v":""}]
[null,null,{"$f":"IF($B372=\"\",\"\",VLOOKUP($B372,Data!$A$4:$T$727,2,FALSE))","v":""},{"$f":"IF($B372=\"\",\"\",VLOOKUP($B372,Data!$A$4:$T$727,10,FALSE))","v":""},{"$f":"IF($B372=\"\",\"\",VLOOKUP($B372,Data!$A$4:$T$727,4,FALSE))","v":""},{"$f":"IF($B372=\"\",\"\",VLOOKUP($B372,Data!$A$4:$T$727,5,FALSE))","v":""},{"$f":"IF($B372=\"\",\"\",VLOOKUP($B372,Data!$A$4:$T$727,7,FALSE))","v":""},"","","","",{"$f":"IF($I$15=\"Show\",VLOOKUP($B372,Data!$A$4:$T$727,9,FALSE),VLOOKUP($B372,Data!$A$4:$T$727,7,FALSE))","v":{"$error":"#N/A"}},{"$f":"IF($B372=\"\",\"\",VLOOKUP($B372,Data!$A$4:$T$727,6,FALSE))","v":""},"",{"$f":"IF($B372=\"\",\"\",IF(VLOOKUP($B372,Data!$A$4:$T$727,11,FALSE)<1,\"\",VLOOKUP(B372,Data!$A$4:$T$727,11,FALSE)))","v":""}]
[null,null,{"$f":"IF($B373=\"\",\"\",VLOOKUP($B373,Data!$A$4:$T$727,2,FALSE))","v":""},{"$f":"IF($B373=\"\",\"\",VLOOKUP($B373,Data!$A$4:$T$727,10,FALSE))","v":""},{"$f":"IF($B373=\"\",\"\",VLOOKUP($B373,Data!$A$4:$T$727,4,FALSE))","v":""},{"$f":"IF($B373=\"\",\"\",VLOOKUP($B373,Data!$A$4:$T$727,5,FALSE))","v":""},{"$f":"IF($B373=\"\",\"\",VLOOKUP($B373,Data!$A$4:$T$727,7,FALSE))","v":""},"","","","",{"$f":"IF($I$15=\"Show\",VLOOKUP($B373,Data!$A$4:$T$727,9,FALSE),VLOOKUP($B373,Data!$A$4:$T$727,7,FALSE))","v":{"$error":"#N/A"}},{"$f":"IF($B373=\"\",\"\",VLOOKUP($B373,Data!$A$4:$T$727,6,FALSE))","v":""},"",{"$f":"IF($B373=\"\",\"\",IF(VLOOKUP($B373,Data!$A$4:$T$727,11,FALSE)<1,\"\",VLOOKUP(B373,Data!$A$4:$T$727,11,FALSE)))","v":""}]
[null,null,{"$f":"IF($B374=\"\",\"\",VLOOKUP($B374,Data!$A$4:$T$727,2,FALSE))","v":""},{"$f":"IF($B374=\"\",\"\",VLOOKUP($B374,Data!$A$4:$T$727,10,FALSE))","v":""},{"$f":"IF($B374=\"\",\"\",VLOOKUP($B374,Data!$A$4:$T$727,4,FALSE))","v":""},{"$f":"IF($B374=\"\",\"\",VLOOKUP($B374,Data!$A$4:$T$727,5,FALSE))","v":""},{"$f":"IF($B374=\"\",\"\",VLOOKUP($B374,Data!$A$4:$T$727,7,FALSE))","v":""},"","","","",{"$f":"IF($I$15=\"Show\",VLOOKUP($B374,Data!$A$4:$T$727,9,FALSE),VLOOKUP($B374,Data!$A$4:$T$727,7,FALSE))","v":{"$error":"#N/A"}},{"$f":"IF($B374=\"\",\"\",VLOOKUP($B374,Data!$A$4:$T$727,6,FALSE))","v":""},"",{"$f":"IF($B374=\"\",\"\",IF(VLOOKUP($B374,Data!$A$4:$T$727,11,FALSE)<1,\"\",VLOOKUP(B374,Data!$A$4:$T$727,11,FALSE)))","v":""}]
[null,null,{"$f":"IF($B375=\"\",\"\",VLOOKUP($B375,Data!$A$4:$T$727,2,FALSE))","v":""},{"$f":"IF($B375=\"\",\"\",VLOOKUP($B375,Data!$A$4:$T$727,10,FALSE))","v":""},{"$f":"IF($B375=\"\",\"\",VLOOKUP($B375,Data!$A$4:$T$727,4,FALSE))","v":""},{"$f":"IF($B375=\"\",\"\",VLOOKUP($B375,Data!$A$4:$T$727,5,FALSE))","v":""},{"$f":"IF($B375=\"\",\"\",VLOOKUP($B375,Data!$A$4:$T$727,7,FALSE))","v":""},"","","","",{"$f":"IF($I$15=\"Show\",VLOOKUP($B375,Data!$A$4:$T$727,9,FALSE),VLOOKUP($B375,Data!$A$4:$T$727,7,FALSE))","v":{"$error":"#N/A"}},{"$f":"IF($B375=\"\",\"\",VLOOKUP($B375,Data!$A$4:$T$727,6,FALSE))","v":""},"",{"$f":"IF($B375=\"\",\"\",IF(VLOOKUP($B375,Data!$A$4:$T$727,11,FALSE)<1,\"\",VLOOKUP(B375,Data!$A$4:$T$727,11,FALSE)))","v":""}]
[null,null,{"$f":"IF($B376=\"\",\"\",VLOOKUP($B376,Data!$A$4:$T$727,2,FALSE))","v":""},{"$f":"IF($B376=\"\",\"\",VLOOKUP($B376,Data!$A$4:$T$727,10,FALSE))","v":""},{"$f":"IF($B376=\"\",\"\",VLOOKUP($B376,Data!$A$4:$T$727,4,FALSE))","v":""},{"$f":"IF($B376=\"\",\"\",VLOOKUP($B376,Data!$A$4:$T$727,5,FALSE))","v":""},{"$f":"IF($B376=\"\",\"\",VLOOKUP($B376,Data!$A$4:$T$727,7,FALSE))","v":""},"","","","",{"$f":"IF($I$15=\"Show\",VLOOKUP($B376,Data!$A$4:$T$727,9,FALSE),VLOOKUP($B376,Data!$A$4:$T$727,7,FALSE))","v":{"$error":"#N/A"}},{"$f":"IF($B376=\"\",\"\",VLOOKUP($B376,Data!$A$4:$T$727,6,FALSE))","v":""},"",{"$f":"IF($B376=\"\",\"\",IF(VLOOKUP($B376,Data!$A$4:$T$727,11,FALSE)<1,\"\",VLOOKUP(B376,Data!$A$4:$T$727,11,FALSE)))","v":""}]
[null,null,{"$f":"IF($B377=\"\",\"\",VLOOKUP($B377,Data!$A$4:$T$727,2,FALSE))","v":""},{"$f":"IF($B377=\"\",\"\",VLOOKUP($B377,Data!$A$4:$T$727,10,FALSE))","v":""},{"$f":"IF($B377=\"\",\"\",VLOOKUP($B377,Data!$A$4:$T$727,4,FALSE))","v":""},{"$f":"IF($B377=\"\",\"\",VLOOKUP($B377,Data!$A$4:$T$727,5,FALSE))","v":""},{"$f":"IF($B377=\"\",\"\",VLOOKUP($B377,Data!$A$4:$T$727,7,FALSE))","v":""},"","","","",{"$f":"IF($I$15=\"Show\",VLOOKUP($B377,Data!$A$4:$T$727,9,FALSE),VLOOKUP($B377,Data!$A$4:$T$727,7,FALSE))","v":{"$error":"#N/A"}},{"$f":"IF($B377=\"\",\"\",VLOOKUP($B377,Data!$A$4:$T$727,6,FALSE))","v":""},"",{"$f":"IF($B377=\"\",\"\",IF(VLOOKUP($B377,Data!$A$4:$T$727,11,FALSE)<1,\"\",VLOOKUP(B377,Data!$A$4:$T$727,11,FALSE)))","v":""}]
[null,null,{"$f":"IF($B378=\"\",\"\",VLOOKUP($B378,Data!$A$4:$T$727,2,FALSE))","v":""},{"$f":"IF($B378=\"\",\"\",VLOOKUP($B378,Data!$A$4:$T$727,10,FALSE))","v":""},{"$f":"IF($B378=\"\",\"\",VLOOKUP($B378,Data!$A$4:$T$727,4,FALSE))","v":""},{"$f":"IF($B378=\"\",\"\",VLOOKUP($B378,Data!$A$4:$T$727,5,FALSE))","v":""},{"$f":"IF($B378=\"\",\"\",VLOOKUP($B378,Data!$A$4:$T$727,7,FALSE))","v":""},"","","","",{"$f":"IF($I$15=\"Show\",VLOOKUP($B378,Data!$A$4:$T$727,9,FALSE),VLOOKUP($B378,Data!$A$4:$T$727,7,FALSE))","v":{"$error":"#N/A"}},{"$f":"IF($B378=\"\",\"\",VLOOKUP($B378,Data!$A$4:$T$727,6,FALSE))","v":""},"",{"$f":"IF($B378=\"\",\"\",IF(VLOOKUP($B378,Data!$A$4:$T$727,11,FALSE)<1,\"\",VLOOKUP(B378,Data!$A$4:$T$727,11,FALSE)))","v":""}]
[null,null,{"$f":"IF($B379=\"\",\"\",VLOOKUP($B379,Data!$A$4:$T$727,2,FALSE))","v":""},{"$f":"IF($B379=\"\",\"\",VLOOKUP($B379,Data!$A$4:$T$727,10,FALSE))","v":""},{"$f":"IF($B379=\"\",\"\",VLOOKUP($B379,Data!$A$4:$T$727,4,FALSE))","v":""},{"$f":"IF($B379=\"\",\"\",VLOOKUP($B379,Data!$A$4:$T$727,5,FALSE))","v":""},{"$f":"IF($B379=\"\",\"\",VLOOKUP($B379,Data!$A$4:$T$727,7,FALSE))","v":""},"","","","",{"$f":"IF($I$15=\"Show\",VLOOKUP($B379,Data!$A$4:$T$727,9,FALSE),VLOOKUP($B379,Data!$A$4:$T$727,7,FALSE))","v":{"$error":"#N/A"}},{"$f":"IF($B379=\"\",\"\",VLOOKUP($B379,Data!$A$4:$T$727,6,FALSE))","v":""},"",{"$f":"IF($B379=\"\",\"\",IF(VLOOKUP($B379,Data!$A$4:$T$727,11,FALSE)<1,\"\",VLOOKUP(B379,Data!$A$4:$T$727,11,FALSE)))","v":""}]
[null,null,{"$f":"IF($B380=\"\",\"\",VLOOKUP($B380,Data!$A$4:$T$727,2,FALSE))","v":""},{"$f":"IF($B380=\"\",\"\",VLOOKUP($B380,Data!$A$4:$T$727,10,FALSE))","v":""},{"$f":"IF($B380=\"\",\"\",VLOOKUP($B380,Data!$A$4:$T$727,4,FALSE))","v":""},{"$f":"IF($B380=\"\",\"\",VLOOKUP($B380,Data!$A$4:$T$727,5,FALSE))","v":""},{"$f":"IF($B380=\"\",\"\",VLOOKUP($B380,Data!$A$4:$T$727,7,FALSE))","v":""},"","","","",{"$f":"IF($I$15=\"Show\",VLOOKUP($B380,Data!$A$4:$T$727,9,FALSE),VLOOKUP($B380,Data!$A$4:$T$727,7,FALSE))","v":{"$error":"#N/A"}},{"$f":"IF($B380=\"\",\"\",VLOOKUP($B380,Data!$A$4:$T$727,6,FALSE))","v":""},"",{"$f":"IF($B380=\"\",\"\",IF(VLOOKUP($B380,Data!$A$4:$T$727,11,FALSE)<1,\"\",VLOOKUP(B380,Data!$A$4:$T$727,11,FALSE)))","v":""}]
[null,null,{"$f":"IF($B381=\"\",\"\",VLOOKUP($B381,Data!$A$4:$T$727,2,FALSE))","v":""},{"$f":"IF($B381=\"\",\"\",VLOOKUP($B381,Data!$A$4:$T$727,10,FALSE))","v":""},{"$f":"IF($B381=\"\",\"\",VLOOKUP($B381,Data!$A$4:$T$727,4,FALSE))","v":""},{"$f":"IF($B381=\"\",\"\",VLOOKUP($B381,Data!$A$4:$T$727,5,FALSE))","v":""},{"$f":"IF($B381=\"\",\"\",VLOOKUP($B381,Data!$A$4:$T$727,7,FALSE))","v":""},"","","","",{"$f":"IF($I$15=\"Show\",VLOOKUP($B381,Data!$A$4:$T$727,9,FALSE),VLOOKUP($B381,Data!$A$4:$T$727,7,FALSE))","v":{"$error":"#N/A"}},{"$f":"IF($B381=\"\",\"\",VLOOKUP($B381,Data!$A$4:$T$727,6,FALSE))","v":""},"",{"$f":"IF($B381=\"\",\"\",IF(VLOOKUP($B381,Data!$A$4:$T$727,11,FALSE)<1,\"\",VLOOKUP(B381,Data!$A$4:$T$727,11,FALSE)))","v":""}]
[null,null,{"$f":"IF($B382=\"\",\"\",VLOOKUP($B382,Data!$A$4:$T$727,2,FALSE))","v":""},{"$f":"IF($B382=\"\",\"\",VLOOKUP($B382,Data!$A$4:$T$727,10,FALSE))","v":""},{"$f":"IF($B382=\"\",\"\",VLOOKUP($B382,Data!$A$4:$T$727,4,FALSE))","v":""},{"$f":"IF($B382=\"\",\"\",VLOOKUP($B382,Data!$A$4:$T$727,5,FALSE))","v":""},{"$f":"IF($B382=\"\",\"\",VLOOKUP($B382,Data!$A$4:$T$727,7,FALSE))","v":""},"","","","",{"$f":"IF($I$15=\"Show\",VLOOKUP($B382,Data!$A$4:$T$727,9,FALSE),VLOOKUP($B382,Data!$A$4:$T$727,7,FALSE))","v":{"$error":"#N/A"}},{"$f":"IF($B382=\"\",\"\",VLOOKUP($B382,Data!$A$4:$T$727,6,FALSE))","v":""},"",{"$f":"IF($B382=\"\",\"\",IF(VLOOKUP($B382,Data!$A$4:$T$727,11,FALSE)<1,\"\",VLOOKUP(B382,Data!$A$4:$T$727,11,FALSE)))","v":""}]
[null,null,{"$f":"IF($B383=\"\",\"\",VLOOKUP($B383,Data!$A$4:$T$727,2,FALSE))","v":""},{"$f":"IF($B383=\"\",\"\",VLOOKUP($B383,Data!$A$4:$T$727,10,FALSE))","v":""},{"$f":"IF($B383=\"\",\"\",VLOOKUP($B383,Data!$A$4:$T$727,4,FALSE))","v":""},{"$f":"IF($B383=\"\",\"\",VLOOKUP($B383,Data!$A$4:$T$727,5,FALSE))","v":""},{"$f":"IF($B383=\"\",\"\",VLOOKUP($B383,Data!$A$4:$T$727,7,FALSE))","v":""},"","","","",{"$f":"IF($I$15=\"Show\",VLOOKUP($B383,Data!$A$4:$T$727,9,FALSE),VLOOKUP($B383,Data!$A$4:$T$727,7,FALSE))","v":{"$error":"#N/A"}},{"$f":"IF($B383=\"\",\"\",VLOOKUP($B383,Data!$A$4:$T$727,6,FALSE))","v":""},"",{"$f":"IF($B383=\"\",\"\",IF(VLOOKUP($B383,Data!$A$4:$T$727,11,FALSE)<1,\"\",VLOOKUP(B383,Data!$A$4:$T$727,11,FALSE)))","v":""}]
[null,null,{"$f":"IF($B384=\"\",\"\",VLOOKUP($B384,Data!$A$4:$T$727,2,FALSE))","v":""},{"$f":"IF($B384=\"\",\"\",VLOOKUP($B384,Data!$A$4:$T$727,10,FALSE))","v":""},{"$f":"IF($B384=\"\",\"\",VLOOKUP($B384,Data!$A$4:$T$727,4,FALSE))","v":""},{"$f":"IF($B384=\"\",\"\",VLOOKUP($B384,Data!$A$4:$T$727,5,FALSE))","v":""},{"$f":"IF($B384=\"\",\"\",VLOOKUP($B384,Data!$A$4:$T$727,7,FALSE))","v":""},"","","","",{"$f":"IF($I$15=\"Show\",VLOOKUP($B384,Data!$A$4:$T$727,9,FALSE),VLOOKUP($B384,Data!$A$4:$T$727,7,FALSE))","v":{"$error":"#N/A"}},{"$f":"IF($B384=\"\",\"\",VLOOKUP($B384,Data!$A$4:$T$727,6,FALSE))","v":""},"",{"$f":"IF($B384=\"\",\"\",IF(VLOOKUP($B384,Data!$A$4:$T$727,11,FALSE)<1,\"\",VLOOKUP(B384,Data!$A$4:$T$727,11,FALSE)))","v":""}]
[null,null,{"$f":"IF($B385=\"\",\"\",VLOOKUP($B385,Data!$A$4:$T$727,2,FALSE))","v":""},{"$f":"IF($B385=\"\",\"\",VLOOKUP($B385,Data!$A$4:$T$727,10,FALSE))","v":""},{"$f":"IF($B385=\"\",\"\",VLOOKUP($B385,Data!$A$4:$T$727,4,FALSE))","v":""},{"$f":"IF($B385=\"\",\"\",VLOOKUP($B385,Data!$A$4:$T$727,5,FALSE))","v":""},{"$f":"IF($B385=\"\",\"\",VLOOKUP($B385,Data!$A$4:$T$727,7,FALSE))","v":""},"","","","",{"$f":"IF($I$15=\"Show\",VLOOKUP($B385,Data!$A$4:$T$727,9,FALSE),VLOOKUP($B385,Data!$A$4:$T$727,7,FALSE))","v":{"$error":"#N/A"}},{"$f":"IF($B385=\"\",\"\",VLOOKUP($B385,Data!$A$4:$T$727,6,FALSE))","v":""},"",{"$f":"IF($B385=\"\",\"\",IF(VLOOKUP($B385,Data!$A$4:$T$727,11,FALSE)<1,\"\",VLOOKUP(B385,Data!$A$4:$T$727,11,FALSE)))","v":""}]
[null,null,{"$f":"IF($B386=\"\",\"\",VLOOKUP($B386,Data!$A$4:$T$727,2,FALSE))","v":""},{"$f":"IF($B386=\"\",\"\",VLOOKUP($B386,Data!$A$4:$T$727,10,FALSE))","v":""},{"$f":"IF($B386=\"\",\"\",VLOOKUP($B386,Data!$A$4:$T$727,4,FALSE))","v":""},{"$f":"IF($B386=\"\",\"\",VLOOKUP($B386,Data!$A$4:$T$727,5,FALSE))","v":""},{"$f":"IF($B386=\"\",\"\",VLOOKUP($B386,Data!$A$4:$T$727,7,FALSE))","v":""},"","","","",{"$f":"IF($I$15=\"Show\",VLOOKUP($B386,Data!$A$4:$T$727,9,FALSE),VLOOKUP($B386,Data!$A$4:$T$727,7,FALSE))","v":{"$error":"#N/A"}},{"$f":"IF($B386=\"\",\"\",VLOOKUP($B386,Data!$A$4:$T$727,6,FALSE))","v":""},"",{"$f":"IF($B386=\"\",\"\",IF(VLOOKUP($B386,Data!$A$4:$T$727,11,FALSE)<1,\"\",VLOOKUP(B386,Data!$A$4:$T$727,11,FALSE)))","v":""}]
[null,null,{"$f":"IF($B387=\"\",\"\",VLOOKUP($B387,Data!$A$4:$T$727,2,FALSE))","v":""},{"$f":"IF($B387=\"\",\"\",VLOOKUP($B387,Data!$A$4:$T$727,10,FALSE))","v":""},{"$f":"IF($B387=\"\",\"\",VLOOKUP($B387,Data!$A$4:$T$727,4,FALSE))","v":""},{"$f":"IF($B387=\"\",\"\",VLOOKUP($B387,Data!$A$4:$T$727,5,FALSE))","v":""},{"$f":"IF($B387=\"\",\"\",VLOOKUP($B387,Data!$A$4:$T$727,7,FALSE))","v":""},"","","","",{"$f":"IF($I$15=\"Show\",VLOOKUP($B387,Data!$A$4:$T$727,9,FALSE),VLOOKUP($B387,Data!$A$4:$T$727,7,FALSE))","v":{"$error":"#N/A"}},{"$f":"IF($B387=\"\",\"\",VLOOKUP($B387,Data!$A$4:$T$727,6,FALSE))","v":""},"",{"$f":"IF($B387=\"\",\"\",IF(VLOOKUP($B387,Data!$A$4:$T$727,11,FALSE)<1,\"\",VLOOKUP(B387,Data!$A$4:$T$727,11,FALSE)))","v":""}]
[null,null,{"$f":"IF($B388=\"\",\"\",VLOOKUP($B388,Data!$A$4:$T$727,2,FALSE))","v":""},{"$f":"IF($B388=\"\",\"\",VLOOKUP($B388,Data!$A$4:$T$727,10,FALSE))","v":""},{"$f":"IF($B388=\"\",\"\",VLOOKUP($B388,Data!$A$4:$T$727,4,FALSE))","v":""},{"$f":"IF($B388=\"\",\"\",VLOOKUP($B388,Data!$A$4:$T$727,5,FALSE))","v":""},{"$f":"IF($B388=\"\",\"\",VLOOKUP($B388,Data!$A$4:$T$727,7,FALSE))","v":""},"","","","",{"$f":"IF($I$15=\"Show\",VLOOKUP($B388,Data!$A$4:$T$727,9,FALSE),VLOOKUP($B388,Data!$A$4:$T$727,7,FALSE))","v":{"$error":"#N/A"}},{"$f":"IF($B388=\"\",\"\",VLOOKUP($B388,Data!$A$4:$T$727,6,FALSE))","v":""},"",{"$f":"IF($B388=\"\",\"\",IF(VLOOKUP($B388,Data!$A$4:$T$727,11,FALSE)<1,\"\",VLOOKUP(B388,Data!$A$4:$T$727,11,FALSE)))","v":""}]
[null,null,{"$f":"IF($B389=\"\",\"\",VLOOKUP($B389,Data!$A$4:$T$727,2,FALSE))","v":""},{"$f":"IF($B389=\"\",\"\",VLOOKUP($B389,Data!$A$4:$T$727,10,FALSE))","v":""},{"$f":"IF($B389=\"\",\"\",VLOOKUP($B389,Data!$A$4:$T$727,4,FALSE))","v":""},{"$f":"IF($B389=\"\",\"\",VLOOKUP($B389,Data!$A$4:$T$727,5,FALSE))","v":""},{"$f":"IF($B389=\"\",\"\",VLOOKUP($B389,Data!$A$4:$T$727,7,FALSE))","v":""},"","","","",{"$f":"IF($I$15=\"Show\",VLOOKUP($B389,Data!$A$4:$T$727,9,FALSE),VLOOKUP($B389,Data!$A$4:$T$727,7,FALSE))","v":{"$error":"#N/A"}},{"$f":"IF($B389=\"\",\"\",VLOOKUP($B389,Data!$A$4:$T$727,6,FALSE))","v":""},"",{"$f":"IF($B389=\"\",\"\",IF(VLOOKUP($B389,Data!$A$4:$T$727,11,FALSE)<1,\"\",VLOOKUP(B389,Data!$A$4:$T$727,11,FALSE)))","v":""}]
[null,null,{"$f":"IF($B390=\"\",\"\",VLOOKUP($B390,Data!$A$4:$T$727,2,FALSE))","v":""},{"$f":"IF($B390=\"\",\"\",VLOOKUP($B390,Data!$A$4:$T$727,10,FALSE))","v":""},{"$f":"IF($B390=\"\",\"\",VLOOKUP($B390,Data!$A$4:$T$727,4,FALSE))","v":""},{"$f":"IF($B390=\"\",\"\",VLOOKUP($B390,Data!$A$4:$T$727,5,FALSE))","v":""},{"$f":"IF($B390=\"\",\"\",VLOOKUP($B390,Data!$A$4:$T$727,7,FALSE))","v":""},"","","","",{"$f":"IF($I$15=\"Show\",VLOOKUP($B390,Data!$A$4:$T$727,9,FALSE),VLOOKUP($B390,Data!$A$4:$T$727,7,FALSE))","v":{"$error":"#N/A"}},{"$f":"IF($B390=\"\",\"\",VLOOKUP($B390,Data!$A$4:$T$727,6,FALSE))","v":""},"",{"$f":"IF($B390=\"\",\"\",IF(VLOOKUP($B390,Data!$A$4:$T$727,11,FALSE)<1,\"\",VLOOKUP(B390,Data!$A$4:$T$727,11,FALSE)))","v":""}]
[null,null,{"$f":"IF($B391=\"\",\"\",VLOOKUP($B391,Data!$A$4:$T$727,2,FALSE))","v":""},{"$f":"IF($B391=\"\",\"\",VLOOKUP($B391,Data!$A$4:$T$727,10,FALSE))","v":""},{"$f":"IF($B391=\"\",\"\",VLOOKUP($B391,Data!$A$4:$T$727,4,FALSE))","v":""},{"$f":"IF($B391=\"\",\"\",VLOOKUP($B391,Data!$A$4:$T$727,5,FALSE))","v":""},{"$f":"IF($B391=\"\",\"\",VLOOKUP($B391,Data!$A$4:$T$727,7,FALSE))","v":""},"","","","",{"$f":"IF($I$15=\"Show\",VLOOKUP($B391,Data!$A$4:$T$727,9,FALSE),VLOOKUP($B391,Data!$A$4:$T$727,7,FALSE))","v":{"$error":"#N/A"}},{"$f":"IF($B391=\"\",\"\",VLOOKUP($B391,Data!$A$4:$T$727,6,FALSE))","v":""},"",{"$f":"IF($B391=\"\",\"\",IF(VLOOKUP($B391,Data!$A$4:$T$727,11,FALSE)<1,\"\",VLOOKUP(B391,Data!$A$4:$T$727,11,FALSE)))","v":""}]
[null,null,{"$f":"IF($B392=\"\",\"\",VLOOKUP($B392,Data!$A$4:$T$727,2,FALSE))","v":""},{"$f":"IF($B392=\"\",\"\",VLOOKUP($B392,Data!$A$4:$T$727,10,FALSE))","v":""},{"$f":"IF($B392=\"\",\"\",VLOOKUP($B392,Data!$A$4:$T$727,4,FALSE))","v":""},{"$f":"IF($B392=\"\",\"\",VLOOKUP($B392,Data!$A$4:$T$727,5,FALSE))","v":""},{"$f":"IF($B392=\"\",\"\",VLOOKUP($B392,Data!$A$4:$T$727,7,FALSE))","v":""},"","","","",{"$f":"IF($I$15=\"Show\",VLOOKUP($B392,Data!$A$4:$T$727,9,FALSE),VLOOKUP($B392,Data!$A$4:$T$727,7,FALSE))","v":{"$error":"#N/A"}},{"$f":"IF($B392=\"\",\"\",VLOOKUP($B392,Data!$A$4:$T$727,6,FALSE))","v":""},"",{"$f":"IF($B392=\"\",\"\",IF(VLOOKUP($B392,Data!$A$4:$T$727,11,FALSE)<1,\"\",VLOOKUP(B392,Data!$A$4:$T$727,11,FALSE)))","v":""}]
[null,null,{"$f":"IF($B393=\"\",\"\",VLOOKUP($B393,Data!$A$4:$T$727,2,FALSE))","v":""},{"$f":"IF($B393=\"\",\"\",VLOOKUP($B393,Data!$A$4:$T$727,10,FALSE))","v":""},{"$f":"IF($B393=\"\",\"\",VLOOKUP($B393,Data!$A$4:$T$727,4,FALSE))","v":""},{"$f":"IF($B393=\"\",\"\",VLOOKUP($B393,Data!$A$4:$T$727,5,FALSE))","v":""},{"$f":"IF($B393=\"\",\"\",VLOOKUP($B393,Data!$A$4:$T$727,7,FALSE))","v":""},"","","","",{"$f":"IF($I$15=\"Show\",VLOOKUP($B393,Data!$A$4:$T$727,9,FALSE),VLOOKUP($B393,Data!$A$4:$T$727,7,FALSE))","v":{"$error":"#N/A"}},{"$f":"IF($B393=\"\",\"\",VLOOKUP($B393,Data!$A$4:$T$727,6,FALSE))","v":""},"",{"$f":"IF($B393=\"\",\"\",IF(VLOOKUP($B393,Data!$A$4:$T$727,11,FALSE)<1,\"\",VLOOKUP(B393,Data!$A$4:$T$727,11,FALSE)))","v":""}]
[null,null,{"$f":"IF($B394=\"\",\"\",VLOOKUP($B394,Data!$A$4:$T$727,2,FALSE))","v":""},{"$f":"IF($B394=\"\",\"\",VLOOKUP($B394,Data!$A$4:$T$727,10,FALSE))","v":""},{"$f":"IF($B394=\"\",\"\",VLOOKUP($B394,Data!$A$4:$T$727,4,FALSE))","v":""},{"$f":"IF($B394=\"\",\"\",VLOOKUP($B394,Data!$A$4:$T$727,5,FALSE))","v":""},{"$f":"IF($B394=\"\",\"\",VLOOKUP($B394,Data!$A$4:$T$727,7,FALSE))","v":""},"","","","",{"$f":"IF($I$15=\"Show\",VLOOKUP($B394,Data!$A$4:$T$727,9,FALSE),VLOOKUP($B394,Data!$A$4:$T$727,7,FALSE))","v":{"$error":"#N/A"}},{"$f":"IF($B394=\"\",\"\",VLOOKUP($B394,Data!$A$4:$T$727,6,FALSE))","v":""},"",{"$f":"IF($B394=\"\",\"\",IF(VLOOKUP($B394,Data!$A$4:$T$727,11,FALSE)<1,\"\",VLOOKUP(B394,Data!$A$4:$T$727,11,FALSE)))","v":""}]
[null,null,{"$f":"IF($B395=\"\",\"\",VLOOKUP($B395,Data!$A$4:$T$727,2,FALSE))","v":""},{"$f":"IF($B395=\"\",\"\",VLOOKUP($B395,Data!$A$4:$T$727,10,FALSE))","v":""},{"$f":"IF($B395=\"\",\"\",VLOOKUP($B395,Data!$A$4:$T$727,4,FALSE))","v":""},{"$f":"IF($B395=\"\",\"\",VLOOKUP($B395,Data!$A$4:$T$727,5,FALSE))","v":""},{"$f":"IF($B395=\"\",\"\",VLOOKUP($B395,Data!$A$4:$T$727,7,FALSE))","v":""},"","","","",{"$f":"IF($I$15=\"Show\",VLOOKUP($B395,Data!$A$4:$T$727,9,FALSE),VLOOKUP($B395,Data!$A$4:$T$727,7,FALSE))","v":{"$error":"#N/A"}},{"$f":"IF($B395=\"\",\"\",VLOOKUP($B395,Data!$A$4:$T$727,6,FALSE))","v":""},"",{"$f":"IF($B395=\"\",\"\",IF(VLOOKUP($B395,Data!$A$4:$T$727,11,FALSE)<1,\"\",VLOOKUP(B395,Data!$A$4:$T$727,11,FALSE)))","v":""}]
[null,null,{"$f":"IF($B396=\"\",\"\",VLOOKUP($B396,Data!$A$4:$T$727,2,FALSE))","v":""},{"$f":"IF($B396=\"\",\"\",VLOOKUP($B396,Data!$A$4:$T$727,10,FALSE))","v":""},{"$f":"IF($B396=\"\",\"\",VLOOKUP($B396,Data!$A$4:$T$727,4,FALSE))","v":""},{"$f":"IF($B396=\"\",\"\",VLOOKUP($B396,Data!$A$4:$T$727,5,FALSE))","v":""},{"$f":"IF($B396=\"\",\"\",VLOOKUP($B396,Data!$A$4:$T$727,7,FALSE))","v":""},"","","","",{"$f":"IF($I$15=\"Show\",VLOOKUP($B396,Data!$A$4:$T$727,9,FALSE),VLOOKUP($B396,Data!$A$4:$T$727,7,FALSE))","v":{"$error":"#N/A"}},{"$f":"IF($B396=\"\",\"\",VLOOKUP($B396,Data!$A$4:$T$727,6,FALSE))","v":""},"",{"$f":"IF($B396=\"\",\"\",IF(VLOOKUP($B396,Data!$A$4:$T$727,11,FALSE)<1,\"\",VLOOKUP(B396,Data!$A$4:$T$727,11,FALSE)))","v":""}]
[null,null,{"$f":"IF($B397=\"\",\"\",VLOOKUP($B397,Data!$A$4:$T$727,2,FALSE))","v":""},{"$f":"IF($B397=\"\",\"\",VLOOKUP($B397,Data!$A$4:$T$727,10,FALSE))","v":""},{"$f":"IF($B397=\"\",\"\",VLOOKUP($B397,Data!$A$4:$T$727,4,FALSE))","v":""},{"$f":"IF($B397=\"\",\"\",VLOOKUP($B397,Data!$A$4:$T$727,5,FALSE))","v":""},{"$f":"IF($B397=\"\",\"\",VLOOKUP($B397,Data!$A$4:$T$727,7,FALSE))","v":""},"","","","",{"$f":"IF($I$15=\"Show\",VLOOKUP($B397,Data!$A$4:$T$727,9,FALSE),VLOOKUP($B397,Data!$A$4:$T$727,7,FALSE))","v":{"$error":"#N/A"}},{"$f":"IF($B397=\"\",\"\",VLOOKUP($B397,Data!$A$4:$T$727,6,FALSE))","v":""},"",{"$f":"IF($B397=\"\",\"\",IF(VLOOKUP($B397,Data!$A$4:$T$727,11,FALSE)<1,\"\",VLOOKUP(B397,Data!$A$4:$T$727,11,FALSE)))","v":""}]
[null,null,{"$f":"IF($B398=\"\",\"\",VLOOKUP($B398,Data!$A$4:$T$727,2,FALSE))","v":""},{"$f":"IF($B398=\"\",\"\",VLOOKUP($B398,Data!$A$4:$T$727,10,FALSE))","v":""},{"$f":"IF($B398=\"\",\"\",VLOOKUP($B398,Data!$A$4:$T$727,4,FALSE))","v":""},{"$f":"IF($B398=\"\",\"\",VLOOKUP($B398,Data!$A$4:$T$727,5,FALSE))","v":""},{"$f":"IF($B398=\"\",\"\",VLOOKUP($B398,Data!$A$4:$T$727,7,FALSE))","v":""},"","","","",{"$f":"IF($I$15=\"Show\",VLOOKUP($B398,Data!$A$4:$T$727,9,FALSE),VLOOKUP($B398,Data!$A$4:$T$727,7,FALSE))","v":{"$error":"#N/A"}},{"$f":"IF($B398=\"\",\"\",VLOOKUP($B398,Data!$A$4:$T$727,6,FALSE))","v":""},"",{"$f":"IF($B398=\"\",\"\",IF(VLOOKUP($B398,Data!$A$4:$T$727,11,FALSE)<1,\"\",VLOOKUP(B398,Data!$A$4:$T$727,11,FALSE)))","v":""}]
[null,null,{"$f":"IF($B399=\"\",\"\",VLOOKUP($B399,Data!$A$4:$T$727,2,FALSE))","v":""},{"$f":"IF($B399=\"\",\"\",VLOOKUP($B399,Data!$A$4:$T$727,10,FALSE))","v":""},{"$f":"IF($B399=\"\",\"\",VLOOKUP($B399,Data!$A$4:$T$727,4,FALSE))","v":""},{"$f":"IF($B399=\"\",\"\",VLOOKUP($B399,Data!$A$4:$T$727,5,FALSE))","v":""},{"$f":"IF($B399=\"\",\"\",VLOOKUP($B399,Data!$A$4:$T$727,7,FALSE))","v":""},"","","","",{"$f":"IF($I$15=\"Show\",VLOOKUP($B399,Data!$A$4:$T$727,9,FALSE),VLOOKUP($B399,Data!$A$4:$T$727,7,FALSE))","v":{"$error":"#N/A"}},{"$f":"IF($B399=\"\",\"\",VLOOKUP($B399,Data!$A$4:$T$727,6,FALSE))","v":""},"",{"$f":"IF($B399=\"\",\"\",IF(VLOOKUP($B399,Data!$A$4:$T$727,11,FALSE)<1,\"\",VLOOKUP(B399,Data!$A$4:$T$727,11,FALSE)))","v":""}]
[null,null,{"$f":"IF($B400=\"\",\"\",VLOOKUP($B400,Data!$A$4:$T$727,2,FALSE))","v":""},{"$f":"IF($B400=\"\",\"\",VLOOKUP($B400,Data!$A$4:$T$727,10,FALSE))","v":""},{"$f":"IF($B400=\"\",\"\",VLOOKUP($B400,Data!$A$4:$T$727,4,FALSE))","v":""},{"$f":"IF($B400=\"\",\"\",VLOOKUP($B400,Data!$A$4:$T$727,5,FALSE))","v":""},{"$f":"IF($B400=\"\",\"\",VLOOKUP($B400,Data!$A$4:$T$727,7,FALSE))","v":""},"","","","",{"$f":"IF($I$15=\"Show\",VLOOKUP($B400,Data!$A$4:$T$727,9,FALSE),VLOOKUP($B400,Data!$A$4:$T$727,7,FALSE))","v":{"$error":"#N/A"}},{"$f":"IF($B400=\"\",\"\",VLOOKUP($B400,Data!$A$4:$T$727,6,FALSE))","v":""},"",{"$f":"IF($B400=\"\",\"\",IF(VLOOKUP($B400,Data!$A$4:$T$727,11,FALSE)<1,\"\",VLOOKUP(B400,Data!$A$4:$T$727,11,FALSE)))","v":""}]
[null,null,{"$f":"IF($B401=\"\",\"\",VLOOKUP($B401,Data!$A$4:$T$727,2,FALSE))","v":""},{"$f":"IF($B401=\"\",\"\",VLOOKUP($B401,Data!$A$4:$T$727,10,FALSE))","v":""},{"$f":"IF($B401=\"\",\"\",VLOOKUP($B401,Data!$A$4:$T$727,4,FALSE))","v":""},{"$f":"IF($B401=\"\",\"\",VLOOKUP($B401,Data!$A$4:$T$727,5,FALSE))","v":""},{"$f":"IF($B401=\"\",\"\",VLOOKUP($B401,Data!$A$4:$T$727,7,FALSE))","v":""},"","","","",{"$f":"IF($I$15=\"Show\",VLOOKUP($B401,Data!$A$4:$T$727,9,FALSE),VLOOKUP($B401,Data!$A$4:$T$727,7,FALSE))","v":{"$error":"#N/A"}},{"$f":"IF($B401=\"\",\"\",VLOOKUP($B401,Data!$A$4:$T$727,6,FALSE))","v":""},"",{"$f":"IF($B401=\"\",\"\",IF(VLOOKUP($B401,Data!$A$4:$T$727,11,FALSE)<1,\"\",VLOOKUP(B401,Data!$A$4:$T$727,11,FALSE)))","v":""}]
[null,null,{"$f":"IF($B402=\"\",\"\",VLOOKUP($B402,Data!$A$4:$T$727,2,FALSE))","v":""},{"$f":"IF($B402=\"\",\"\",VLOOKUP($B402,Data!$A$4:$T$727,10,FALSE))","v":""},{"$f":"IF($B402=\"\",\"\",VLOOKUP($B402,Data!$A$4:$T$727,4,FALSE))","v":""},{"$f":"IF($B402=\"\",\"\",VLOOKUP($B402,Data!$A$4:$T$727,5,FALSE))","v":""},{"$f":"IF($B402=\"\",\"\",VLOOKUP($B402,Data!$A$4:$T$727,7,FALSE))","v":""},"","","","",{"$f":"IF($I$15=\"Show\",VLOOKUP($B402,Data!$A$4:$T$727,9,FALSE),VLOOKUP($B402,Data!$A$4:$T$727,7,FALSE))","v":{"$error":"#N/A"}},{"$f":"IF($B402=\"\",\"\",VLOOKUP($B402,Data!$A$4:$T$727,6,FALSE))","v":""},"",{"$f":"IF($B402=\"\",\"\",IF(VLOOKUP($B402,Data!$A$4:$T$727,11,FALSE)<1,\"\",VLOOKUP(B402,Data!$A$4:$T$727,11,FALSE)))","v":""}]
[null,null,{"$f":"IF($B403=\"\",\"\",VLOOKUP($B403,Data!$A$4:$T$727,2,FALSE))","v":""},{"$f":"IF($B403=\"\",\"\",VLOOKUP($B403,Data!$A$4:$T$727,10,FALSE))","v":""},{"$f":"IF($B403=\"\",\"\",VLOOKUP($B403,Data!$A$4:$T$727,4,FALSE))","v":""},{"$f":"IF($B403=\"\",\"\",VLOOKUP($B403,Data!$A$4:$T$727,5,FALSE))","v":""},{"$f":"IF($B403=\"\",\"\",VLOOKUP($B403,Data!$A$4:$T$727,7,FALSE))","v":""},"","","","",{"$f":"IF($I$15=\"Show\",VLOOKUP($B403,Data!$A$4:$T$727,9,FALSE),VLOOKUP($B403,Data!$A$4:$T$727,7,FALSE))","v":{"$error":"#N/A"}},{"$f":"IF($B403=\"\",\"\",VLOOKUP($B403,Data!$A$4:$T$727,6,FALSE))","v":""},"",{"$f":"IF($B403=\"\",\"\",IF(VLOOKUP($B403,Data!$A$4:$T$727,11,FALSE)<1,\"\",VLOOKUP(B403,Data!$A$4:$T$727,11,FALSE)))","v":""}]
[null,null,{"$f":"IF($B404=\"\",\"\",VLOOKUP($B404,Data!$A$4:$T$727,2,FALSE))","v":""},{"$f":"IF($B404=\"\",\"\",VLOOKUP($B404,Data!$A$4:$T$727,10,FALSE))","v":""},{"$f":"IF($B404=\"\",\"\",VLOOKUP($B404,Data!$A$4:$T$727,4,FALSE))","v":""},{"$f":"IF($B404=\"\",\"\",VLOOKUP($B404,Data!$A$4:$T$727,5,FALSE))","v":""},{"$f":"IF($B404=\"\",\"\",VLOOKUP($B404,Data!$A$4:$T$727,7,FALSE))","v":""},"","","","",{"$f":"IF($I$15=\"Show\",VLOOKUP($B404,Data!$A$4:$T$727,9,FALSE),VLOOKUP($B404,Data!$A$4:$T$727,7,FALSE))","v":{"$error":"#N/A"}},{"$f":"IF($B404=\"\",\"\",VLOOKUP($B404,Data!$A$4:$T$727,6,FALSE))","v":""},"",{"$f":"IF($B404=\"\",\"\",IF(VLOOKUP($B404,Data!$A$4:$T$727,11,FALSE)<1,\"\",VLOOKUP(B404,Data!$A$4:$T$727,11,FALSE)))","v":""}]
[null,null,{"$f":"IF($B405=\"\",\"\",VLOOKUP($B405,Data!$A$4:$T$727,2,FALSE))","v":""},{"$f":"IF($B405=\"\",\"\",VLOOKUP($B405,Data!$A$4:$T$727,10,FALSE))","v":""},{"$f":"IF($B405=\"\",\"\",VLOOKUP($B405,Data!$A$4:$T$727,4,FALSE))","v":""},{"$f":"IF($B405=\"\",\"\",VLOOKUP($B405,Data!$A$4:$T$727,5,FALSE))","v":""},{"$f":"IF($B405=\"\",\"\",VLOOKUP($B405,Data!$A$4:$T$727,7,FALSE))","v":""},"","","","",{"$f":"IF($I$15=\"Show\",VLOOKUP($B405,Data!$A$4:$T$727,9,FALSE),VLOOKUP($B405,Data!$A$4:$T$727,7,FALSE))","v":{"$error":"#N/A"}},{"$f":"IF($B405=\"\",\"\",VLOOKUP($B405,Data!$A$4:$T$727,6,FALSE))","v":""},"",{"$f":"IF($B405=\"\",\"\",IF(VLOOKUP($B405,Data!$A$4:$T$727,11,FALSE)<1,\"\",VLOOKUP(B405,Data!$A$4:$T$727,11,FALSE)))","v":""}]
[null,null,{"$f":"IF($B406=\"\",\"\",VLOOKUP($B406,Data!$A$4:$T$727,2,FALSE))","v":""},{"$f":"IF($B406=\"\",\"\",VLOOKUP($B406,Data!$A$4:$T$727,10,FALSE))","v":""},{"$f":"IF($B406=\"\",\"\",VLOOKUP($B406,Data!$A$4:$T$727,4,FALSE))","v":""},{"$f":"IF($B406=\"\",\"\",VLOOKUP($B406,Data!$A$4:$T$727,5,FALSE))","v":""},{"$f":"IF($B406=\"\",\"\",VLOOKUP($B406,Data!$A$4:$T$727,7,FALSE))","v":""},{"$f":"IF($B406=\"\",\"\",IF($K$15=\"\",\"\",ROUND($G406*(1-($K$15*0.01)),2)))","v":""},{"$f":"IF($B406=\"\",\"\",IF($G406=$L406,\"\",L406))","v":""},{"$f":"IF($B406=\"\",\"\",IF($H406<$L406,$H406,$L406))","v":""},{"$f":"IF(A406=\"\",\"\",J406*A406)","v":""},{"$f":"IF($I$15=\"Show\",VLOOKUP($B406,Data!$A$4:$T$727,9,FALSE),VLOOKUP($B406,Data!$A$4:$T$727,7,FALSE))","v":{"$error":"#N/A"}},{"$f":"IF($B406=\"\",\"\",VLOOKUP($B406,Data!$A$4:$T$727,6,FALSE))","v":""},{"$f":"IF($A406=\"\",\"\",$A406/$M406)","v":""},{"$f":"IF($B406=\"\",\"\",IF(VLOOKUP($B406,Data!$A$4:$T$727,11,FALSE)<1,\"\",VLOOKUP(B406,Data!$A$4:$T$727,11,FALSE)))","v":""}]
[null,null,{"$f":"IF($B407=\"\",\"\",VLOOKUP($B407,Data!$A$4:$T$727,2,FALSE))","v":""},{"$f":"IF($B407=\"\",\"\",VLOOKUP($B407,Data!$A$4:$T$727,10,FALSE))","v":""},{"$f":"IF($B407=\"\",\"\",VLOOKUP($B407,Data!$A$4:$T$727,4,FALSE))","v":""},{"$f":"IF($B407=\"\",\"\",VLOOKUP($B407,Data!$A$4:$T$727,5,FALSE))","v":""},{"$f":"IF($B407=\"\",\"\",VLOOKUP($B407,Data!$A$4:$T$727,7,FALSE))","v":""},"","","","",{"$f":"IF($I$15=\"Show\",VLOOKUP($B407,Data!$A$4:$T$727,9,FALSE),VLOOKUP($B407,Data!$A$4:$T$727,7,FALSE))","v":{"$error":"#N/A"}},{"$f":"IF($B407=\"\",\"\",VLOOKUP($B407,Data!$A$4:$T$727,6,FALSE))","v":""},"",{"$f":"IF($B407=\"\",\"\",IF(VLOOKUP($B407,Data!$A$4:$T$727,11,FALSE)<1,\"\",VLOOKUP(B407,Data!$A$4:$T$727,11,FALSE)))","v":""}]
[null,null,{"$f":"IF($B408=\"\",\"\",VLOOKUP($B408,Data!$A$4:$T$727,2,FALSE))","v":""},{"$f":"IF($B408=\"\",\"\",VLOOKUP($B408,Data!$A$4:$T$727,10,FALSE))","v":""},{"$f":"IF($B408=\"\",\"\",VLOOKUP($B408,Data!$A$4:$T$727,4,FALSE))","v":""},{"$f":"IF($B408=\"\",\"\",VLOOKUP($B408,Data!$A$4:$T$727,5,FALSE))","v":""},{"$f":"IF($B408=\"\",\"\",VLOOKUP($B408,Data!$A$4:$T$727,7,FALSE))","v":""},"","","","",{"$f":"IF($I$15=\"Show\",VLOOKUP($B408,Data!$A$4:$T$727,9,FALSE),VLOOKUP($B408,Data!$A$4:$T$727,7,FALSE))","v":{"$error":"#N/A"}},{"$f":"IF($B408=\"\",\"\",VLOOKUP($B408,Data!$A$4:$T$727,6,FALSE))","v":""},"",{"$f":"IF($B408=\"\",\"\",IF(VLOOKUP($B408,Data!$A$4:$T$727,11,FALSE)<1,\"\",VLOOKUP(B408,Data!$A$4:$T$727,11,FALSE)))","v":""}]
[null,null,{"$f":"IF($B409=\"\",\"\",VLOOKUP($B409,Data!$A$4:$T$727,2,FALSE))","v":""},{"$f":"IF($B409=\"\",\"\",VLOOKUP($B409,Data!$A$4:$T$727,10,FALSE))","v":""},{"$f":"IF($B409=\"\",\"\",VLOOKUP($B409,Data!$A$4:$T$727,4,FALSE))","v":""},{"$f":"IF($B409=\"\",\"\",VLOOKUP($B409,Data!$A$4:$T$727,5,FALSE))","v":""},{"$f":"IF($B409=\"\",\"\",VLOOKUP($B409,Data!$A$4:$T$727,7,FALSE))","v":""},"","","","",{"$f":"IF($I$15=\"Show\",VLOOKUP($B409,Data!$A$4:$T$727,9,FALSE),VLOOKUP($B409,Data!$A$4:$T$727,7,FALSE))","v":{"$error":"#N/A"}},{"$f":"IF($B409=\"\",\"\",VLOOKUP($B409,Data!$A$4:$T$727,6,FALSE))","v":""},"",{"$f":"IF($B409=\"\",\"\",IF(VLOOKUP($B409,Data!$A$4:$T$727,11,FALSE)<1,\"\",VLOOKUP(B409,Data!$A$4:$T$727,11,FALSE)))","v":""}]
[null,null,{"$f":"IF($B410=\"\",\"\",VLOOKUP($B410,Data!$A$4:$T$727,2,FALSE))","v":""},{"$f":"IF($B410=\"\",\"\",VLOOKUP($B410,Data!$A$4:$T$727,10,FALSE))","v":""},{"$f":"IF($B410=\"\",\"\",VLOOKUP($B410,Data!$A$4:$T$727,4,FALSE))","v":""},{"$f":"IF($B410=\"\",\"\",VLOOKUP($B410,Data!$A$4:$T$727,5,FALSE))","v":""},{"$f":"IF($B410=\"\",\"\",VLOOKUP($B410,Data!$A$4:$T$727,7,FALSE))","v":""},"","","","",{"$f":"IF($I$15=\"Show\",VLOOKUP($B410,Data!$A$4:$T$727,9,FALSE),VLOOKUP($B410,Data!$A$4:$T$727,7,FALSE))","v":{"$error":"#N/A"}},{"$f":"IF($B410=\"\",\"\",VLOOKUP($B410,Data!$A$4:$T$727,6,FALSE))","v":""},"",{"$f":"IF($B410=\"\",\"\",IF(VLOOKUP($B410,Data!$A$4:$T$727,11,FALSE)<1,\"\",VLOOKUP(B410,Data!$A$4:$T$727,11,FALSE)))","v":""}]
[null,null,{"$f":"IF($B411=\"\",\"\",VLOOKUP($B411,Data!$A$4:$T$727,2,FALSE))","v":""},{"$f":"IF($B411=\"\",\"\",VLOOKUP($B411,Data!$A$4:$T$727,10,FALSE))","v":""},{"$f":"IF($B411=\"\",\"\",VLOOKUP($B411,Data!$A$4:$T$727,4,FALSE))","v":""},{"$f":"IF($B411=\"\",\"\",VLOOKUP($B411,Data!$A$4:$T$727,5,FALSE))","v":""},{"$f":"IF($B411=\"\",\"\",VLOOKUP($B411,Data!$A$4:$T$727,7,FALSE))","v":""},"","","","",{"$f":"IF($I$15=\"Show\",VLOOKUP($B411,Data!$A$4:$T$727,9,FALSE),VLOOKUP($B411,Data!$A$4:$T$727,7,FALSE))","v":{"$error":"#N/A"}},{"$f":"IF($B411=\"\",\"\",VLOOKUP($B411,Data!$A$4:$T$727,6,FALSE))","v":""},"",{"$f":"IF($B411=\"\",\"\",IF(VLOOKUP($B411,Data!$A$4:$T$727,11,FALSE)<1,\"\",VLOOKUP(B411,Data!$A$4:$T$727,11,FALSE)))","v":""}]
[null,null,{"$f":"IF($B412=\"\",\"\",VLOOKUP($B412,Data!$A$4:$T$727,2,FALSE))","v":""},{"$f":"IF($B412=\"\",\"\",VLOOKUP($B412,Data!$A$4:$T$727,10,FALSE))","v":""},{"$f":"IF($B412=\"\",\"\",VLOOKUP($B412,Data!$A$4:$T$727,4,FALSE))","v":""},{"$f":"IF($B412=\"\",\"\",VLOOKUP($B412,Data!$A$4:$T$727,5,FALSE))","v":""},{"$f":"IF($B412=\"\",\"\",VLOOKUP($B412,Data!$A$4:$T$727,7,FALSE))","v":""},"","","","",{"$f":"IF($I$15=\"Show\",VLOOKUP($B412,Data!$A$4:$T$727,9,FALSE),VLOOKUP($B412,Data!$A$4:$T$727,7,FALSE))","v":{"$error":"#N/A"}},{"$f":"IF($B412=\"\",\"\",VLOOKUP($B412,Data!$A$4:$T$727,6,FALSE))","v":""},"",{"$f":"IF($B412=\"\",\"\",IF(VLOOKUP($B412,Data!$A$4:$T$727,11,FALSE)<1,\"\",VLOOKUP(B412,Data!$A$4:$T$727,11,FALSE)))","v":""}]
[null,null,{"$f":"IF($B413=\"\",\"\",VLOOKUP($B413,Data!$A$4:$T$727,2,FALSE))","v":""},{"$f":"IF($B413=\"\",\"\",VLOOKUP($B413,Data!$A$4:$T$727,10,FALSE))","v":""},{"$f":"IF($B413=\"\",\"\",VLOOKUP($B413,Data!$A$4:$T$727,4,FALSE))","v":""},{"$f":"IF($B413=\"\",\"\",VLOOKUP($B413,Data!$A$4:$T$727,5,FALSE))","v":""},{"$f":"IF($B413=\"\",\"\",VLOOKUP($B413,Data!$A$4:$T$727,7,FALSE))","v":""},"","","","",{"$f":"IF($I$15=\"Show\",VLOOKUP($B413,Data!$A$4:$T$727,9,FALSE),VLOOKUP($B413,Data!$A$4:$T$727,7,FALSE))","v":{"$error":"#N/A"}},{"$f":"IF($B413=\"\",\"\",VLOOKUP($B413,Data!$A$4:$T$727,6,FALSE))","v":""},"",{"$f":"IF($B413=\"\",\"\",IF(VLOOKUP($B413,Data!$A$4:$T$727,11,FALSE)<1,\"\",VLOOKUP(B413,Data!$A$4:$T$727,11,FALSE)))","v":""}]
[null,null,{"$f":"IF($B414=\"\",\"\",VLOOKUP($B414,Data!$A$4:$T$727,2,FALSE))","v":""},{"$f":"IF($B414=\"\",\"\",VLOOKUP($B414,Data!$A$4:$T$727,10,FALSE))","v":""},{"$f":"IF($B414=\"\",\"\",VLOOKUP($B414,Data!$A$4:$T$727,4,FALSE))","v":""},{"$f":"IF($B414=\"\",\"\",VLOOKUP($B414,Data!$A$4:$T$727,5,FALSE))","v":""},{"$f":"IF($B414=\"\",\"\",VLOOKUP($B414,Data!$A$4:$T$727,7,FALSE))","v":""},"","","","",{"$f":"IF($I$15=\"Show\",VLOOKUP($B414,Data!$A$4:$T$727,9,FALSE),VLOOKUP($B414,Data!$A$4:$T$727,7,FALSE))","v":{"$error":"#N/A"}},{"$f":"IF($B414=\"\",\"\",VLOOKUP($B414,Data!$A$4:$T$727,6,FALSE))","v":""},"",{"$f":"IF($B414=\"\",\"\",IF(VLOOKUP($B414,Data!$A$4:$T$727,11,FALSE)<1,\"\",VLOOKUP(B414,Data!$A$4:$T$727,11,FALSE)))","v":""}]
[null,null,{"$f":"IF($B415=\"\",\"\",VLOOKUP($B415,Data!$A$4:$T$727,2,FALSE))","v":""},{"$f":"IF($B415=\"\",\"\",VLOOKUP($B415,Data!$A$4:$T$727,10,FALSE))","v":""},{"$f":"IF($B415=\"\",\"\",VLOOKUP($B415,Data!$A$4:$T$727,4,FALSE))","v":""},{"$f":"IF($B415=\"\",\"\",VLOOKUP($B415,Data!$A$4:$T$727,5,FALSE))","v":""},{"$f":"IF($B415=\"\",\"\",VLOOKUP($B415,Data!$A$4:$T$727,7,FALSE))","v":""},"","","","",{"$f":"IF($I$15=\"Show\",VLOOKUP($B415,Data!$A$4:$T$727,9,FALSE),VLOOKUP($B415,Data!$A$4:$T$727,7,FALSE))","v":{"$error":"#N/A"}},{"$f":"IF($B415=\"\",\"\",VLOOKUP($B415,Data!$A$4:$T$727,6,FALSE))","v":""},"",{"$f":"IF($B415=\"\",\"\",IF(VLOOKUP($B415,Data!$A$4:$T$727,11,FALSE)<1,\"\",VLOOKUP(B415,Data!$A$4:$T$727,11,FALSE)))","v":""}]
[null,null,{"$f":"IF($B416=\"\",\"\",VLOOKUP($B416,Data!$A$4:$T$727,2,FALSE))","v":""},{"$f":"IF($B416=\"\",\"\",VLOOKUP($B416,Data!$A$4:$T$727,10,FALSE))","v":""},{"$f":"IF($B416=\"\",\"\",VLOOKUP($B416,Data!$A$4:$T$727,4,FALSE))","v":""},{"$f":"IF($B416=\"\",\"\",VLOOKUP($B416,Data!$A$4:$T$727,5,FALSE))","v":""},{"$f":"IF($B416=\"\",\"\",VLOOKUP($B416,Data!$A$4:$T$727,7,FALSE))","v":""},"","","","",{"$f":"IF($I$15=\"Show\",VLOOKUP($B416,Data!$A$4:$T$727,9,FALSE),VLOOKUP($B416,Data!$A$4:$T$727,7,FALSE))","v":{"$error":"#N/A"}},{"$f":"IF($B416=\"\",\"\",VLOOKUP($B416,Data!$A$4:$T$727,6,FALSE))","v":""},"",{"$f":"IF($B416=\"\",\"\",IF(VLOOKUP($B416,Data!$A$4:$T$727,11,FALSE)<1,\"\",VLOOKUP(B416,Data!$A$4:$T$727,11,FALSE)))","v":""}]
[null,null,{"$f":"IF($B417=\"\",\"\",VLOOKUP($B417,Data!$A$4:$T$727,2,FALSE))","v":""},{"$f":"IF($B417=\"\",\"\",VLOOKUP($B417,Data!$A$4:$T$727,10,FALSE))","v":""},{"$f":"IF($B417=\"\",\"\",VLOOKUP($B417,Data!$A$4:$T$727,4,FALSE))","v":""},{"$f":"IF($B417=\"\",\"\",VLOOKUP($B417,Data!$A$4:$T$727,5,FALSE))","v":""},{"$f":"IF($B417=\"\",\"\",VLOOKUP($B417,Data!$A$4:$T$727,7,FALSE))","v":""},"","","","",{"$f":"IF($I$15=\"Show\",VLOOKUP($B417,Data!$A$4:$T$727,9,FALSE),VLOOKUP($B417,Data!$A$4:$T$727,7,FALSE))","v":{"$error":"#N/A"}},{"$f":"IF($B417=\"\",\"\",VLOOKUP($B417,Data!$A$4:$T$727,6,FALSE))","v":""},"",{"$f":"IF($B417=\"\",\"\",IF(VLOOKUP($B417,Data!$A$4:$T$727,11,FALSE)<1,\"\",VLOOKUP(B417,Data!$A$4:$T$727,11,FALSE)))","v":""}]
[null,null,{"$f":"IF($B418=\"\",\"\",VLOOKUP($B418,Data!$A$4:$T$727,2,FALSE))","v":""},{"$f":"IF($B418=\"\",\"\",VLOOKUP($B418,Data!$A$4:$T$727,10,FALSE))","v":""},{"$f":"IF($B418=\"\",\"\",VLOOKUP($B418,Data!$A$4:$T$727,4,FALSE))","v":""},{"$f":"IF($B418=\"\",\"\",VLOOKUP($B418,Data!$A$4:$T$727,5,FALSE))","v":""},{"$f":"IF($B418=\"\",\"\",VLOOKUP($B418,Data!$A$4:$T$727,7,FALSE))","v":""},"","","","",{"$f":"IF($I$15=\"Show\",VLOOKUP($B418,Data!$A$4:$T$727,9,FALSE),VLOOKUP($B418,Data!$A$4:$T$727,7,FALSE))","v":{"$error":"#N/A"}},{"$f":"IF($B418=\"\",\"\",VLOOKUP($B418,Data!$A$4:$T$727,6,FALSE))","v":""},"",{"$f":"IF($B418=\"\",\"\",IF(VLOOKUP($B418,Data!$A$4:$T$727,11,FALSE)<1,\"\",VLOOKUP(B418,Data!$A$4:$T$727,11,FALSE)))","v":""}]
[null,null,{"$f":"IF($B419=\"\",\"\",VLOOKUP($B419,Data!$A$4:$T$727,2,FALSE))","v":""},{"$f":"IF($B419=\"\",\"\",VLOOKUP($B419,Data!$A$4:$T$727,10,FALSE))","v":""},{"$f":"IF($B419=\"\",\"\",VLOOKUP($B419,Data!$A$4:$T$727,4,FALSE))","v":""},{"$f":"IF($B419=\"\",\"\",VLOOKUP($B419,Data!$A$4:$T$727,5,FALSE))","v":""},{"$f":"IF($B419=\"\",\"\",VLOOKUP($B419,Data!$A$4:$T$727,7,FALSE))","v":""},"","","","",{"$f":"IF($I$15=\"Show\",VLOOKUP($B419,Data!$A$4:$T$727,9,FALSE),VLOOKUP($B419,Data!$A$4:$T$727,7,FALSE))","v":{"$error":"#N/A"}},{"$f":"IF($B419=\"\",\"\",VLOOKUP($B419,Data!$A$4:$T$727,6,FALSE))","v":""},"",{"$f":"IF($B419=\"\",\"\",IF(VLOOKUP($B419,Data!$A$4:$T$727,11,FALSE)<1,\"\",VLOOKUP(B419,Data!$A$4:$T$727,11,FALSE)))","v":""}]
[null,null,{"$f":"IF($B420=\"\",\"\",VLOOKUP($B420,Data!$A$4:$T$727,2,FALSE))","v":""},{"$f":"IF($B420=\"\",\"\",VLOOKUP($B420,Data!$A$4:$T$727,10,FALSE))","v":""},{"$f":"IF($B420=\"\",\"\",VLOOKUP($B420,Data!$A$4:$T$727,4,FALSE))","v":""},{"$f":"IF($B420=\"\",\"\",VLOOKUP($B420,Data!$A$4:$T$727,5,FALSE))","v":""},{"$f":"IF($B420=\"\",\"\",VLOOKUP($B420,Data!$A$4:$T$727,7,FALSE))","v":""},"","","","",{"$f":"IF($I$15=\"Show\",VLOOKUP($B420,Data!$A$4:$T$727,9,FALSE),VLOOKUP($B420,Data!$A$4:$T$727,7,FALSE))","v":{"$error":"#N/A"}},{"$f":"IF($B420=\"\",\"\",VLOOKUP($B420,Data!$A$4:$T$727,6,FALSE))","v":""},"",{"$f":"IF($B420=\"\",\"\",IF(VLOOKUP($B420,Data!$A$4:$T$727,11,FALSE)<1,\"\",VLOOKUP(B420,Data!$A$4:$T$727,11,FALSE)))","v":""}]
[null,null,{"$f":"IF($B421=\"\",\"\",VLOOKUP($B421,Data!$A$4:$T$727,2,FALSE))","v":""},{"$f":"IF($B421=\"\",\"\",VLOOKUP($B421,Data!$A$4:$T$727,10,FALSE))","v":""},{"$f":"IF($B421=\"\",\"\",VLOOKUP($B421,Data!$A$4:$T$727,4,FALSE))","v":""},{"$f":"IF($B421=\"\",\"\",VLOOKUP($B421,Data!$A$4:$T$727,5,FALSE))","v":""},{"$f":"IF($B421=\"\",\"\",VLOOKUP($B421,Data!$A$4:$T$727,7,FALSE))","v":""},"","","","",{"$f":"IF($I$15=\"Show\",VLOOKUP($B421,Data!$A$4:$T$727,9,FALSE),VLOOKUP($B421,Data!$A$4:$T$727,7,FALSE))","v":{"$error":"#N/A"}},{"$f":"IF($B421=\"\",\"\",VLOOKUP($B421,Data!$A$4:$T$727,6,FALSE))","v":""},"",{"$f":"IF($B421=\"\",\"\",IF(VLOOKUP($B421,Data!$A$4:$T$727,11,FALSE)<1,\"\",VLOOKUP(B421,Data!$A$4:$T$727,11,FALSE)))","v":""}]
[null,null,{"$f":"IF($B422=\"\",\"\",VLOOKUP($B422,Data!$A$4:$T$727,2,FALSE))","v":""},{"$f":"IF($B422=\"\",\"\",VLOOKUP($B422,Data!$A$4:$T$727,10,FALSE))","v":""},{"$f":"IF($B422=\"\",\"\",VLOOKUP($B422,Data!$A$4:$T$727,4,FALSE))","v":""},{"$f":"IF($B422=\"\",\"\",VLOOKUP($B422,Data!$A$4:$T$727,5,FALSE))","v":""},{"$f":"IF($B422=\"\",\"\",VLOOKUP($B422,Data!$A$4:$T$727,7,FALSE))","v":""},"","","","",{"$f":"IF($I$15=\"Show\",VLOOKUP($B422,Data!$A$4:$T$727,9,FALSE),VLOOKUP($B422,Data!$A$4:$T$727,7,FALSE))","v":{"$error":"#N/A"}},{"$f":"IF($B422=\"\",\"\",VLOOKUP($B422,Data!$A$4:$T$727,6,FALSE))","v":""},"",{"$f":"IF($B422=\"\",\"\",IF(VLOOKUP($B422,Data!$A$4:$T$727,11,FALSE)<1,\"\",VLOOKUP(B422,Data!$A$4:$T$727,11,FALSE)))","v":""}]
[null,null,{"$f":"IF($B423=\"\",\"\",VLOOKUP($B423,Data!$A$4:$T$727,2,FALSE))","v":""},{"$f":"IF($B423=\"\",\"\",VLOOKUP($B423,Data!$A$4:$T$727,10,FALSE))","v":""},{"$f":"IF($B423=\"\",\"\",VLOOKUP($B423,Data!$A$4:$T$727,4,FALSE))","v":""},{"$f":"IF($B423=\"\",\"\",VLOOKUP($B423,Data!$A$4:$T$727,5,FALSE))","v":""},{"$f":"IF($B423=\"\",\"\",VLOOKUP($B423,Data!$A$4:$T$727,7,FALSE))","v":""},"","","","",{"$f":"IF($I$15=\"Show\",VLOOKUP($B423,Data!$A$4:$T$727,9,FALSE),VLOOKUP($B423,Data!$A$4:$T$727,7,FALSE))","v":{"$error":"#N/A"}},{"$f":"IF($B423=\"\",\"\",VLOOKUP($B423,Data!$A$4:$T$727,6,FALSE))","v":""},"",{"$f":"IF($B423=\"\",\"\",IF(VLOOKUP($B423,Data!$A$4:$T$727,11,FALSE)<1,\"\",VLOOKUP(B423,Data!$A$4:$T$727,11,FALSE)))","v":""}]
[null,null,{"$f":"IF($B424=\"\",\"\",VLOOKUP($B424,Data!$A$4:$T$727,2,FALSE))","v":""},{"$f":"IF($B424=\"\",\"\",VLOOKUP($B424,Data!$A$4:$T$727,10,FALSE))","v":""},{"$f":"IF($B424=\"\",\"\",VLOOKUP($B424,Data!$A$4:$T$727,4,FALSE))","v":""},{"$f":"IF($B424=\"\",\"\",VLOOKUP($B424,Data!$A$4:$T$727,5,FALSE))","v":""},{"$f":"IF($B424=\"\",\"\",VLOOKUP($B424,Data!$A$4:$T$727,7,FALSE))","v":""},"","","","",{"$f":"IF($I$15=\"Show\",VLOOKUP($B424,Data!$A$4:$T$727,9,FALSE),VLOOKUP($B424,Data!$A$4:$T$727,7,FALSE))","v":{"$error":"#N/A"}},{"$f":"IF($B424=\"\",\"\",VLOOKUP($B424,Data!$A$4:$T$727,6,FALSE))","v":""},"",{"$f":"IF($B424=\"\",\"\",IF(VLOOKUP($B424,Data!$A$4:$T$727,11,FALSE)<1,\"\",VLOOKUP(B424,Data!$A$4:$T$727,11,FALSE)))","v":""}]
[null,null,{"$f":"IF($B425=\"\",\"\",VLOOKUP($B425,Data!$A$4:$T$727,2,FALSE))","v":""},{"$f":"IF($B425=\"\",\"\",VLOOKUP($B425,Data!$A$4:$T$727,10,FALSE))","v":""},{"$f":"IF($B425=\"\",\"\",VLOOKUP($B425,Data!$A$4:$T$727,4,FALSE))","v":""},{"$f":"IF($B425=\"\",\"\",VLOOKUP($B425,Data!$A$4:$T$727,5,FALSE))","v":""},{"$f":"IF($B425=\"\",\"\",VLOOKUP($B425,Data!$A$4:$T$727,7,FALSE))","v":""},"","","","",{"$f":"IF($I$15=\"Show\",VLOOKUP($B425,Data!$A$4:$T$727,9,FALSE),VLOOKUP($B425,Data!$A$4:$T$727,7,FALSE))","v":{"$error":"#N/A"}},{"$f":"IF($B425=\"\",\"\",VLOOKUP($B425,Data!$A$4:$T$727,6,FALSE))","v":""},"",{"$f":"IF($B425=\"\",\"\",IF(VLOOKUP($B425,Data!$A$4:$T$727,11,FALSE)<1,\"\",VLOOKUP(B425,Data!$A$4:$T$727,11,FALSE)))","v":""}]
[null,null,{"$f":"IF($B426=\"\",\"\",VLOOKUP($B426,Data!$A$4:$T$727,2,FALSE))","v":""},{"$f":"IF($B426=\"\",\"\",VLOOKUP($B426,Data!$A$4:$T$727,10,FALSE))","v":""},{"$f":"IF($B426=\"\",\"\",VLOOKUP($B426,Data!$A$4:$T$727,4,FALSE))","v":""},{"$f":"IF($B426=\"\",\"\",VLOOKUP($B426,Data!$A$4:$T$727,5,FALSE))","v":""},{"$f":"IF($B426=\"\",\"\",VLOOKUP($B426,Data!$A$4:$T$727,7,FALSE))","v":""},"","","","",{"$f":"IF($I$15=\"Show\",VLOOKUP($B426,Data!$A$4:$T$727,9,FALSE),VLOOKUP($B426,Data!$A$4:$T$727,7,FALSE))","v":{"$error":"#N/A"}},{"$f":"IF($B426=\"\",\"\",VLOOKUP($B426,Data!$A$4:$T$727,6,FALSE))","v":""},"",{"$f":"IF($B426=\"\",\"\",IF(VLOOKUP($B426,Data!$A$4:$T$727,11,FALSE)<1,\"\",VLOOKUP(B426,Data!$A$4:$T$727,11,FALSE)))","v":""}]
[null,null,{"$f":"IF($B427=\"\",\"\",VLOOKUP($B427,Data!$A$4:$T$727,2,FALSE))","v":""},{"$f":"IF($B427=\"\",\"\",VLOOKUP($B427,Data!$A$4:$T$727,10,FALSE))","v":""},{"$f":"IF($B427=\"\",\"\",VLOOKUP($B427,Data!$A$4:$T$727,4,FALSE))","v":""},{"$f":"IF($B427=\"\",\"\",VLOOKUP($B427,Data!$A$4:$T$727,5,FALSE))","v":""},{"$f":"IF($B427=\"\",\"\",VLOOKUP($B427,Data!$A$4:$T$727,7,FALSE))","v":""},"","","","",{"$f":"IF($I$15=\"Show\",VLOOKUP($B427,Data!$A$4:$T$727,9,FALSE),VLOOKUP($B427,Data!$A$4:$T$727,7,FALSE))","v":{"$error":"#N/A"}},{"$f":"IF($B427=\"\",\"\",VLOOKUP($B427,Data!$A$4:$T$727,6,FALSE))","v":""},"",{"$f":"IF($B427=\"\",\"\",IF(VLOOKUP($B427,Data!$A$4:$T$727,11,FALSE)<1,\"\",VLOOKUP(B427,Data!$A$4:$T$727,11,FALSE)))","v":""}]
[null,null,{"$f":"IF($B428=\"\",\"\",VLOOKUP($B428,Data!$A$4:$T$727,2,FALSE))","v":""},{"$f":"IF($B428=\"\",\"\",VLOOKUP($B428,Data!$A$4:$T$727,10,FALSE))","v":""},{"$f":"IF($B428=\"\",\"\",VLOOKUP($B428,Data!$A$4:$T$727,4,FALSE))","v":""},{"$f":"IF($B428=\"\",\"\",VLOOKUP($B428,Data!$A$4:$T$727,5,FALSE))","v":""},{"$f":"IF($B428=\"\",\"\",VLOOKUP($B428,Data!$A$4:$T$727,7,FALSE))","v":""},"","","","",{"$f":"IF($I$15=\"Show\",VLOOKUP($B428,Data!$A$4:$T$727,9,FALSE),VLOOKUP($B428,Data!$A$4:$T$727,7,FALSE))","v":{"$error":"#N/A"}},{"$f":"IF($B428=\"\",\"\",VLOOKUP($B428,Data!$A$4:$T$727,6,FALSE))","v":""},"",{"$f":"IF($B428=\"\",\"\",IF(VLOOKUP($B428,Data!$A$4:$T$727,11,FALSE)<1,\"\",VLOOKUP(B428,Data!$A$4:$T$727,11,FALSE)))","v":""}]
[null,null,{"$f":"IF($B429=\"\",\"\",VLOOKUP($B429,Data!$A$4:$T$727,2,FALSE))","v":""},{"$f":"IF($B429=\"\",\"\",VLOOKUP($B429,Data!$A$4:$T$727,10,FALSE))","v":""},{"$f":"IF($B429=\"\",\"\",VLOOKUP($B429,Data!$A$4:$T$727,4,FALSE))","v":""},{"$f":"IF($B429=\"\",\"\",VLOOKUP($B429,Data!$A$4:$T$727,5,FALSE))","v":""},{"$f":"IF($B429=\"\",\"\",VLOOKUP($B429,Data!$A$4:$T$727,7,FALSE))","v":""},"","","","",{"$f":"IF($I$15=\"Show\",VLOOKUP($B429,Data!$A$4:$T$727,9,FALSE),VLOOKUP($B429,Data!$A$4:$T$727,7,FALSE))","v":{"$error":"#N/A"}},{"$f":"IF($B429=\"\",\"\",VLOOKUP($B429,Data!$A$4:$T$727,6,FALSE))","v":""},"",{"$f":"IF($B429=\"\",\"\",IF(VLOOKUP($B429,Data!$A$4:$T$727,11,FALSE)<1,\"\",VLOOKUP(B429,Data!$A$4:$T$727,11,FALSE)))","v":""}]
[null,null,{"$f":"IF($B430=\"\",\"\",VLOOKUP($B430,Data!$A$4:$T$727,2,FALSE))","v":""},{"$f":"IF($B430=\"\",\"\",VLOOKUP($B430,Data!$A$4:$T$727,10,FALSE))","v":""},{"$f":"IF($B430=\"\",\"\",VLOOKUP($B430,Data!$A$4:$T$727,4,FALSE))","v":""},{"$f":"IF($B430=\"\",\"\",VLOOKUP($B430,Data!$A$4:$T$727,5,FALSE))","v":""},{"$f":"IF($B430=\"\",\"\",VLOOKUP($B430,Data!$A$4:$T$727,7,FALSE))","v":""},"","","","",{"$f":"IF($I$15=\"Show\",VLOOKUP($B430,Data!$A$4:$T$727,9,FALSE),VLOOKUP($B430,Data!$A$4:$T$727,7,FALSE))","v":{"$error":"#N/A"}},{"$f":"IF($B430=\"\",\"\",VLOOKUP($B430,Data!$A$4:$T$727,6,FALSE))","v":""},"",{"$f":"IF($B430=\"\",\"\",IF(VLOOKUP($B430,Data!$A$4:$T$727,11,FALSE)<1,\"\",VLOOKUP(B430,Data!$A$4:$T$727,11,FALSE)))","v":""}]
[null,null,{"$f":"IF($B431=\"\",\"\",VLOOKUP($B431,Data!$A$4:$T$727,2,FALSE))","v":""},{"$f":"IF($B431=\"\",\"\",VLOOKUP($B431,Data!$A$4:$T$727,10,FALSE))","v":""},{"$f":"IF($B431=\"\",\"\",VLOOKUP($B431,Data!$A$4:$T$727,4,FALSE))","v":""},{"$f":"IF($B431=\"\",\"\",VLOOKUP($B431,Data!$A$4:$T$727,5,FALSE))","v":""},{"$f":"IF($B431=\"\",\"\",VLOOKUP($B431,Data!$A$4:$T$727,7,FALSE))","v":""},"","","","",{"$f":"IF($I$15=\"Show\",VLOOKUP($B431,Data!$A$4:$T$727,9,FALSE),VLOOKUP($B431,Data!$A$4:$T$727,7,FALSE))","v":{"$error":"#N/A"}},{"$f":"IF($B431=\"\",\"\",VLOOKUP($B431,Data!$A$4:$T$727,6,FALSE))","v":""},"",{"$f":"IF($B431=\"\",\"\",IF(VLOOKUP($B431,Data!$A$4:$T$727,11,FALSE)<1,\"\",VLOOKUP(B431,Data!$A$4:$T$727,11,FALSE)))","v":""}]
[null,null,{"$f":"IF($B432=\"\",\"\",VLOOKUP($B432,Data!$A$4:$T$727,2,FALSE))","v":""},{"$f":"IF($B432=\"\",\"\",VLOOKUP($B432,Data!$A$4:$T$727,10,FALSE))","v":""},{"$f":"IF($B432=\"\",\"\",VLOOKUP($B432,Data!$A$4:$T$727,4,FALSE))","v":""},{"$f":"IF($B432=\"\",\"\",VLOOKUP($B432,Data!$A$4:$T$727,5,FALSE))","v":""},{"$f":"IF($B432=\"\",\"\",VLOOKUP($B432,Data!$A$4:$T$727,7,FALSE))","v":""},"","","","",{"$f":"IF($I$15=\"Show\",VLOOKUP($B432,Data!$A$4:$T$727,9,FALSE),VLOOKUP($B432,Data!$A$4:$T$727,7,FALSE))","v":{"$error":"#N/A"}},{"$f":"IF($B432=\"\",\"\",VLOOKUP($B432,Data!$A$4:$T$727,6,FALSE))","v":""},"",{"$f":"IF($B432=\"\",\"\",IF(VLOOKUP($B432,Data!$A$4:$T$727,11,FALSE)<1,\"\",VLOOKUP(B432,Data!$A$4:$T$727,11,FALSE)))","v":""}]
[null,null,{"$f":"IF($B433=\"\",\"\",VLOOKUP($B433,Data!$A$4:$T$727,2,FALSE))","v":""},{"$f":"IF($B433=\"\",\"\",VLOOKUP($B433,Data!$A$4:$T$727,10,FALSE))","v":""},{"$f":"IF($B433=\"\",\"\",VLOOKUP($B433,Data!$A$4:$T$727,4,FALSE))","v":""},{"$f":"IF($B433=\"\",\"\",VLOOKUP($B433,Data!$A$4:$T$727,5,FALSE))","v":""},{"$f":"IF($B433=\"\",\"\",VLOOKUP($B433,Data!$A$4:$T$727,7,FALSE))","v":""},"","","","",{"$f":"IF($I$15=\"Show\",VLOOKUP($B433,Data!$A$4:$T$727,9,FALSE),VLOOKUP($B433,Data!$A$4:$T$727,7,FALSE))","v":{"$error":"#N/A"}},{"$f":"IF($B433=\"\",\"\",VLOOKUP($B433,Data!$A$4:$T$727,6,FALSE))","v":""},"",{"$f":"IF($B433=\"\",\"\",IF(VLOOKUP($B433,Data!$A$4:$T$727,11,FALSE)<1,\"\",VLOOKUP(B433,Data!$A$4:$T$727,11,FALSE)))","v":""}]
[null,null,{"$f":"IF($B434=\"\",\"\",VLOOKUP($B434,Data!$A$4:$T$727,2,FALSE))","v":""},{"$f":"IF($B434=\"\",\"\",VLOOKUP($B434,Data!$A$4:$T$727,10,FALSE))","v":""},{"$f":"IF($B434=\"\",\"\",VLOOKUP($B434,Data!$A$4:$T$727,4,FALSE))","v":""},{"$f":"IF($B434=\"\",\"\",VLOOKUP($B434,Data!$A$4:$T$727,5,FALSE))","v":""},{"$f":"IF($B434=\"\",\"\",VLOOKUP($B434,Data!$A$4:$T$727,7,FALSE))","v":""},"","","","",{"$f":"IF($I$15=\"Show\",VLOOKUP($B434,Data!$A$4:$T$727,9,FALSE),VLOOKUP($B434,Data!$A$4:$T$727,7,FALSE))","v":{"$error":"#N/A"}},{"$f":"IF($B434=\"\",\"\",VLOOKUP($B434,Data!$A$4:$T$727,6,FALSE))","v":""},"",{"$f":"IF($B434=\"\",\"\",IF(VLOOKUP($B434,Data!$A$4:$T$727,11,FALSE)<1,\"\",VLOOKUP(B434,Data!$A$4:$T$727,11,FALSE)))","v":""}]
[null,null,{"$f":"IF($B435=\"\",\"\",VLOOKUP($B435,Data!$A$4:$T$727,2,FALSE))","v":""},{"$f":"IF($B435=\"\",\"\",VLOOKUP($B435,Data!$A$4:$T$727,10,FALSE))","v":""},{"$f":"IF($B435=\"\",\"\",VLOOKUP($B435,Data!$A$4:$T$727,4,FALSE))","v":""},{"$f":"IF($B435=\"\",\"\",VLOOKUP($B435,Data!$A$4:$T$727,5,FALSE))","v":""},{"$f":"IF($B435=\"\",\"\",VLOOKUP($B435,Data!$A$4:$T$727,7,FALSE))","v":""},"","","","",{"$f":"IF($I$15=\"Show\",VLOOKUP($B435,Data!$A$4:$T$727,9,FALSE),VLOOKUP($B435,Data!$A$4:$T$727,7,FALSE))","v":{"$error":"#N/A"}},{"$f":"IF($B435=\"\",\"\",VLOOKUP($B435,Data!$A$4:$T$727,6,FALSE))","v":""},"",{"$f":"IF($B435=\"\",\"\",IF(VLOOKUP($B435,Data!$A$4:$T$727,11,FALSE)<1,\"\",VLOOKUP(B435,Data!$A$4:$T$727,11,FALSE)))","v":""}]
[null,null,{"$f":"IF($B436=\"\",\"\",VLOOKUP($B436,Data!$A$4:$T$727,2,FALSE))","v":""},{"$f":"IF($B436=\"\",\"\",VLOOKUP($B436,Data!$A$4:$T$727,10,FALSE))","v":""},{"$f":"IF($B436=\"\",\"\",VLOOKUP($B436,Data!$A$4:$T$727,4,FALSE))","v":""},{"$f":"IF($B436=\"\",\"\",VLOOKUP($B436,Data!$A$4:$T$727,5,FALSE))","v":""},{"$f":"IF($B436=\"\",\"\",VLOOKUP($B436,Data!$A$4:$T$727,7,FALSE))","v":""},"","","","",{"$f":"IF($I$15=\"Show\",VLOOKUP($B436,Data!$A$4:$T$727,9,FALSE),VLOOKUP($B436,Data!$A$4:$T$727,7,FALSE))","v":{"$error":"#N/A"}},{"$f":"IF($B436=\"\",\"\",VLOOKUP($B436,Data!$A$4:$T$727,6,FALSE))","v":""},"",{"$f":"IF($B436=\"\",\"\",IF(VLOOKUP($B436,Data!$A$4:$T$727,11,FALSE)<1,\"\",VLOOKUP(B436,Data!$A$4:$T$727,11,FALSE)))","v":""}]
[null,null,{"$f":"IF($B437=\"\",\"\",VLOOKUP($B437,Data!$A$4:$T$727,2,FALSE))","v":""},{"$f":"IF($B437=\"\",\"\",VLOOKUP($B437,Data!$A$4:$T$727,10,FALSE))","v":""},{"$f":"IF($B437=\"\",\"\",VLOOKUP($B437,Data!$A$4:$T$727,4,FALSE))","v":""},{"$f":"IF($B437=\"\",\"\",VLOOKUP($B437,Data!$A$4:$T$727,5,FALSE))","v":""},{"$f":"IF($B437=\"\",\"\",VLOOKUP($B437,Data!$A$4:$T$727,7,FALSE))","v":""},"","","","",{"$f":"IF($I$15=\"Show\",VLOOKUP($B437,Data!$A$4:$T$727,9,FALSE),VLOOKUP($B437,Data!$A$4:$T$727,7,FALSE))","v":{"$error":"#N/A"}},{"$f":"IF($B437=\"\",\"\",VLOOKUP($B437,Data!$A$4:$T$727,6,FALSE))","v":""},"",{"$f":"IF($B437=\"\",\"\",IF(VLOOKUP($B437,Data!$A$4:$T$727,11,FALSE)<1,\"\",VLOOKUP(B437,Data!$A$4:$T$727,11,FALSE)))","v":""}]
[null,null,{"$f":"IF($B438=\"\",\"\",VLOOKUP($B438,Data!$A$4:$T$727,2,FALSE))","v":""},{"$f":"IF($B438=\"\",\"\",VLOOKUP($B438,Data!$A$4:$T$727,10,FALSE))","v":""},{"$f":"IF($B438=\"\",\"\",VLOOKUP($B438,Data!$A$4:$T$727,4,FALSE))","v":""},{"$f":"IF($B438=\"\",\"\",VLOOKUP($B438,Data!$A$4:$T$727,5,FALSE))","v":""},{"$f":"IF($B438=\"\",\"\",VLOOKUP($B438,Data!$A$4:$T$727,7,FALSE))","v":""},"","","","",{"$f":"IF($I$15=\"Show\",VLOOKUP($B438,Data!$A$4:$T$727,9,FALSE),VLOOKUP($B438,Data!$A$4:$T$727,7,FALSE))","v":{"$error":"#N/A"}},{"$f":"IF($B438=\"\",\"\",VLOOKUP($B438,Data!$A$4:$T$727,6,FALSE))","v":""},"",{"$f":"IF($B438=\"\",\"\",IF(VLOOKUP($B438,Data!$A$4:$T$727,11,FALSE)<1,\"\",VLOOKUP(B438,Data!$A$4:$T$727,11,FALSE)))","v":""}]
[null,null,{"$f":"IF($B439=\"\",\"\",VLOOKUP($B439,Data!$A$4:$T$727,2,FALSE))","v":""},{"$f":"IF($B439=\"\",\"\",VLOOKUP($B439,Data!$A$4:$T$727,10,FALSE))","v":""},{"$f":"IF($B439=\"\",\"\",VLOOKUP($B439,Data!$A$4:$T$727,4,FALSE))","v":""},{"$f":"IF($B439=\"\",\"\",VLOOKUP($B439,Data!$A$4:$T$727,5,FALSE))","v":""},{"$f":"IF($B439=\"\",\"\",VLOOKUP($B439,Data!$A$4:$T$727,7,FALSE))","v":""},"","","","",{"$f":"IF($I$15=\"Show\",VLOOKUP($B439,Data!$A$4:$T$727,9,FALSE),VLOOKUP($B439,Data!$A$4:$T$727,7,FALSE))","v":{"$error":"#N/A"}},{"$f":"IF($B439=\"\",\"\",VLOOKUP($B439,Data!$A$4:$T$727,6,FALSE))","v":""},"",{"$f":"IF($B439=\"\",\"\",IF(VLOOKUP($B439,Data!$A$4:$T$727,11,FALSE)<1,\"\",VLOOKUP(B439,Data!$A$4:$T$727,11,FALSE)))","v":""}]
[null,null,{"$f":"IF($B440=\"\",\"\",VLOOKUP($B440,Data!$A$4:$T$727,2,FALSE))","v":""},{"$f":"IF($B440=\"\",\"\",VLOOKUP($B440,Data!$A$4:$T$727,10,FALSE))","v":""},{"$f":"IF($B440=\"\",\"\",VLOOKUP($B440,Data!$A$4:$T$727,4,FALSE))","v":""},{"$f":"IF($B440=\"\",\"\",VLOOKUP($B440,Data!$A$4:$T$727,5,FALSE))","v":""},{"$f":"IF($B440=\"\",\"\",VLOOKUP($B440,Data!$A$4:$T$727,7,FALSE))","v":""},"","","","",{"$f":"IF($I$15=\"Show\",VLOOKUP($B440,Data!$A$4:$T$727,9,FALSE),VLOOKUP($B440,Data!$A$4:$T$727,7,FALSE))","v":{"$error":"#N/A"}},{"$f":"IF($B440=\"\",\"\",VLOOKUP($B440,Data!$A$4:$T$727,6,FALSE))","v":""},"",{"$f":"IF($B440=\"\",\"\",IF(VLOOKUP($B440,Data!$A$4:$T$727,11,FALSE)<1,\"\",VLOOKUP(B440,Data!$A$4:$T$727,11,FALSE)))","v":""}]
[null,null,{"$f":"IF($B441=\"\",\"\",VLOOKUP($B441,Data!$A$4:$T$727,2,FALSE))","v":""},{"$f":"IF($B441=\"\",\"\",VLOOKUP($B441,Data!$A$4:$T$727,10,FALSE))","v":""},{"$f":"IF($B441=\"\",\"\",VLOOKUP($B441,Data!$A$4:$T$727,4,FALSE))","v":""},{"$f":"IF($B441=\"\",\"\",VLOOKUP($B441,Data!$A$4:$T$727,5,FALSE))","v":""},{"$f":"IF($B441=\"\",\"\",VLOOKUP($B441,Data!$A$4:$T$727,7,FALSE))","v":""},"","","","",{"$f":"IF($I$15=\"Show\",VLOOKUP($B441,Data!$A$4:$T$727,9,FALSE),VLOOKUP($B441,Data!$A$4:$T$727,7,FALSE))","v":{"$error":"#N/A"}},{"$f":"IF($B441=\"\",\"\",VLOOKUP($B441,Data!$A$4:$T$727,6,FALSE))","v":""},"",{"$f":"IF($B441=\"\",\"\",IF(VLOOKUP($B441,Data!$A$4:$T$727,11,FALSE)<1,\"\",VLOOKUP(B441,Data!$A$4:$T$727,11,FALSE)))","v":""}]
[null,null,{"$f":"IF($B442=\"\",\"\",VLOOKUP($B442,Data!$A$4:$T$727,2,FALSE))","v":""},{"$f":"IF($B442=\"\",\"\",VLOOKUP($B442,Data!$A$4:$T$727,10,FALSE))","v":""},{"$f":"IF($B442=\"\",\"\",VLOOKUP($B442,Data!$A$4:$T$727,4,FALSE))","v":""},{"$f":"IF($B442=\"\",\"\",VLOOKUP($B442,Data!$A$4:$T$727,5,FALSE))","v":""},{"$f":"IF($B442=\"\",\"\",VLOOKUP($B442,Data!$A$4:$T$727,7,FALSE))","v":""},"","","","",{"$f":"IF($I$15=\"Show\",VLOOKUP($B442,Data!$A$4:$T$727,9,FALSE),VLOOKUP($B442,Data!$A$4:$T$727,7,FALSE))","v":{"$error":"#N/A"}},{"$f":"IF($B442=\"\",\"\",VLOOKUP($B442,Data!$A$4:$T$727,6,FALSE))","v":""},"",{"$f":"IF($B442=\"\",\"\",IF(VLOOKUP($B442,Data!$A$4:$T$727,11,FALSE)<1,\"\",VLOOKUP(B442,Data!$A$4:$T$727,11,FALSE)))","v":""}]
[null,null,{"$f":"IF($B443=\"\",\"\",VLOOKUP($B443,Data!$A$4:$T$727,2,FALSE))","v":""},{"$f":"IF($B443=\"\",\"\",VLOOKUP($B443,Data!$A$4:$T$727,10,FALSE))","v":""},{"$f":"IF($B443=\"\",\"\",VLOOKUP($B443,Data!$A$4:$T$727,4,FALSE))","v":""},{"$f":"IF($B443=\"\",\"\",VLOOKUP($B443,Data!$A$4:$T$727,5,FALSE))","v":""},{"$f":"IF($B443=\"\",\"\",VLOOKUP($B443,Data!$A$4:$T$727,7,FALSE))","v":""},"","","","",{"$f":"IF($I$15=\"Show\",VLOOKUP($B443,Data!$A$4:$T$727,9,FALSE),VLOOKUP($B443,Data!$A$4:$T$727,7,FALSE))","v":{"$error":"#N/A"}},{"$f":"IF($B443=\"\",\"\",VLOOKUP($B443,Data!$A$4:$T$727,6,FALSE))","v":""},"",{"$f":"IF($B443=\"\",\"\",IF(VLOOKUP($B443,Data!$A$4:$T$727,11,FALSE)<1,\"\",VLOOKUP(B443,Data!$A$4:$T$727,11,FALSE)))","v":""}]
[null,null,{"$f":"IF($B444=\"\",\"\",VLOOKUP($B444,Data!$A$4:$T$727,2,FALSE))","v":""},{"$f":"IF($B444=\"\",\"\",VLOOKUP($B444,Data!$A$4:$T$727,10,FALSE))","v":""},{"$f":"IF($B444=\"\",\"\",VLOOKUP($B444,Data!$A$4:$T$727,4,FALSE))","v":""},{"$f":"IF($B444=\"\",\"\",VLOOKUP($B444,Data!$A$4:$T$727,5,FALSE))","v":""},{"$f":"IF($B444=\"\",\"\",VLOOKUP($B444,Data!$A$4:$T$727,7,FALSE))","v":""},"","","","",{"$f":"IF($I$15=\"Show\",VLOOKUP($B444,Data!$A$4:$T$727,9,FALSE),VLOOKUP($B444,Data!$A$4:$T$727,7,FALSE))","v":{"$error":"#N/A"}},{"$f":"IF($B444=\"\",\"\",VLOOKUP($B444,Data!$A$4:$T$727,6,FALSE))","v":""},"",{"$f":"IF($B444=\"\",\"\",IF(VLOOKUP($B444,Data!$A$4:$T$727,11,FALSE)<1,\"\",VLOOKUP(B444,Data!$A$4:$T$727,11,FALSE)))","v":""}]
[null,null,{"$f":"IF($B445=\"\",\"\",VLOOKUP($B445,Data!$A$4:$T$727,2,FALSE))","v":""},{"$f":"IF($B445=\"\",\"\",VLOOKUP($B445,Data!$A$4:$T$727,10,FALSE))","v":""},{"$f":"IF($B445=\"\",\"\",VLOOKUP($B445,Data!$A$4:$T$727,4,FALSE))","v":""},{"$f":"IF($B445=\"\",\"\",VLOOKUP($B445,Data!$A$4:$T$727,5,FALSE))","v":""},{"$f":"IF($B445=\"\",\"\",VLOOKUP($B445,Data!$A$4:$T$727,7,FALSE))","v":""},"","","","",{"$f":"IF($I$15=\"Show\",VLOOKUP($B445,Data!$A$4:$T$727,9,FALSE),VLOOKUP($B445,Data!$A$4:$T$727,7,FALSE))","v":{"$error":"#N/A"}},{"$f":"IF($B445=\"\",\"\",VLOOKUP($B445,Data!$A$4:$T$727,6,FALSE))","v":""},"",{"$f":"IF($B445=\"\",\"\",IF(VLOOKUP($B445,Data!$A$4:$T$727,11,FALSE)<1,\"\",VLOOKUP(B445,Data!$A$4:$T$727,11,FALSE)))","v":""}]
[null,null,{"$f":"IF($B446=\"\",\"\",VLOOKUP($B446,Data!$A$4:$T$727,2,FALSE))","v":""},{"$f":"IF($B446=\"\",\"\",VLOOKUP($B446,Data!$A$4:$T$727,10,FALSE))","v":""},{"$f":"IF($B446=\"\",\"\",VLOOKUP($B446,Data!$A$4:$T$727,4,FALSE))","v":""},{"$f":"IF($B446=\"\",\"\",VLOOKUP($B446,Data!$A$4:$T$727,5,FALSE))","v":""},{"$f":"IF($B446=\"\",\"\",VLOOKUP($B446,Data!$A$4:$T$727,7,FALSE))","v":""},"","","","",{"$f":"IF($I$15=\"Show\",VLOOKUP($B446,Data!$A$4:$T$727,9,FALSE),VLOOKUP($B446,Data!$A$4:$T$727,7,FALSE))","v":{"$error":"#N/A"}},{"$f":"IF($B446=\"\",\"\",VLOOKUP($B446,Data!$A$4:$T$727,6,FALSE))","v":""},"",{"$f":"IF($B446=\"\",\"\",IF(VLOOKUP($B446,Data!$A$4:$T$727,11,FALSE)<1,\"\",VLOOKUP(B446,Data!$A$4:$T$727,11,FALSE)))","v":""}]
[null,null,{"$f":"IF($B447=\"\",\"\",VLOOKUP($B447,Data!$A$4:$T$727,2,FALSE))","v":""},{"$f":"IF($B447=\"\",\"\",VLOOKUP($B447,Data!$A$4:$T$727,10,FALSE))","v":""},{"$f":"IF($B447=\"\",\"\",VLOOKUP($B447,Data!$A$4:$T$727,4,FALSE))","v":""},{"$f":"IF($B447=\"\",\"\",VLOOKUP($B447,Data!$A$4:$T$727,5,FALSE))","v":""},{"$f":"IF($B447=\"\",\"\",VLOOKUP($B447,Data!$A$4:$T$727,7,FALSE))","v":""},"","","","",{"$f":"IF($I$15=\"Show\",VLOOKUP($B447,Data!$A$4:$T$727,9,FALSE),VLOOKUP($B447,Data!$A$4:$T$727,7,FALSE))","v":{"$error":"#N/A"}},{"$f":"IF($B447=\"\",\"\",VLOOKUP($B447,Data!$A$4:$T$727,6,FALSE))","v":""},"",{"$f":"IF($B447=\"\",\"\",IF(VLOOKUP($B447,Data!$A$4:$T$727,11,FALSE)<1,\"\",VLOOKUP(B447,Data!$A$4:$T$727,11,FALSE)))","v":""}]
[null,null,{"$f":"IF($B448=\"\",\"\",VLOOKUP($B448,Data!$A$4:$T$727,2,FALSE))","v":""},{"$f":"IF($B448=\"\",\"\",VLOOKUP($B448,Data!$A$4:$T$727,10,FALSE))","v":""},{"$f":"IF($B448=\"\",\"\",VLOOKUP($B448,Data!$A$4:$T$727,4,FALSE))","v":""},{"$f":"IF($B448=\"\",\"\",VLOOKUP($B448,Data!$A$4:$T$727,5,FALSE))","v":""},{"$f":"IF($B448=\"\",\"\",VLOOKUP($B448,Data!$A$4:$T$727,7,FALSE))","v":""},"","","","",{"$f":"IF($I$15=\"Show\",VLOOKUP($B448,Data!$A$4:$T$727,9,FALSE),VLOOKUP($B448,Data!$A$4:$T$727,7,FALSE))","v":{"$error":"#N/A"}},{"$f":"IF($B448=\"\",\"\",VLOOKUP($B448,Data!$A$4:$T$727,6,FALSE))","v":""},"",{"$f":"IF($B448=\"\",\"\",IF(VLOOKUP($B448,Data!$A$4:$T$727,11,FALSE)<1,\"\",VLOOKUP(B448,Data!$A$4:$T$727,11,FALSE)))","v":""}]
[null,null,{"$f":"IF($B449=\"\",\"\",VLOOKUP($B449,Data!$A$4:$T$727,2,FALSE))","v":""},{"$f":"IF($B449=\"\",\"\",VLOOKUP($B449,Data!$A$4:$T$727,10,FALSE))","v":""},{"$f":"IF($B449=\"\",\"\",VLOOKUP($B449,Data!$A$4:$T$727,4,FALSE))","v":""},{"$f":"IF($B449=\"\",\"\",VLOOKUP($B449,Data!$A$4:$T$727,5,FALSE))","v":""},{"$f":"IF($B449=\"\",\"\",VLOOKUP($B449,Data!$A$4:$T$727,7,FALSE))","v":""},"","","","",{"$f":"IF($I$15=\"Show\",VLOOKUP($B449,Data!$A$4:$T$727,9,FALSE),VLOOKUP($B449,Data!$A$4:$T$727,7,FALSE))","v":{"$error":"#N/A"}},{"$f":"IF($B449=\"\",\"\",VLOOKUP($B449,Data!$A$4:$T$727,6,FALSE))","v":""},"",{"$f":"IF($B449=\"\",\"\",IF(VLOOKUP($B449,Data!$A$4:$T$727,11,FALSE)<1,\"\",VLOOKUP(B449,Data!$A$4:$T$727,11,FALSE)))","v":""}]
[null,null,{"$f":"IF($B450=\"\",\"\",VLOOKUP($B450,Data!$A$4:$T$727,2,FALSE))","v":""},{"$f":"IF($B450=\"\",\"\",VLOOKUP($B450,Data!$A$4:$T$727,10,FALSE))","v":""},{"$f":"IF($B450=\"\",\"\",VLOOKUP($B450,Data!$A$4:$T$727,4,FALSE))","v":""},{"$f":"IF($B450=\"\",\"\",VLOOKUP($B450,Data!$A$4:$T$727,5,FALSE))","v":""},{"$f":"IF($B450=\"\",\"\",VLOOKUP($B450,Data!$A$4:$T$727,7,FALSE))","v":""},"","","","",{"$f":"IF($I$15=\"Show\",VLOOKUP($B450,Data!$A$4:$T$727,9,FALSE),VLOOKUP($B450,Data!$A$4:$T$727,7,FALSE))","v":{"$error":"#N/A"}},{"$f":"IF($B450=\"\",\"\",VLOOKUP($B450,Data!$A$4:$T$727,6,FALSE))","v":""},"",{"$f":"IF($B450=\"\",\"\",IF(VLOOKUP($B450,Data!$A$4:$T$727,11,FALSE)<1,\"\",VLOOKUP(B450,Data!$A$4:$T$727,11,FALSE)))","v":""}]
[null,null,{"$f":"IF($B451=\"\",\"\",VLOOKUP($B451,Data!$A$4:$T$727,2,FALSE))","v":""},{"$f":"IF($B451=\"\",\"\",VLOOKUP($B451,Data!$A$4:$T$727,10,FALSE))","v":""},{"$f":"IF($B451=\"\",\"\",VLOOKUP($B451,Data!$A$4:$T$727,4,FALSE))","v":""},{"$f":"IF($B451=\"\",\"\",VLOOKUP($B451,Data!$A$4:$T$727,5,FALSE))","v":""},{"$f":"IF($B451=\"\",\"\",VLOOKUP($B451,Data!$A$4:$T$727,7,FALSE))","v":""},"","","","",{"$f":"IF($I$15=\"Show\",VLOOKUP($B451,Data!$A$4:$T$727,9,FALSE),VLOOKUP($B451,Data!$A$4:$T$727,7,FALSE))","v":{"$error":"#N/A"}},{"$f":"IF($B451=\"\",\"\",VLOOKUP($B451,Data!$A$4:$T$727,6,FALSE))","v":""},"",{"$f":"IF($B451=\"\",\"\",IF(VLOOKUP($B451,Data!$A$4:$T$727,11,FALSE)<1,\"\",VLOOKUP(B451,Data!$A$4:$T$727,11,FALSE)))","v":""}]
[null,null,{"$f":"IF($B452=\"\",\"\",VLOOKUP($B452,Data!$A$4:$T$727,2,FALSE))","v":""},{"$f":"IF($B452=\"\",\"\",VLOOKUP($B452,Data!$A$4:$T$727,10,FALSE))","v":""},{"$f":"IF($B452=\"\",\"\",VLOOKUP($B452,Data!$A$4:$T$727,4,FALSE))","v":""},{"$f":"IF($B452=\"\",\"\",VLOOKUP($B452,Data!$A$4:$T$727,5,FALSE))","v":""},{"$f":"IF($B452=\"\",\"\",VLOOKUP($B452,Data!$A$4:$T$727,7,FALSE))","v":""},"","","","",{"$f":"IF($I$15=\"Show\",VLOOKUP($B452,Data!$A$4:$T$727,9,FALSE),VLOOKUP($B452,Data!$A$4:$T$727,7,FALSE))","v":{"$error":"#N/A"}},{"$f":"IF($B452=\"\",\"\",VLOOKUP($B452,Data!$A$4:$T$727,6,FALSE))","v":""},"",{"$f":"IF($B452=\"\",\"\",IF(VLOOKUP($B452,Data!$A$4:$T$727,11,FALSE)<1,\"\",VLOOKUP(B452,Data!$A$4:$T$727,11,FALSE)))","v":""}]
[null,null,{"$f":"IF($B453=\"\",\"\",VLOOKUP($B453,Data!$A$4:$T$727,2,FALSE))","v":""},{"$f":"IF($B453=\"\",\"\",VLOOKUP($B453,Data!$A$4:$T$727,10,FALSE))","v":""},{"$f":"IF($B453=\"\",\"\",VLOOKUP($B453,Data!$A$4:$T$727,4,FALSE))","v":""},{"$f":"IF($B453=\"\",\"\",VLOOKUP($B453,Data!$A$4:$T$727,5,FALSE))","v":""},{"$f":"IF($B453=\"\",\"\",VLOOKUP($B453,Data!$A$4:$T$727,7,FALSE))","v":""},"","","","",{"$f":"IF($I$15=\"Show\",VLOOKUP($B453,Data!$A$4:$T$727,9,FALSE),VLOOKUP($B453,Data!$A$4:$T$727,7,FALSE))","v":{"$error":"#N/A"}},{"$f":"IF($B453=\"\",\"\",VLOOKUP($B453,Data!$A$4:$T$727,6,FALSE))","v":""},"",{"$f":"IF($B453=\"\",\"\",IF(VLOOKUP($B453,Data!$A$4:$T$727,11,FALSE)<1,\"\",VLOOKUP(B453,Data!$A$4:$T$727,11,FALSE)))","v":""}]
[null,null,{"$f":"IF($B454=\"\",\"\",VLOOKUP($B454,Data!$A$4:$T$727,2,FALSE))","v":""},{"$f":"IF($B454=\"\",\"\",VLOOKUP($B454,Data!$A$4:$T$727,10,FALSE))","v":""},{"$f":"IF($B454=\"\",\"\",VLOOKUP($B454,Data!$A$4:$T$727,4,FALSE))","v":""},{"$f":"IF($B454=\"\",\"\",VLOOKUP($B454,Data!$A$4:$T$727,5,FALSE))","v":""},{"$f":"IF($B454=\"\",\"\",VLOOKUP($B454,Data!$A$4:$T$727,7,FALSE))","v":""},"","","","",{"$f":"IF($I$15=\"Show\",VLOOKUP($B454,Data!$A$4:$T$727,9,FALSE),VLOOKUP($B454,Data!$A$4:$T$727,7,FALSE))","v":{"$error":"#N/A"}},{"$f":"IF($B454=\"\",\"\",VLOOKUP($B454,Data!$A$4:$T$727,6,FALSE))","v":""},"",{"$f":"IF($B454=\"\",\"\",IF(VLOOKUP($B454,Data!$A$4:$T$727,11,FALSE)<1,\"\",VLOOKUP(B454,Data!$A$4:$T$727,11,FALSE)))","v":""}]
[null,null,{"$f":"IF($B455=\"\",\"\",VLOOKUP($B455,Data!$A$4:$T$727,2,FALSE))","v":""},{"$f":"IF($B455=\"\",\"\",VLOOKUP($B455,Data!$A$4:$T$727,10,FALSE))","v":""},{"$f":"IF($B455=\"\",\"\",VLOOKUP($B455,Data!$A$4:$T$727,4,FALSE))","v":""},{"$f":"IF($B455=\"\",\"\",VLOOKUP($B455,Data!$A$4:$T$727,5,FALSE))","v":""},{"$f":"IF($B455=\"\",\"\",VLOOKUP($B455,Data!$A$4:$T$727,7,FALSE))","v":""},"","","","",{"$f":"IF($I$15=\"Show\",VLOOKUP($B455,Data!$A$4:$T$727,9,FALSE),VLOOKUP($B455,Data!$A$4:$T$727,7,FALSE))","v":{"$error":"#N/A"}},{"$f":"IF($B455=\"\",\"\",VLOOKUP($B455,Data!$A$4:$T$727,6,FALSE))","v":""},"",{"$f":"IF($B455=\"\",\"\",IF(VLOOKUP($B455,Data!$A$4:$T$727,11,FALSE)<1,\"\",VLOOKUP(B455,Data!$A$4:$T$727,11,FALSE)))","v":""}]
[null,null,{"$f":"IF($B456=\"\",\"\",VLOOKUP($B456,Data!$A$4:$T$727,2,FALSE))","v":""},{"$f":"IF($B456=\"\",\"\",VLOOKUP($B456,Data!$A$4:$T$727,10,FALSE))","v":""},{"$f":"IF($B456=\"\",\"\",VLOOKUP($B456,Data!$A$4:$T$727,4,FALSE))","v":""},{"$f":"IF($B456=\"\",\"\",VLOOKUP($B456,Data!$A$4:$T$727,5,FALSE))","v":""},{"$f":"IF($B456=\"\",\"\",VLOOKUP($B456,Data!$A$4:$T$727,7,FALSE))","v":""},"","","","",{"$f":"IF($I$15=\"Show\",VLOOKUP($B456,Data!$A$4:$T$727,9,FALSE),VLOOKUP($B456,Data!$A$4:$T$727,7,FALSE))","v":{"$error":"#N/A"}},{"$f":"IF($B456=\"\",\"\",VLOOKUP($B456,Data!$A$4:$T$727,6,FALSE))","v":""},"",{"$f":"IF($B456=\"\",\"\",IF(VLOOKUP($B456,Data!$A$4:$T$727,11,FALSE)<1,\"\",VLOOKUP(B456,Data!$A$4:$T$727,11,FALSE)))","v":""}]
[null,null,{"$f":"IF($B457=\"\",\"\",VLOOKUP($B457,Data!$A$4:$T$727,2,FALSE))","v":""},{"$f":"IF($B457=\"\",\"\",VLOOKUP($B457,Data!$A$4:$T$727,10,FALSE))","v":""},{"$f":"IF($B457=\"\",\"\",VLOOKUP($B457,Data!$A$4:$T$727,4,FALSE))","v":""},{"$f":"IF($B457=\"\",\"\",VLOOKUP($B457,Data!$A$4:$T$727,5,FALSE))","v":""},{"$f":"IF($B457=\"\",\"\",VLOOKUP($B457,Data!$A$4:$T$727,7,FALSE))","v":""},"","","","",{"$f":"IF($I$15=\"Show\",VLOOKUP($B457,Data!$A$4:$T$727,9,FALSE),VLOOKUP($B457,Data!$A$4:$T$727,7,FALSE))","v":{"$error":"#N/A"}},{"$f":"IF($B457=\"\",\"\",VLOOKUP($B457,Data!$A$4:$T$727,6,FALSE))","v":""},"",{"$f":"IF($B457=\"\",\"\",IF(VLOOKUP($B457,Data!$A$4:$T$727,11,FALSE)<1,\"\",VLOOKUP(B457,Data!$A$4:$T$727,11,FALSE)))","v":""}]
[null,null,{"$f":"IF($B458=\"\",\"\",VLOOKUP($B458,Data!$A$4:$T$727,2,FALSE))","v":""},{"$f":"IF($B458=\"\",\"\",VLOOKUP($B458,Data!$A$4:$T$727,10,FALSE))","v":""},{"$f":"IF($B458=\"\",\"\",VLOOKUP($B458,Data!$A$4:$T$727,4,FALSE))","v":""},{"$f":"IF($B458=\"\",\"\",VLOOKUP($B458,Data!$A$4:$T$727,5,FALSE))","v":""},{"$f":"IF($B458=\"\",\"\",VLOOKUP($B458,Data!$A$4:$T$727,7,FALSE))","v":""},"","","","",{"$f":"IF($I$15=\"Show\",VLOOKUP($B458,Data!$A$4:$T$727,9,FALSE),VLOOKUP($B458,Data!$A$4:$T$727,7,FALSE))","v":{"$error":"#N/A"}},{"$f":"IF($B458=\"\",\"\",VLOOKUP($B458,Data!$A$4:$T$727,6,FALSE))","v":""},"",{"$f":"IF($B458=\"\",\"\",IF(VLOOKUP($B458,Data!$A$4:$T$727,11,FALSE)<1,\"\",VLOOKUP(B458,Data!$A$4:$T$727,11,FALSE)))","v":""}]
[null,null,{"$f":"IF($B459=\"\",\"\",VLOOKUP($B459,Data!$A$4:$T$727,2,FALSE))","v":""},{"$f":"IF($B459=\"\",\"\",VLOOKUP($B459,Data!$A$4:$T$727,10,FALSE))","v":""},{"$f":"IF($B459=\"\",\"\",VLOOKUP($B459,Data!$A$4:$T$727,4,FALSE))","v":""},{"$f":"IF($B459=\"\",\"\",VLOOKUP($B459,Data!$A$4:$T$727,5,FALSE))","v":""},{"$f":"IF($B459=\"\",\"\",VLOOKUP($B459,Data!$A$4:$T$727,7,FALSE))","v":""},"","","","",{"$f":"IF($I$15=\"Show\",VLOOKUP($B459,Data!$A$4:$T$727,9,FALSE),VLOOKUP($B459,Data!$A$4:$T$727,7,FALSE))","v":{"$error":"#N/A"}},{"$f":"IF($B459=\"\",\"\",VLOOKUP($B459,Data!$A$4:$T$727,6,FALSE))","v":""},"",{"$f":"IF($B459=\"\",\"\",IF(VLOOKUP($B459,Data!$A$4:$T$727,11,FALSE)<1,\"\",VLOOKUP(B459,Data!$A$4:$T$727,11,FALSE)))","v":""}]
[null,null,{"$f":"IF($B460=\"\",\"\",VLOOKUP($B460,Data!$A$4:$T$727,2,FALSE))","v":""},{"$f":"IF($B460=\"\",\"\",VLOOKUP($B460,Data!$A$4:$T$727,10,FALSE))","v":""},{"$f":"IF($B460=\"\",\"\",VLOOKUP($B460,Data!$A$4:$T$727,4,FALSE))","v":""},{"$f":"IF($B460=\"\",\"\",VLOOKUP($B460,Data!$A$4:$T$727,5,FALSE))","v":""},{"$f":"IF($B460=\"\",\"\",VLOOKUP($B460,Data!$A$4:$T$727,7,FALSE))","v":""},"","","","",{"$f":"IF($I$15=\"Show\",VLOOKUP($B460,Data!$A$4:$T$727,9,FALSE),VLOOKUP($B460,Data!$A$4:$T$727,7,FALSE))","v":{"$error":"#N/A"}},{"$f":"IF($B460=\"\",\"\",VLOOKUP($B460,Data!$A$4:$T$727,6,FALSE))","v":""},"",{"$f":"IF($B460=\"\",\"\",IF(VLOOKUP($B460,Data!$A$4:$T$727,11,FALSE)<1,\"\",VLOOKUP(B460,Data!$A$4:$T$727,11,FALSE)))","v":""}]
[null,null,{"$f":"IF($B461=\"\",\"\",VLOOKUP($B461,Data!$A$4:$T$727,2,FALSE))","v":""},{"$f":"IF($B461=\"\",\"\",VLOOKUP($B461,Data!$A$4:$T$727,10,FALSE))","v":""},{"$f":"IF($B461=\"\",\"\",VLOOKUP($B461,Data!$A$4:$T$727,4,FALSE))","v":""},{"$f":"IF($B461=\"\",\"\",VLOOKUP($B461,Data!$A$4:$T$727,5,FALSE))","v":""},{"$f":"IF($B461=\"\",\"\",VLOOKUP($B461,Data!$A$4:$T$727,7,FALSE))","v":""},"","","","",{"$f":"IF($I$15=\"Show\",VLOOKUP($B461,Data!$A$4:$T$727,9,FALSE),VLOOKUP($B461,Data!$A$4:$T$727,7,FALSE))","v":{"$error":"#N/A"}},{"$f":"IF($B461=\"\",\"\",VLOOKUP($B461,Data!$A$4:$T$727,6,FALSE))","v":""},"",{"$f":"IF($B461=\"\",\"\",IF(VLOOKUP($B461,Data!$A$4:$T$727,11,FALSE)<1,\"\",VLOOKUP(B461,Data!$A$4:$T$727,11,FALSE)))","v":""}]
[null,null,{"$f":"IF($B462=\"\",\"\",VLOOKUP($B462,Data!$A$4:$T$727,2,FALSE))","v":""},{"$f":"IF($B462=\"\",\"\",VLOOKUP($B462,Data!$A$4:$T$727,10,FALSE))","v":""},{"$f":"IF($B462=\"\",\"\",VLOOKUP($B462,Data!$A$4:$T$727,4,FALSE))","v":""},{"$f":"IF($B462=\"\",\"\",VLOOKUP($B462,Data!$A$4:$T$727,5,FALSE))","v":""},{"$f":"IF($B462=\"\",\"\",VLOOKUP($B462,Data!$A$4:$T$727,7,FALSE))","v":""},"","","","",{"$f":"IF($I$15=\"Show\",VLOOKUP($B462,Data!$A$4:$T$727,9,FALSE),VLOOKUP($B462,Data!$A$4:$T$727,7,FALSE))","v":{"$error":"#N/A"}},{"$f":"IF($B462=\"\",\"\",VLOOKUP($B462,Data!$A$4:$T$727,6,FALSE))","v":""},"",{"$f":"IF($B462=\"\",\"\",IF(VLOOKUP($B462,Data!$A$4:$T$727,11,FALSE)<1,\"\",VLOOKUP(B462,Data!$A$4:$T$727,11,FALSE)))","v":""}]
[null,null,{"$f":"IF($B463=\"\",\"\",VLOOKUP($B463,Data!$A$4:$T$727,2,FALSE))","v":""},{"$f":"IF($B463=\"\",\"\",VLOOKUP($B463,Data!$A$4:$T$727,10,FALSE))","v":""},{"$f":"IF($B463=\"\",\"\",VLOOKUP($B463,Data!$A$4:$T$727,4,FALSE))","v":""},{"$f":"IF($B463=\"\",\"\",VLOOKUP($B463,Data!$A$4:$T$727,5,FALSE))","v":""},{"$f":"IF($B463=\"\",\"\",VLOOKUP($B463,Data!$A$4:$T$727,7,FALSE))","v":""},"","","","",{"$f":"IF($I$15=\"Show\",VLOOKUP($B463,Data!$A$4:$T$727,9,FALSE),VLOOKUP($B463,Data!$A$4:$T$727,7,FALSE))","v":{"$error":"#N/A"}},{"$f":"IF($B463=\"\",\"\",VLOOKUP($B463,Data!$A$4:$T$727,6,FALSE))","v":""},"",{"$f":"IF($B463=\"\",\"\",IF(VLOOKUP($B463,Data!$A$4:$T$727,11,FALSE)<1,\"\",VLOOKUP(B463,Data!$A$4:$T$727,11,FALSE)))","v":""}]
[null,null,{"$f":"IF($B464=\"\",\"\",VLOOKUP($B464,Data!$A$4:$T$727,2,FALSE))","v":""},{"$f":"IF($B464=\"\",\"\",VLOOKUP($B464,Data!$A$4:$T$727,10,FALSE))","v":""},{"$f":"IF($B464=\"\",\"\",VLOOKUP($B464,Data!$A$4:$T$727,4,FALSE))","v":""},{"$f":"IF($B464=\"\",\"\",VLOOKUP($B464,Data!$A$4:$T$727,5,FALSE))","v":""},{"$f":"IF($B464=\"\",\"\",VLOOKUP($B464,Data!$A$4:$T$727,7,FALSE))","v":""},"","","","",{"$f":"IF($I$15=\"Show\",VLOOKUP($B464,Data!$A$4:$T$727,9,FALSE),VLOOKUP($B464,Data!$A$4:$T$727,7,FALSE))","v":{"$error":"#N/A"}},{"$f":"IF($B464=\"\",\"\",VLOOKUP($B464,Data!$A$4:$T$727,6,FALSE))","v":""},"",{"$f":"IF($B464=\"\",\"\",IF(VLOOKUP($B464,Data!$A$4:$T$727,11,FALSE)<1,\"\",VLOOKUP(B464,Data!$A$4:$T$727,11,FALSE)))","v":""}]
[null,null,{"$f":"IF($B465=\"\",\"\",VLOOKUP($B465,Data!$A$4:$T$727,2,FALSE))","v":""},{"$f":"IF($B465=\"\",\"\",VLOOKUP($B465,Data!$A$4:$T$727,10,FALSE))","v":""},{"$f":"IF($B465=\"\",\"\",VLOOKUP($B465,Data!$A$4:$T$727,4,FALSE))","v":""},{"$f":"IF($B465=\"\",\"\",VLOOKUP($B465,Data!$A$4:$T$727,5,FALSE))","v":""},{"$f":"IF($B465=\"\",\"\",VLOOKUP($B465,Data!$A$4:$T$727,7,FALSE))","v":""},"","","","",{"$f":"IF($I$15=\"Show\",VLOOKUP($B465,Data!$A$4:$T$727,9,FALSE),VLOOKUP($B465,Data!$A$4:$T$727,7,FALSE))","v":{"$error":"#N/A"}},{"$f":"IF($B465=\"\",\"\",VLOOKUP($B465,Data!$A$4:$T$727,6,FALSE))","v":""},"",{"$f":"IF($B465=\"\",\"\",IF(VLOOKUP($B465,Data!$A$4:$T$727,11,FALSE)<1,\"\",VLOOKUP(B465,Data!$A$4:$T$727,11,FALSE)))","v":""}]
[null,null,{"$f":"IF($B466=\"\",\"\",VLOOKUP($B466,Data!$A$4:$T$727,2,FALSE))","v":""},{"$f":"IF($B466=\"\",\"\",VLOOKUP($B466,Data!$A$4:$T$727,10,FALSE))","v":""},{"$f":"IF($B466=\"\",\"\",VLOOKUP($B466,Data!$A$4:$T$727,4,FALSE))","v":""},{"$f":"IF($B466=\"\",\"\",VLOOKUP($B466,Data!$A$4:$T$727,5,FALSE))","v":""},{"$f":"IF($B466=\"\",\"\",VLOOKUP($B466,Data!$A$4:$T$727,7,FALSE))","v":""},"","","","",{"$f":"IF($I$15=\"Show\",VLOOKUP($B466,Data!$A$4:$T$727,9,FALSE),VLOOKUP($B466,Data!$A$4:$T$727,7,FALSE))","v":{"$error":"#N/A"}},{"$f":"IF($B466=\"\",\"\",VLOOKUP($B466,Data!$A$4:$T$727,6,FALSE))","v":""},"",{"$f":"IF($B466=\"\",\"\",IF(VLOOKUP($B466,Data!$A$4:$T$727,11,FALSE)<1,\"\",VLOOKUP(B466,Data!$A$4:$T$727,11,FALSE)))","v":""}]
[null,null,{"$f":"IF($B467=\"\",\"\",VLOOKUP($B467,Data!$A$4:$T$727,2,FALSE))","v":""},{"$f":"IF($B467=\"\",\"\",VLOOKUP($B467,Data!$A$4:$T$727,10,FALSE))","v":""},{"$f":"IF($B467=\"\",\"\",VLOOKUP($B467,Data!$A$4:$T$727,4,FALSE))","v":""},{"$f":"IF($B467=\"\",\"\",VLOOKUP($B467,Data!$A$4:$T$727,5,FALSE))","v":""},{"$f":"IF($B467=\"\",\"\",VLOOKUP($B467,Data!$A$4:$T$727,7,FALSE))","v":""},"","","","",{"$f":"IF($I$15=\"Show\",VLOOKUP($B467,Data!$A$4:$T$727,9,FALSE),VLOOKUP($B467,Data!$A$4:$T$727,7,FALSE))","v":{"$error":"#N/A"}},{"$f":"IF($B467=\"\",\"\",VLOOKUP($B467,Data!$A$4:$T$727,6,FALSE))","v":""},"",{"$f":"IF($B467=\"\",\"\",IF(VLOOKUP($B467,Data!$A$4:$T$727,11,FALSE)<1,\"\",VLOOKUP(B467,Data!$A$4:$T$727,11,FALSE)))","v":""}]
[null,null,{"$f":"IF($B468=\"\",\"\",VLOOKUP($B468,Data!$A$4:$T$727,2,FALSE))","v":""},{"$f":"IF($B468=\"\",\"\",VLOOKUP($B468,Data!$A$4:$T$727,10,FALSE))","v":""},{"$f":"IF($B468=\"\",\"\",VLOOKUP($B468,Data!$A$4:$T$727,4,FALSE))","v":""},{"$f":"IF($B468=\"\",\"\",VLOOKUP($B468,Data!$A$4:$T$727,5,FALSE))","v":""},{"$f":"IF($B468=\"\",\"\",VLOOKUP($B468,Data!$A$4:$T$727,7,FALSE))","v":""},"","","","",{"$f":"IF($I$15=\"Show\",VLOOKUP($B468,Data!$A$4:$T$727,9,FALSE),VLOOKUP($B468,Data!$A$4:$T$727,7,FALSE))","v":{"$error":"#N/A"}},{"$f":"IF($B468=\"\",\"\",VLOOKUP($B468,Data!$A$4:$T$727,6,FALSE))","v":""},"",{"$f":"IF($B468=\"\",\"\",IF(VLOOKUP($B468,Data!$A$4:$T$727,11,FALSE)<1,\"\",VLOOKUP(B468,Data!$A$4:$T$727,11,FALSE)))","v":""}]
[null,null,{"$f":"IF($B469=\"\",\"\",VLOOKUP($B469,Data!$A$4:$T$727,2,FALSE))","v":""},{"$f":"IF($B469=\"\",\"\",VLOOKUP($B469,Data!$A$4:$T$727,10,FALSE))","v":""},{"$f":"IF($B469=\"\",\"\",VLOOKUP($B469,Data!$A$4:$T$727,4,FALSE))","v":""},{"$f":"IF($B469=\"\",\"\",VLOOKUP($B469,Data!$A$4:$T$727,5,FALSE))","v":""},{"$f":"IF($B469=\"\",\"\",VLOOKUP($B469,Data!$A$4:$T$727,7,FALSE))","v":""},"","","","",{"$f":"IF($I$15=\"Show\",VLOOKUP($B469,Data!$A$4:$T$727,9,FALSE),VLOOKUP($B469,Data!$A$4:$T$727,7,FALSE))","v":{"$error":"#N/A"}},{"$f":"IF($B469=\"\",\"\",VLOOKUP($B469,Data!$A$4:$T$727,6,FALSE))","v":""},"",{"$f":"IF($B469=\"\",\"\",IF(VLOOKUP($B469,Data!$A$4:$T$727,11,FALSE)<1,\"\",VLOOKUP(B469,Data!$A$4:$T$727,11,FALSE)))","v":""}]
[null,null,{"$f":"IF($B470=\"\",\"\",VLOOKUP($B470,Data!$A$4:$T$727,2,FALSE))","v":""},{"$f":"IF($B470=\"\",\"\",VLOOKUP($B470,Data!$A$4:$T$727,10,FALSE))","v":""},{"$f":"IF($B470=\"\",\"\",VLOOKUP($B470,Data!$A$4:$T$727,4,FALSE))","v":""},{"$f":"IF($B470=\"\",\"\",VLOOKUP($B470,Data!$A$4:$T$727,5,FALSE))","v":""},{"$f":"IF($B470=\"\",\"\",VLOOKUP($B470,Data!$A$4:$T$727,7,FALSE))","v":""},{"$f":"IF($B470=\"\",\"\",IF($K$15=\"\",\"\",ROUND($G470*(1-($K$15*0.01)),2)))","v":""},{"$f":"IF($B470=\"\",\"\",IF($G470=$L470,\"\",L470))","v":""},{"$f":"IF($B470=\"\",\"\",IF($H470<$L470,$H470,$L470))","v":""},{"$f":"IF(A470=\"\",\"\",J470*A470)","v":""},{"$f":"IF($I$15=\"Show\",VLOOKUP($B470,Data!$A$4:$T$727,9,FALSE),VLOOKUP($B470,Data!$A$4:$T$727,7,FALSE))","v":{"$error":"#N/A"}},{"$f":"IF($B470=\"\",\"\",VLOOKUP($B470,Data!$A$4:$T$727,6,FALSE))","v":""},{"$f":"IF($A470=\"\",\"\",$A470/$M470)","v":""},{"$f":"IF($B470=\"\",\"\",IF(VLOOKUP($B470,Data!$A$4:$T$727,11,FALSE)<1,\"\",VLOOKUP(B470,Data!$A$4:$T$727,11,FALSE)))","v":""}]
[null,null,{"$f":"IF($B471=\"\",\"\",VLOOKUP($B471,Data!$A$4:$T$727,2,FALSE))","v":""},{"$f":"IF($B471=\"\",\"\",VLOOKUP($B471,Data!$A$4:$T$727,10,FALSE))","v":""},{"$f":"IF($B471=\"\",\"\",VLOOKUP($B471,Data!$A$4:$T$727,4,FALSE))","v":""},{"$f":"IF($B471=\"\",\"\",VLOOKUP($B471,Data!$A$4:$T$727,5,FALSE))","v":""},{"$f":"IF($B471=\"\",\"\",VLOOKUP($B471,Data!$A$4:$T$727,7,FALSE))","v":""},"","","","",{"$f":"IF($I$15=\"Show\",VLOOKUP($B471,Data!$A$4:$T$727,9,FALSE),VLOOKUP($B471,Data!$A$4:$T$727,7,FALSE))","v":{"$error":"#N/A"}},{"$f":"IF($B471=\"\",\"\",VLOOKUP($B471,Data!$A$4:$T$727,6,FALSE))","v":""},"",{"$f":"IF($B471=\"\",\"\",IF(VLOOKUP($B471,Data!$A$4:$T$727,11,FALSE)<1,\"\",VLOOKUP(B471,Data!$A$4:$T$727,11,FALSE)))","v":""}]
[null,null,{"$f":"IF($B472=\"\",\"\",VLOOKUP($B472,Data!$A$4:$T$727,2,FALSE))","v":""},{"$f":"IF($B472=\"\",\"\",VLOOKUP($B472,Data!$A$4:$T$727,10,FALSE))","v":""},{"$f":"IF($B472=\"\",\"\",VLOOKUP($B472,Data!$A$4:$T$727,4,FALSE))","v":""},{"$f":"IF($B472=\"\",\"\",VLOOKUP($B472,Data!$A$4:$T$727,5,FALSE))","v":""},{"$f":"IF($B472=\"\",\"\",VLOOKUP($B472,Data!$A$4:$T$727,7,FALSE))","v":""},"","","","",{"$f":"IF($I$15=\"Show\",VLOOKUP($B472,Data!$A$4:$T$727,9,FALSE),VLOOKUP($B472,Data!$A$4:$T$727,7,FALSE))","v":{"$error":"#N/A"}},{"$f":"IF($B472=\"\",\"\",VLOOKUP($B472,Data!$A$4:$T$727,6,FALSE))","v":""},"",{"$f":"IF($B472=\"\",\"\",IF(VLOOKUP($B472,Data!$A$4:$T$727,11,FALSE)<1,\"\",VLOOKUP(B472,Data!$A$4:$T$727,11,FALSE)))","v":""}]
[null,null,{"$f":"IF($B473=\"\",\"\",VLOOKUP($B473,Data!$A$4:$T$727,2,FALSE))","v":""},{"$f":"IF($B473=\"\",\"\",VLOOKUP($B473,Data!$A$4:$T$727,10,FALSE))","v":""},{"$f":"IF($B473=\"\",\"\",VLOOKUP($B473,Data!$A$4:$T$727,4,FALSE))","v":""},{"$f":"IF($B473=\"\",\"\",VLOOKUP($B473,Data!$A$4:$T$727,5,FALSE))","v":""},{"$f":"IF($B473=\"\",\"\",VLOOKUP($B473,Data!$A$4:$T$727,7,FALSE))","v":""},"","","","",{"$f":"IF($I$15=\"Show\",VLOOKUP($B473,Data!$A$4:$T$727,9,FALSE),VLOOKUP($B473,Data!$A$4:$T$727,7,FALSE))","v":{"$error":"#N/A"}},{"$f":"IF($B473=\"\",\"\",VLOOKUP($B473,Data!$A$4:$T$727,6,FALSE))","v":""},"",{"$f":"IF($B473=\"\",\"\",IF(VLOOKUP($B473,Data!$A$4:$T$727,11,FALSE)<1,\"\",VLOOKUP(B473,Data!$A$4:$T$727,11,FALSE)))","v":""}]
[null,null,{"$f":"IF($B474=\"\",\"\",VLOOKUP($B474,Data!$A$4:$T$727,2,FALSE))","v":""},{"$f":"IF($B474=\"\",\"\",VLOOKUP($B474,Data!$A$4:$T$727,10,FALSE))","v":""},{"$f":"IF($B474=\"\",\"\",VLOOKUP($B474,Data!$A$4:$T$727,4,FALSE))","v":""},{"$f":"IF($B474=\"\",\"\",VLOOKUP($B474,Data!$A$4:$T$727,5,FALSE))","v":""},{"$f":"IF($B474=\"\",\"\",VLOOKUP($B474,Data!$A$4:$T$727,7,FALSE))","v":""},"","","","",{"$f":"IF($I$15=\"Show\",VLOOKUP($B474,Data!$A$4:$T$727,9,FALSE),VLOOKUP($B474,Data!$A$4:$T$727,7,FALSE))","v":{"$error":"#N/A"}},{"$f":"IF($B474=\"\",\"\",VLOOKUP($B474,Data!$A$4:$T$727,6,FALSE))","v":""},"",{"$f":"IF($B474=\"\",\"\",IF(VLOOKUP($B474,Data!$A$4:$T$727,11,FALSE)<1,\"\",VLOOKUP(B474,Data!$A$4:$T$727,11,FALSE)))","v":""}]
[null,null,{"$f":"IF($B475=\"\",\"\",VLOOKUP($B475,Data!$A$4:$T$727,2,FALSE))","v":""},{"$f":"IF($B475=\"\",\"\",VLOOKUP($B475,Data!$A$4:$T$727,10,FALSE))","v":""},{"$f":"IF($B475=\"\",\"\",VLOOKUP($B475,Data!$A$4:$T$727,4,FALSE))","v":""},{"$f":"IF($B475=\"\",\"\",VLOOKUP($B475,Data!$A$4:$T$727,5,FALSE))","v":""},{"$f":"IF($B475=\"\",\"\",VLOOKUP($B475,Data!$A$4:$T$727,7,FALSE))","v":""},"","","","",{"$f":"IF($I$15=\"Show\",VLOOKUP($B475,Data!$A$4:$T$727,9,FALSE),VLOOKUP($B475,Data!$A$4:$T$727,7,FALSE))","v":{"$error":"#N/A"}},{"$f":"IF($B475=\"\",\"\",VLOOKUP($B475,Data!$A$4:$T$727,6,FALSE))","v":""},"",{"$f":"IF($B475=\"\",\"\",IF(VLOOKUP($B475,Data!$A$4:$T$727,11,FALSE)<1,\"\",VLOOKUP(B475,Data!$A$4:$T$727,11,FALSE)))","v":""}]
[null,null,{"$f":"IF($B476=\"\",\"\",VLOOKUP($B476,Data!$A$4:$T$727,2,FALSE))","v":""},{"$f":"IF($B476=\"\",\"\",VLOOKUP($B476,Data!$A$4:$T$727,10,FALSE))","v":""},{"$f":"IF($B476=\"\",\"\",VLOOKUP($B476,Data!$A$4:$T$727,4,FALSE))","v":""},{"$f":"IF($B476=\"\",\"\",VLOOKUP($B476,Data!$A$4:$T$727,5,FALSE))","v":""},{"$f":"IF($B476=\"\",\"\",VLOOKUP($B476,Data!$A$4:$T$727,7,FALSE))","v":""},"","","","",{"$f":"IF($I$15=\"Show\",VLOOKUP($B476,Data!$A$4:$T$727,9,FALSE),VLOOKUP($B476,Data!$A$4:$T$727,7,FALSE))","v":{"$error":"#N/A"}},{"$f":"IF($B476=\"\",\"\",VLOOKUP($B476,Data!$A$4:$T$727,6,FALSE))","v":""},"",{"$f":"IF($B476=\"\",\"\",IF(VLOOKUP($B476,Data!$A$4:$T$727,11,FALSE)<1,\"\",VLOOKUP(B476,Data!$A$4:$T$727,11,FALSE)))","v":""}]
[null,null,{"$f":"IF($B477=\"\",\"\",VLOOKUP($B477,Data!$A$4:$T$727,2,FALSE))","v":""},{"$f":"IF($B477=\"\",\"\",VLOOKUP($B477,Data!$A$4:$T$727,10,FALSE))","v":""},{"$f":"IF($B477=\"\",\"\",VLOOKUP($B477,Data!$A$4:$T$727,4,FALSE))","v":""},{"$f":"IF($B477=\"\",\"\",VLOOKUP($B477,Data!$A$4:$T$727,5,FALSE))","v":""},{"$f":"IF($B477=\"\",\"\",VLOOKUP($B477,Data!$A$4:$T$727,7,FALSE))","v":""},"","","","",{"$f":"IF($I$15=\"Show\",VLOOKUP($B477,Data!$A$4:$T$727,9,FALSE),VLOOKUP($B477,Data!$A$4:$T$727,7,FALSE))","v":{"$error":"#N/A"}},{"$f":"IF($B477=\"\",\"\",VLOOKUP($B477,Data!$A$4:$T$727,6,FALSE))","v":""},"",{"$f":"IF($B477=\"\",\"\",IF(VLOOKUP($B477,Data!$A$4:$T$727,11,FALSE)<1,\"\",VLOOKUP(B477,Data!$A$4:$T$727,11,FALSE)))","v":""}]
[null,null,{"$f":"IF($B478=\"\",\"\",VLOOKUP($B478,Data!$A$4:$T$727,2,FALSE))","v":""},{"$f":"IF($B478=\"\",\"\",VLOOKUP($B478,Data!$A$4:$T$727,10,FALSE))","v":""},{"$f":"IF($B478=\"\",\"\",VLOOKUP($B478,Data!$A$4:$T$727,4,FALSE))","v":""},{"$f":"IF($B478=\"\",\"\",VLOOKUP($B478,Data!$A$4:$T$727,5,FALSE))","v":""},{"$f":"IF($B478=\"\",\"\",VLOOKUP($B478,Data!$A$4:$T$727,7,FALSE))","v":""},"","","","",{"$f":"IF($I$15=\"Show\",VLOOKUP($B478,Data!$A$4:$T$727,9,FALSE),VLOOKUP($B478,Data!$A$4:$T$727,7,FALSE))","v":{"$error":"#N/A"}},{"$f":"IF($B478=\"\",\"\",VLOOKUP($B478,Data!$A$4:$T$727,6,FALSE))","v":""},"",{"$f":"IF($B478=\"\",\"\",IF(VLOOKUP($B478,Data!$A$4:$T$727,11,FALSE)<1,\"\",VLOOKUP(B478,Data!$A$4:$T$727,11,FALSE)))","v":""}]
[null,null,{"$f":"IF($B479=\"\",\"\",VLOOKUP($B479,Data!$A$4:$T$727,2,FALSE))","v":""},{"$f":"IF($B479=\"\",\"\",VLOOKUP($B479,Data!$A$4:$T$727,10,FALSE))","v":""},{"$f":"IF($B479=\"\",\"\",VLOOKUP($B479,Data!$A$4:$T$727,4,FALSE))","v":""},{"$f":"IF($B479=\"\",\"\",VLOOKUP($B479,Data!$A$4:$T$727,5,FALSE))","v":""},{"$f":"IF($B479=\"\",\"\",VLOOKUP($B479,Data!$A$4:$T$727,7,FALSE))","v":""},"","","","",{"$f":"IF($I$15=\"Show\",VLOOKUP($B479,Data!$A$4:$T$727,9,FALSE),VLOOKUP($B479,Data!$A$4:$T$727,7,FALSE))","v":{"$error":"#N/A"}},{"$f":"IF($B479=\"\",\"\",VLOOKUP($B479,Data!$A$4:$T$727,6,FALSE))","v":""},"",{"$f":"IF($B479=\"\",\"\",IF(VLOOKUP($B479,Data!$A$4:$T$727,11,FALSE)<1,\"\",VLOOKUP(B479,Data!$A$4:$T$727,11,FALSE)))","v":""}]
[null,null,{"$f":"IF($B480=\"\",\"\",VLOOKUP($B480,Data!$A$4:$T$727,2,FALSE))","v":""},{"$f":"IF($B480=\"\",\"\",VLOOKUP($B480,Data!$A$4:$T$727,10,FALSE))","v":""},{"$f":"IF($B480=\"\",\"\",VLOOKUP($B480,Data!$A$4:$T$727,4,FALSE))","v":""},{"$f":"IF($B480=\"\",\"\",VLOOKUP($B480,Data!$A$4:$T$727,5,FALSE))","v":""},{"$f":"IF($B480=\"\",\"\",VLOOKUP($B480,Data!$A$4:$T$727,7,FALSE))","v":""},"","","","",{"$f":"IF($I$15=\"Show\",VLOOKUP($B480,Data!$A$4:$T$727,9,FALSE),VLOOKUP($B480,Data!$A$4:$T$727,7,FALSE))","v":{"$error":"#N/A"}},{"$f":"IF($B480=\"\",\"\",VLOOKUP($B480,Data!$A$4:$T$727,6,FALSE))","v":""},"",{"$f":"IF($B480=\"\",\"\",IF(VLOOKUP($B480,Data!$A$4:$T$727,11,FALSE)<1,\"\",VLOOKUP(B480,Data!$A$4:$T$727,11,FALSE)))","v":""}]
[null,null,{"$f":"IF($B481=\"\",\"\",VLOOKUP($B481,Data!$A$4:$T$727,2,FALSE))","v":""},{"$f":"IF($B481=\"\",\"\",VLOOKUP($B481,Data!$A$4:$T$727,10,FALSE))","v":""},{"$f":"IF($B481=\"\",\"\",VLOOKUP($B481,Data!$A$4:$T$727,4,FALSE))","v":""},{"$f":"IF($B481=\"\",\"\",VLOOKUP($B481,Data!$A$4:$T$727,5,FALSE))","v":""},{"$f":"IF($B481=\"\",\"\",VLOOKUP($B481,Data!$A$4:$T$727,7,FALSE))","v":""},"","","","",{"$f":"IF($I$15=\"Show\",VLOOKUP($B481,Data!$A$4:$T$727,9,FALSE),VLOOKUP($B481,Data!$A$4:$T$727,7,FALSE))","v":{"$error":"#N/A"}},{"$f":"IF($B481=\"\",\"\",VLOOKUP($B481,Data!$A$4:$T$727,6,FALSE))","v":""},"",{"$f":"IF($B481=\"\",\"\",IF(VLOOKUP($B481,Data!$A$4:$T$727,11,FALSE)<1,\"\",VLOOKUP(B481,Data!$A$4:$T$727,11,FALSE)))","v":""}]
[null,null,{"$f":"IF($B482=\"\",\"\",VLOOKUP($B482,Data!$A$4:$T$727,2,FALSE))","v":""},{"$f":"IF($B482=\"\",\"\",VLOOKUP($B482,Data!$A$4:$T$727,10,FALSE))","v":""},{"$f":"IF($B482=\"\",\"\",VLOOKUP($B482,Data!$A$4:$T$727,4,FALSE))","v":""},{"$f":"IF($B482=\"\",\"\",VLOOKUP($B482,Data!$A$4:$T$727,5,FALSE))","v":""},{"$f":"IF($B482=\"\",\"\",VLOOKUP($B482,Data!$A$4:$T$727,7,FALSE))","v":""},"","","","",{"$f":"IF($I$15=\"Show\",VLOOKUP($B482,Data!$A$4:$T$727,9,FALSE),VLOOKUP($B482,Data!$A$4:$T$727,7,FALSE))","v":{"$error":"#N/A"}},{"$f":"IF($B482=\"\",\"\",VLOOKUP($B482,Data!$A$4:$T$727,6,FALSE))","v":""},"",{"$f":"IF($B482=\"\",\"\",IF(VLOOKUP($B482,Data!$A$4:$T$727,11,FALSE)<1,\"\",VLOOKUP(B482,Data!$A$4:$T$727,11,FALSE)))","v":""}]
[null,null,{"$f":"IF($B483=\"\",\"\",VLOOKUP($B483,Data!$A$4:$T$727,2,FALSE))","v":""},{"$f":"IF($B483=\"\",\"\",VLOOKUP($B483,Data!$A$4:$T$727,10,FALSE))","v":""},{"$f":"IF($B483=\"\",\"\",VLOOKUP($B483,Data!$A$4:$T$727,4,FALSE))","v":""},{"$f":"IF($B483=\"\",\"\",VLOOKUP($B483,Data!$A$4:$T$727,5,FALSE))","v":""},{"$f":"IF($B483=\"\",\"\",VLOOKUP($B483,Data!$A$4:$T$727,7,FALSE))","v":""},"","","","",{"$f":"IF($I$15=\"Show\",VLOOKUP($B483,Data!$A$4:$T$727,9,FALSE),VLOOKUP($B483,Data!$A$4:$T$727,7,FALSE))","v":{"$error":"#N/A"}},{"$f":"IF($B483=\"\",\"\",VLOOKUP($B483,Data!$A$4:$T$727,6,FALSE))","v":""},"",{"$f":"IF($B483=\"\",\"\",IF(VLOOKUP($B483,Data!$A$4:$T$727,11,FALSE)<1,\"\",VLOOKUP(B483,Data!$A$4:$T$727,11,FALSE)))","v":""}]
[null,null,{"$f":"IF($B484=\"\",\"\",VLOOKUP($B484,Data!$A$4:$T$727,2,FALSE))","v":""},{"$f":"IF($B484=\"\",\"\",VLOOKUP($B484,Data!$A$4:$T$727,10,FALSE))","v":""},{"$f":"IF($B484=\"\",\"\",VLOOKUP($B484,Data!$A$4:$T$727,4,FALSE))","v":""},{"$f":"IF($B484=\"\",\"\",VLOOKUP($B484,Data!$A$4:$T$727,5,FALSE))","v":""},{"$f":"IF($B484=\"\",\"\",VLOOKUP($B484,Data!$A$4:$T$727,7,FALSE))","v":""},"","","","",{"$f":"IF($I$15=\"Show\",VLOOKUP($B484,Data!$A$4:$T$727,9,FALSE),VLOOKUP($B484,Data!$A$4:$T$727,7,FALSE))","v":{"$error":"#N/A"}},{"$f":"IF($B484=\"\",\"\",VLOOKUP($B484,Data!$A$4:$T$727,6,FALSE))","v":""},"",{"$f":"IF($B484=\"\",\"\",IF(VLOOKUP($B484,Data!$A$4:$T$727,11,FALSE)<1,\"\",VLOOKUP(B484,Data!$A$4:$T$727,11,FALSE)))","v":""}]
[null,null,{"$f":"IF($B485=\"\",\"\",VLOOKUP($B485,Data!$A$4:$T$727,2,FALSE))","v":""},{"$f":"IF($B485=\"\",\"\",VLOOKUP($B485,Data!$A$4:$T$727,10,FALSE))","v":""},{"$f":"IF($B485=\"\",\"\",VLOOKUP($B485,Data!$A$4:$T$727,4,FALSE))","v":""},{"$f":"IF($B485=\"\",\"\",VLOOKUP($B485,Data!$A$4:$T$727,5,FALSE))","v":""},{"$f":"IF($B485=\"\",\"\",VLOOKUP($B485,Data!$A$4:$T$727,7,FALSE))","v":""},"","","","",{"$f":"IF($I$15=\"Show\",VLOOKUP($B485,Data!$A$4:$T$727,9,FALSE),VLOOKUP($B485,Data!$A$4:$T$727,7,FALSE))","v":{"$error":"#N/A"}},{"$f":"IF($B485=\"\",\"\",VLOOKUP($B485,Data!$A$4:$T$727,6,FALSE))","v":""},"",{"$f":"IF($B485=\"\",\"\",IF(VLOOKUP($B485,Data!$A$4:$T$727,11,FALSE)<1,\"\",VLOOKUP(B485,Data!$A$4:$T$727,11,FALSE)))","v":""}]
[null,null,{"$f":"IF($B486=\"\",\"\",VLOOKUP($B486,Data!$A$4:$T$727,2,FALSE))","v":""},{"$f":"IF($B486=\"\",\"\",VLOOKUP($B486,Data!$A$4:$T$727,10,FALSE))","v":""},{"$f":"IF($B486=\"\",\"\",VLOOKUP($B486,Data!$A$4:$T$727,4,FALSE))","v":""},{"$f":"IF($B486=\"\",\"\",VLOOKUP($B486,Data!$A$4:$T$727,5,FALSE))","v":""},{"$f":"IF($B486=\"\",\"\",VLOOKUP($B486,Data!$A$4:$T$727,7,FALSE))","v":""},"","","","",{"$f":"IF($I$15=\"Show\",VLOOKUP($B486,Data!$A$4:$T$727,9,FALSE),VLOOKUP($B486,Data!$A$4:$T$727,7,FALSE))","v":{"$error":"#N/A"}},{"$f":"IF($B486=\"\",\"\",VLOOKUP($B486,Data!$A$4:$T$727,6,FALSE))","v":""},"",{"$f":"IF($B486=\"\",\"\",IF(VLOOKUP($B486,Data!$A$4:$T$727,11,FALSE)<1,\"\",VLOOKUP(B486,Data!$A$4:$T$727,11,FALSE)))","v":""}]
[null,null,{"$f":"IF($B487=\"\",\"\",VLOOKUP($B487,Data!$A$4:$T$727,2,FALSE))","v":""},{"$f":"IF($B487=\"\",\"\",VLOOKUP($B487,Data!$A$4:$T$727,10,FALSE))","v":""},{"$f":"IF($B487=\"\",\"\",VLOOKUP($B487,Data!$A$4:$T$727,4,FALSE))","v":""},{"$f":"IF($B487=\"\",\"\",VLOOKUP($B487,Data!$A$4:$T$727,5,FALSE))","v":""},{"$f":"IF($B487=\"\",\"\",VLOOKUP($B487,Data!$A$4:$T$727,7,FALSE))","v":""},"","","","",{"$f":"IF($I$15=\"Show\",VLOOKUP($B487,Data!$A$4:$T$727,9,FALSE),VLOOKUP($B487,Data!$A$4:$T$727,7,FALSE))","v":{"$error":"#N/A"}},{"$f":"IF($B487=\"\",\"\",VLOOKUP($B487,Data!$A$4:$T$727,6,FALSE))","v":""},"",{"$f":"IF($B487=\"\",\"\",IF(VLOOKUP($B487,Data!$A$4:$T$727,11,FALSE)<1,\"\",VLOOKUP(B487,Data!$A$4:$T$727,11,FALSE)))","v":""}]
[null,null,{"$f":"IF($B488=\"\",\"\",VLOOKUP($B488,Data!$A$4:$T$727,2,FALSE))","v":""},{"$f":"IF($B488=\"\",\"\",VLOOKUP($B488,Data!$A$4:$T$727,10,FALSE))","v":""},{"$f":"IF($B488=\"\",\"\",VLOOKUP($B488,Data!$A$4:$T$727,4,FALSE))","v":""},{"$f":"IF($B488=\"\",\"\",VLOOKUP($B488,Data!$A$4:$T$727,5,FALSE))","v":""},{"$f":"IF($B488=\"\",\"\",VLOOKUP($B488,Data!$A$4:$T$727,7,FALSE))","v":""},"","","","",{"$f":"IF($I$15=\"Show\",VLOOKUP($B488,Data!$A$4:$T$727,9,FALSE),VLOOKUP($B488,Data!$A$4:$T$727,7,FALSE))","v":{"$error":"#N/A"}},{"$f":"IF($B488=\"\",\"\",VLOOKUP($B488,Data!$A$4:$T$727,6,FALSE))","v":""},"",{"$f":"IF($B488=\"\",\"\",IF(VLOOKUP($B488,Data!$A$4:$T$727,11,FALSE)<1,\"\",VLOOKUP(B488,Data!$A$4:$T$727,11,FALSE)))","v":""}]
[null,null,{"$f":"IF($B489=\"\",\"\",VLOOKUP($B489,Data!$A$4:$T$727,2,FALSE))","v":""},{"$f":"IF($B489=\"\",\"\",VLOOKUP($B489,Data!$A$4:$T$727,10,FALSE))","v":""},{"$f":"IF($B489=\"\",\"\",VLOOKUP($B489,Data!$A$4:$T$727,4,FALSE))","v":""},{"$f":"IF($B489=\"\",\"\",VLOOKUP($B489,Data!$A$4:$T$727,5,FALSE))","v":""},{"$f":"IF($B489=\"\",\"\",VLOOKUP($B489,Data!$A$4:$T$727,7,FALSE))","v":""},"","","","",{"$f":"IF($I$15=\"Show\",VLOOKUP($B489,Data!$A$4:$T$727,9,FALSE),VLOOKUP($B489,Data!$A$4:$T$727,7,FALSE))","v":{"$error":"#N/A"}},{"$f":"IF($B489=\"\",\"\",VLOOKUP($B489,Data!$A$4:$T$727,6,FALSE))","v":""},"",{"$f":"IF($B489=\"\",\"\",IF(VLOOKUP($B489,Data!$A$4:$T$727,11,FALSE)<1,\"\",VLOOKUP(B489,Data!$A$4:$T$727,11,FALSE)))","v":""}]
[null,null,{"$f":"IF($B490=\"\",\"\",VLOOKUP($B490,Data!$A$4:$T$727,2,FALSE))","v":""},{"$f":"IF($B490=\"\",\"\",VLOOKUP($B490,Data!$A$4:$T$727,10,FALSE))","v":""},{"$f":"IF($B490=\"\",\"\",VLOOKUP($B490,Data!$A$4:$T$727,4,FALSE))","v":""},{"$f":"IF($B490=\"\",\"\",VLOOKUP($B490,Data!$A$4:$T$727,5,FALSE))","v":""},{"$f":"IF($B490=\"\",\"\",VLOOKUP($B490,Data!$A$4:$T$727,7,FALSE))","v":""},"","","","",{"$f":"IF($I$15=\"Show\",VLOOKUP($B490,Data!$A$4:$T$727,9,FALSE),VLOOKUP($B490,Data!$A$4:$T$727,7,FALSE))","v":{"$error":"#N/A"}},{"$f":"IF($B490=\"\",\"\",VLOOKUP($B490,Data!$A$4:$T$727,6,FALSE))","v":""},"",{"$f":"IF($B490=\"\",\"\",IF(VLOOKUP($B490,Data!$A$4:$T$727,11,FALSE)<1,\"\",VLOOKUP(B490,Data!$A$4:$T$727,11,FALSE)))","v":""}]
[null,null,{"$f":"IF($B491=\"\",\"\",VLOOKUP($B491,Data!$A$4:$T$727,2,FALSE))","v":""},{"$f":"IF($B491=\"\",\"\",VLOOKUP($B491,Data!$A$4:$T$727,10,FALSE))","v":""},{"$f":"IF($B491=\"\",\"\",VLOOKUP($B491,Data!$A$4:$T$727,4,FALSE))","v":""},{"$f":"IF($B491=\"\",\"\",VLOOKUP($B491,Data!$A$4:$T$727,5,FALSE))","v":""},{"$f":"IF($B491=\"\",\"\",VLOOKUP($B491,Data!$A$4:$T$727,7,FALSE))","v":""},"","","","",{"$f":"IF($I$15=\"Show\",VLOOKUP($B491,Data!$A$4:$T$727,9,FALSE),VLOOKUP($B491,Data!$A$4:$T$727,7,FALSE))","v":{"$error":"#N/A"}},{"$f":"IF($B491=\"\",\"\",VLOOKUP($B491,Data!$A$4:$T$727,6,FALSE))","v":""},"",{"$f":"IF($B491=\"\",\"\",IF(VLOOKUP($B491,Data!$A$4:$T$727,11,FALSE)<1,\"\",VLOOKUP(B491,Data!$A$4:$T$727,11,FALSE)))","v":""}]
[null,null,{"$f":"IF($B492=\"\",\"\",VLOOKUP($B492,Data!$A$4:$T$727,2,FALSE))","v":""},{"$f":"IF($B492=\"\",\"\",VLOOKUP($B492,Data!$A$4:$T$727,10,FALSE))","v":""},{"$f":"IF($B492=\"\",\"\",VLOOKUP($B492,Data!$A$4:$T$727,4,FALSE))","v":""},{"$f":"IF($B492=\"\",\"\",VLOOKUP($B492,Data!$A$4:$T$727,5,FALSE))","v":""},{"$f":"IF($B492=\"\",\"\",VLOOKUP($B492,Data!$A$4:$T$727,7,FALSE))","v":""},"","","","",{"$f":"IF($I$15=\"Show\",VLOOKUP($B492,Data!$A$4:$T$727,9,FALSE),VLOOKUP($B492,Data!$A$4:$T$727,7,FALSE))","v":{"$error":"#N/A"}},{"$f":"IF($B492=\"\",\"\",VLOOKUP($B492,Data!$A$4:$T$727,6,FALSE))","v":""},"",{"$f":"IF($B492=\"\",\"\",IF(VLOOKUP($B492,Data!$A$4:$T$727,11,FALSE)<1,\"\",VLOOKUP(B492,Data!$A$4:$T$727,11,FALSE)))","v":""}]
[null,null,{"$f":"IF($B493=\"\",\"\",VLOOKUP($B493,Data!$A$4:$T$727,2,FALSE))","v":""},{"$f":"IF($B493=\"\",\"\",VLOOKUP($B493,Data!$A$4:$T$727,10,FALSE))","v":""},{"$f":"IF($B493=\"\",\"\",VLOOKUP($B493,Data!$A$4:$T$727,4,FALSE))","v":""},{"$f":"IF($B493=\"\",\"\",VLOOKUP($B493,Data!$A$4:$T$727,5,FALSE))","v":""},{"$f":"IF($B493=\"\",\"\",VLOOKUP($B493,Data!$A$4:$T$727,7,FALSE))","v":""},"","","","",{"$f":"IF($I$15=\"Show\",VLOOKUP($B493,Data!$A$4:$T$727,9,FALSE),VLOOKUP($B493,Data!$A$4:$T$727,7,FALSE))","v":{"$error":"#N/A"}},{"$f":"IF($B493=\"\",\"\",VLOOKUP($B493,Data!$A$4:$T$727,6,FALSE))","v":""},"",{"$f":"IF($B493=\"\",\"\",IF(VLOOKUP($B493,Data!$A$4:$T$727,11,FALSE)<1,\"\",VLOOKUP(B493,Data!$A$4:$T$727,11,FALSE)))","v":""}]
[null,null,{"$f":"IF($B494=\"\",\"\",VLOOKUP($B494,Data!$A$4:$T$727,2,FALSE))","v":""},{"$f":"IF($B494=\"\",\"\",VLOOKUP($B494,Data!$A$4:$T$727,10,FALSE))","v":""},{"$f":"IF($B494=\"\",\"\",VLOOKUP($B494,Data!$A$4:$T$727,4,FALSE))","v":""},{"$f":"IF($B494=\"\",\"\",VLOOKUP($B494,Data!$A$4:$T$727,5,FALSE))","v":""},{"$f":"IF($B494=\"\",\"\",VLOOKUP($B494,Data!$A$4:$T$727,7,FALSE))","v":""},"","","","",{"$f":"IF($I$15=\"Show\",VLOOKUP($B494,Data!$A$4:$T$727,9,FALSE),VLOOKUP($B494,Data!$A$4:$T$727,7,FALSE))","v":{"$error":"#N/A"}},{"$f":"IF($B494=\"\",\"\",VLOOKUP($B494,Data!$A$4:$T$727,6,FALSE))","v":""},"",{"$f":"IF($B494=\"\",\"\",IF(VLOOKUP($B494,Data!$A$4:$T$727,11,FALSE)<1,\"\",VLOOKUP(B494,Data!$A$4:$T$727,11,FALSE)))","v":""}]
[null,null,{"$f":"IF($B495=\"\",\"\",VLOOKUP($B495,Data!$A$4:$T$727,2,FALSE))","v":""},{"$f":"IF($B495=\"\",\"\",VLOOKUP($B495,Data!$A$4:$T$727,10,FALSE))","v":""},{"$f":"IF($B495=\"\",\"\",VLOOKUP($B495,Data!$A$4:$T$727,4,FALSE))","v":""},{"$f":"IF($B495=\"\",\"\",VLOOKUP($B495,Data!$A$4:$T$727,5,FALSE))","v":""},{"$f":"IF($B495=\"\",\"\",VLOOKUP($B495,Data!$A$4:$T$727,7,FALSE))","v":""},"","","","",{"$f":"IF($I$15=\"Show\",VLOOKUP($B495,Data!$A$4:$T$727,9,FALSE),VLOOKUP($B495,Data!$A$4:$T$727,7,FALSE))","v":{"$error":"#N/A"}},{"$f":"IF($B495=\"\",\"\",VLOOKUP($B495,Data!$A$4:$T$727,6,FALSE))","v":""},"",{"$f":"IF($B495=\"\",\"\",IF(VLOOKUP($B495,Data!$A$4:$T$727,11,FALSE)<1,\"\",VLOOKUP(B495,Data!$A$4:$T$727,11,FALSE)))","v":""}]
[null,null,{"$f":"IF($B496=\"\",\"\",VLOOKUP($B496,Data!$A$4:$T$727,2,FALSE))","v":""},{"$f":"IF($B496=\"\",\"\",VLOOKUP($B496,Data!$A$4:$T$727,10,FALSE))","v":""},{"$f":"IF($B496=\"\",\"\",VLOOKUP($B496,Data!$A$4:$T$727,4,FALSE))","v":""},{"$f":"IF($B496=\"\",\"\",VLOOKUP($B496,Data!$A$4:$T$727,5,FALSE))","v":""},{"$f":"IF($B496=\"\",\"\",VLOOKUP($B496,Data!$A$4:$T$727,7,FALSE))","v":""},"","","","",{"$f":"IF($I$15=\"Show\",VLOOKUP($B496,Data!$A$4:$T$727,9,FALSE),VLOOKUP($B496,Data!$A$4:$T$727,7,FALSE))","v":{"$error":"#N/A"}},{"$f":"IF($B496=\"\",\"\",VLOOKUP($B496,Data!$A$4:$T$727,6,FALSE))","v":""},"",{"$f":"IF($B496=\"\",\"\",IF(VLOOKUP($B496,Data!$A$4:$T$727,11,FALSE)<1,\"\",VLOOKUP(B496,Data!$A$4:$T$727,11,FALSE)))","v":""}]
[null,null,{"$f":"IF($B497=\"\",\"\",VLOOKUP($B497,Data!$A$4:$T$727,2,FALSE))","v":""},{"$f":"IF($B497=\"\",\"\",VLOOKUP($B497,Data!$A$4:$T$727,10,FALSE))","v":""},{"$f":"IF($B497=\"\",\"\",VLOOKUP($B497,Data!$A$4:$T$727,4,FALSE))","v":""},{"$f":"IF($B497=\"\",\"\",VLOOKUP($B497,Data!$A$4:$T$727,5,FALSE))","v":""},{"$f":"IF($B497=\"\",\"\",VLOOKUP($B497,Data!$A$4:$T$727,7,FALSE))","v":""},"","","","",{"$f":"IF($I$15=\"Show\",VLOOKUP($B497,Data!$A$4:$T$727,9,FALSE),VLOOKUP($B497,Data!$A$4:$T$727,7,FALSE))","v":{"$error":"#N/A"}},{"$f":"IF($B497=\"\",\"\",VLOOKUP($B497,Data!$A$4:$T$727,6,FALSE))","v":""},"",{"$f":"IF($B497=\"\",\"\",IF(VLOOKUP($B497,Data!$A$4:$T$727,11,FALSE)<1,\"\",VLOOKUP(B497,Data!$A$4:$T$727,11,FALSE)))","v":""}]
[null,null,{"$f":"IF($B498=\"\",\"\",VLOOKUP($B498,Data!$A$4:$T$727,2,FALSE))","v":""},{"$f":"IF($B498=\"\",\"\",VLOOKUP($B498,Data!$A$4:$T$727,10,FALSE))","v":""},{"$f":"IF($B498=\"\",\"\",VLOOKUP($B498,Data!$A$4:$T$727,4,FALSE))","v":""},{"$f":"IF($B498=\"\",\"\",VLOOKUP($B498,Data!$A$4:$T$727,5,FALSE))","v":""},{"$f":"IF($B498=\"\",\"\",VLOOKUP($B498,Data!$A$4:$T$727,7,FALSE))","v":""},"","","","",{"$f":"IF($I$15=\"Show\",VLOOKUP($B498,Data!$A$4:$T$727,9,FALSE),VLOOKUP($B498,Data!$A$4:$T$727,7,FALSE))","v":{"$error":"#N/A"}},{"$f":"IF($B498=\"\",\"\",VLOOKUP($B498,Data!$A$4:$T$727,6,FALSE))","v":""},"",{"$f":"IF($B498=\"\",\"\",IF(VLOOKUP($B498,Data!$A$4:$T$727,11,FALSE)<1,\"\",VLOOKUP(B498,Data!$A$4:$T$727,11,FALSE)))","v":""}]
[null,null,{"$f":"IF($B499=\"\",\"\",VLOOKUP($B499,Data!$A$4:$T$727,2,FALSE))","v":""},{"$f":"IF($B499=\"\",\"\",VLOOKUP($B499,Data!$A$4:$T$727,10,FALSE))","v":""},{"$f":"IF($B499=\"\",\"\",VLOOKUP($B499,Data!$A$4:$T$727,4,FALSE))","v":""},{"$f":"IF($B499=\"\",\"\",VLOOKUP($B499,Data!$A$4:$T$727,5,FALSE))","v":""},{"$f":"IF($B499=\"\",\"\",VLOOKUP($B499,Data!$A$4:$T$727,7,FALSE))","v":""},"","","","",{"$f":"IF($I$15=\"Show\",VLOOKUP($B499,Data!$A$4:$T$727,9,FALSE),VLOOKUP($B499,Data!$A$4:$T$727,7,FALSE))","v":{"$error":"#N/A"}},{"$f":"IF($B499=\"\",\"\",VLOOKUP($B499,Data!$A$4:$T$727,6,FALSE))","v":""},"",{"$f":"IF($B499=\"\",\"\",IF(VLOOKUP($B499,Data!$A$4:$T$727,11,FALSE)<1,\"\",VLOOKUP(B499,Data!$A$4:$T$727,11,FALSE)))","v":""}]
[null,null,{"$f":"IF($B500=\"\",\"\",VLOOKUP($B500,Data!$A$4:$T$727,2,FALSE))","v":""},{"$f":"IF($B500=\"\",\"\",VLOOKUP($B500,Data!$A$4:$T$727,10,FALSE))","v":""},{"$f":"IF($B500=\"\",\"\",VLOOKUP($B500,Data!$A$4:$T$727,4,FALSE))","v":""},{"$f":"IF($B500=\"\",\"\",VLOOKUP($B500,Data!$A$4:$T$727,5,FALSE))","v":""},{"$f":"IF($B500=\"\",\"\",VLOOKUP($B500,Data!$A$4:$T$727,7,FALSE))","v":""},"","","","",{"$f":"IF($I$15=\"Show\",VLOOKUP($B500,Data!$A$4:$T$727,9,FALSE),VLOOKUP($B500,Data!$A$4:$T$727,7,FALSE))","v":{"$error":"#N/A"}},{"$f":"IF($B500=\"\",\"\",VLOOKUP($B500,Data!$A$4:$T$727,6,FALSE))","v":""},"",{"$f":"IF($B500=\"\",\"\",IF(VLOOKUP($B500,Data!$A$4:$T$727,11,FALSE)<1,\"\",VLOOKUP(B500,Data!$A$4:$T$727,11,FALSE)))","v":""}]
[null,null,{"$f":"IF($B501=\"\",\"\",VLOOKUP($B501,Data!$A$4:$T$727,2,FALSE))","v":""},{"$f":"IF($B501=\"\",\"\",VLOOKUP($B501,Data!$A$4:$T$727,10,FALSE))","v":""},{"$f":"IF($B501=\"\",\"\",VLOOKUP($B501,Data!$A$4:$T$727,4,FALSE))","v":""},{"$f":"IF($B501=\"\",\"\",VLOOKUP($B501,Data!$A$4:$T$727,5,FALSE))","v":""},{"$f":"IF($B501=\"\",\"\",VLOOKUP($B501,Data!$A$4:$T$727,7,FALSE))","v":""},"","","","",{"$f":"IF($I$15=\"Show\",VLOOKUP($B501,Data!$A$4:$T$727,9,FALSE),VLOOKUP($B501,Data!$A$4:$T$727,7,FALSE))","v":{"$error":"#N/A"}},{"$f":"IF($B501=\"\",\"\",VLOOKUP($B501,Data!$A$4:$T$727,6,FALSE))","v":""},"",{"$f":"IF($B501=\"\",\"\",IF(VLOOKUP($B501,Data!$A$4:$T$727,11,FALSE)<1,\"\",VLOOKUP(B501,Data!$A$4:$T$727,11,FALSE)))","v":""}]
[null,null,{"$f":"IF($B502=\"\",\"\",VLOOKUP($B502,Data!$A$4:$T$727,2,FALSE))","v":""},{"$f":"IF($B502=\"\",\"\",VLOOKUP($B502,Data!$A$4:$T$727,10,FALSE))","v":""},{"$f":"IF($B502=\"\",\"\",VLOOKUP($B502,Data!$A$4:$T$727,4,FALSE))","v":""},{"$f":"IF($B502=\"\",\"\",VLOOKUP($B502,Data!$A$4:$T$727,5,FALSE))","v":""},{"$f":"IF($B502=\"\",\"\",VLOOKUP($B502,Data!$A$4:$T$727,7,FALSE))","v":""},"","","","",{"$f":"IF($I$15=\"Show\",VLOOKUP($B502,Data!$A$4:$T$727,9,FALSE),VLOOKUP($B502,Data!$A$4:$T$727,7,FALSE))","v":{"$error":"#N/A"}},{"$f":"IF($B502=\"\",\"\",VLOOKUP($B502,Data!$A$4:$T$727,6,FALSE))","v":""},"",{"$f":"IF($B502=\"\",\"\",IF(VLOOKUP($B502,Data!$A$4:$T$727,11,FALSE)<1,\"\",VLOOKUP(B502,Data!$A$4:$T$727,11,FALSE)))","v":""}]
[null,null,{"$f":"IF($B503=\"\",\"\",VLOOKUP($B503,Data!$A$4:$T$727,2,FALSE))","v":""},{"$f":"IF($B503=\"\",\"\",VLOOKUP($B503,Data!$A$4:$T$727,10,FALSE))","v":""},{"$f":"IF($B503=\"\",\"\",VLOOKUP($B503,Data!$A$4:$T$727,4,FALSE))","v":""},{"$f":"IF($B503=\"\",\"\",VLOOKUP($B503,Data!$A$4:$T$727,5,FALSE))","v":""},{"$f":"IF($B503=\"\",\"\",VLOOKUP($B503,Data!$A$4:$T$727,7,FALSE))","v":""},"","","","",{"$f":"IF($I$15=\"Show\",VLOOKUP($B503,Data!$A$4:$T$727,9,FALSE),VLOOKUP($B503,Data!$A$4:$T$727,7,FALSE))","v":{"$error":"#N/A"}},{"$f":"IF($B503=\"\",\"\",VLOOKUP($B503,Data!$A$4:$T$727,6,FALSE))","v":""},"",{"$f":"IF($B503=\"\",\"\",IF(VLOOKUP($B503,Data!$A$4:$T$727,11,FALSE)<1,\"\",VLOOKUP(B503,Data!$A$4:$T$727,11,FALSE)))","v":""}]
[null,null,{"$f":"IF($B504=\"\",\"\",VLOOKUP($B504,Data!$A$4:$T$727,2,FALSE))","v":""},{"$f":"IF($B504=\"\",\"\",VLOOKUP($B504,Data!$A$4:$T$727,10,FALSE))","v":""},{"$f":"IF($B504=\"\",\"\",VLOOKUP($B504,Data!$A$4:$T$727,4,FALSE))","v":""},{"$f":"IF($B504=\"\",\"\",VLOOKUP($B504,Data!$A$4:$T$727,5,FALSE))","v":""},{"$f":"IF($B504=\"\",\"\",VLOOKUP($B504,Data!$A$4:$T$727,7,FALSE))","v":""},"","","","",{"$f":"IF($I$15=\"Show\",VLOOKUP($B504,Data!$A$4:$T$727,9,FALSE),VLOOKUP($B504,Data!$A$4:$T$727,7,FALSE))","v":{"$error":"#N/A"}},{"$f":"IF($B504=\"\",\"\",VLOOKUP($B504,Data!$A$4:$T$727,6,FALSE))","v":""},"",{"$f":"IF($B504=\"\",\"\",IF(VLOOKUP($B504,Data!$A$4:$T$727,11,FALSE)<1,\"\",VLOOKUP(B504,Data!$A$4:$T$727,11,FALSE)))","v":""}]
[null,null,{"$f":"IF($B505=\"\",\"\",VLOOKUP($B505,Data!$A$4:$T$727,2,FALSE))","v":""},{"$f":"IF($B505=\"\",\"\",VLOOKUP($B505,Data!$A$4:$T$727,10,FALSE))","v":""},{"$f":"IF($B505=\"\",\"\",VLOOKUP($B505,Data!$A$4:$T$727,4,FALSE))","v":""},{"$f":"IF($B505=\"\",\"\",VLOOKUP($B505,Data!$A$4:$T$727,5,FALSE))","v":""},{"$f":"IF($B505=\"\",\"\",VLOOKUP($B505,Data!$A$4:$T$727,7,FALSE))","v":""},"","","","",{"$f":"IF($I$15=\"Show\",VLOOKUP($B505,Data!$A$4:$T$727,9,FALSE),VLOOKUP($B505,Data!$A$4:$T$727,7,FALSE))","v":{"$error":"#N/A"}},{"$f":"IF($B505=\"\",\"\",VLOOKUP($B505,Data!$A$4:$T$727,6,FALSE))","v":""},"",{"$f":"IF($B505=\"\",\"\",IF(VLOOKUP($B505,Data!$A$4:$T$727,11,FALSE)<1,\"\",VLOOKUP(B505,Data!$A$4:$T$727,11,FALSE)))","v":""}]
[null,null,{"$f":"IF($B506=\"\",\"\",VLOOKUP($B506,Data!$A$4:$T$727,2,FALSE))","v":""},{"$f":"IF($B506=\"\",\"\",VLOOKUP($B506,Data!$A$4:$T$727,10,FALSE))","v":""},{"$f":"IF($B506=\"\",\"\",VLOOKUP($B506,Data!$A$4:$T$727,4,FALSE))","v":""},{"$f":"IF($B506=\"\",\"\",VLOOKUP($B506,Data!$A$4:$T$727,5,FALSE))","v":""},{"$f":"IF($B506=\"\",\"\",VLOOKUP($B506,Data!$A$4:$T$727,7,FALSE))","v":""},"","","","",{"$f":"IF($I$15=\"Show\",VLOOKUP($B506,Data!$A$4:$T$727,9,FALSE),VLOOKUP($B506,Data!$A$4:$T$727,7,FALSE))","v":{"$error":"#N/A"}},{"$f":"IF($B506=\"\",\"\",VLOOKUP($B506,Data!$A$4:$T$727,6,FALSE))","v":""},"",{"$f":"IF($B506=\"\",\"\",IF(VLOOKUP($B506,Data!$A$4:$T$727,11,FALSE)<1,\"\",VLOOKUP(B506,Data!$A$4:$T$727,11,FALSE)))","v":""}]
[null,null,{"$f":"IF($B507=\"\",\"\",VLOOKUP($B507,Data!$A$4:$T$727,2,FALSE))","v":""},{"$f":"IF($B507=\"\",\"\",VLOOKUP($B507,Data!$A$4:$T$727,10,FALSE))","v":""},{"$f":"IF($B507=\"\",\"\",VLOOKUP($B507,Data!$A$4:$T$727,4,FALSE))","v":""},{"$f":"IF($B507=\"\",\"\",VLOOKUP($B507,Data!$A$4:$T$727,5,FALSE))","v":""},{"$f":"IF($B507=\"\",\"\",VLOOKUP($B507,Data!$A$4:$T$727,7,FALSE))","v":""},"","","","",{"$f":"IF($I$15=\"Show\",VLOOKUP($B507,Data!$A$4:$T$727,9,FALSE),VLOOKUP($B507,Data!$A$4:$T$727,7,FALSE))","v":{"$error":"#N/A"}},{"$f":"IF($B507=\"\",\"\",VLOOKUP($B507,Data!$A$4:$T$727,6,FALSE))","v":""},"",{"$f":"IF($B507=\"\",\"\",IF(VLOOKUP($B507,Data!$A$4:$T$727,11,FALSE)<1,\"\",VLOOKUP(B507,Data!$A$4:$T$727,11,FALSE)))","v":""}]
[null,null,{"$f":"IF($B508=\"\",\"\",VLOOKUP($B508,Data!$A$4:$T$727,2,FALSE))","v":""},{"$f":"IF($B508=\"\",\"\",VLOOKUP($B508,Data!$A$4:$T$727,10,FALSE))","v":""},{"$f":"IF($B508=\"\",\"\",VLOOKUP($B508,Data!$A$4:$T$727,4,FALSE))","v":""},{"$f":"IF($B508=\"\",\"\",VLOOKUP($B508,Data!$A$4:$T$727,5,FALSE))","v":""},{"$f":"IF($B508=\"\",\"\",VLOOKUP($B508,Data!$A$4:$T$727,7,FALSE))","v":""},"","","","",{"$f":"IF($I$15=\"Show\",VLOOKUP($B508,Data!$A$4:$T$727,9,FALSE),VLOOKUP($B508,Data!$A$4:$T$727,7,FALSE))","v":{"$error":"#N/A"}},{"$f":"IF($B508=\"\",\"\",VLOOKUP($B508,Data!$A$4:$T$727,6,FALSE))","v":""},"",{"$f":"IF($B508=\"\",\"\",IF(VLOOKUP($B508,Data!$A$4:$T$727,11,FALSE)<1,\"\",VLOOKUP(B508,Data!$A$4:$T$727,11,FALSE)))","v":""}]
[null,null,{"$f":"IF($B509=\"\",\"\",VLOOKUP($B509,Data!$A$4:$T$727,2,FALSE))","v":""},{"$f":"IF($B509=\"\",\"\",VLOOKUP($B509,Data!$A$4:$T$727,10,FALSE))","v":""},{"$f":"IF($B509=\"\",\"\",VLOOKUP($B509,Data!$A$4:$T$727,4,FALSE))","v":""},{"$f":"IF($B509=\"\",\"\",VLOOKUP($B509,Data!$A$4:$T$727,5,FALSE))","v":""},{"$f":"IF($B509=\"\",\"\",VLOOKUP($B509,Data!$A$4:$T$727,7,FALSE))","v":""},"","","","",{"$f":"IF($I$15=\"Show\",VLOOKUP($B509,Data!$A$4:$T$727,9,FALSE),VLOOKUP($B509,Data!$A$4:$T$727,7,FALSE))","v":{"$error":"#N/A"}},{"$f":"IF($B509=\"\",\"\",VLOOKUP($B509,Data!$A$4:$T$727,6,FALSE))","v":""},"",{"$f":"IF($B509=\"\",\"\",IF(VLOOKUP($B509,Data!$A$4:$T$727,11,FALSE)<1,\"\",VLOOKUP(B509,Data!$A$4:$T$727,11,FALSE)))","v":""}]
[null,null,{"$f":"IF($B510=\"\",\"\",VLOOKUP($B510,Data!$A$4:$T$727,2,FALSE))","v":""},{"$f":"IF($B510=\"\",\"\",VLOOKUP($B510,Data!$A$4:$T$727,10,FALSE))","v":""},{"$f":"IF($B510=\"\",\"\",VLOOKUP($B510,Data!$A$4:$T$727,4,FALSE))","v":""},{"$f":"IF($B510=\"\",\"\",VLOOKUP($B510,Data!$A$4:$T$727,5,FALSE))","v":""},{"$f":"IF($B510=\"\",\"\",VLOOKUP($B510,Data!$A$4:$T$727,7,FALSE))","v":""},"","","","",{"$f":"IF($I$15=\"Show\",VLOOKUP($B510,Data!$A$4:$T$727,9,FALSE),VLOOKUP($B510,Data!$A$4:$T$727,7,FALSE))","v":{"$error":"#N/A"}},{"$f":"IF($B510=\"\",\"\",VLOOKUP($B510,Data!$A$4:$T$727,6,FALSE))","v":""},"",{"$f":"IF($B510=\"\",\"\",IF(VLOOKUP($B510,Data!$A$4:$T$727,11,FALSE)<1,\"\",VLOOKUP(B510,Data!$A$4:$T$727,11,FALSE)))","v":""}]
[null,null,{"$f":"IF($B511=\"\",\"\",VLOOKUP($B511,Data!$A$4:$T$727,2,FALSE))","v":""},{"$f":"IF($B511=\"\",\"\",VLOOKUP($B511,Data!$A$4:$T$727,10,FALSE))","v":""},{"$f":"IF($B511=\"\",\"\",VLOOKUP($B511,Data!$A$4:$T$727,4,FALSE))","v":""},{"$f":"IF($B511=\"\",\"\",VLOOKUP($B511,Data!$A$4:$T$727,5,FALSE))","v":""},{"$f":"IF($B511=\"\",\"\",VLOOKUP($B511,Data!$A$4:$T$727,7,FALSE))","v":""},"","","","",{"$f":"IF($I$15=\"Show\",VLOOKUP($B511,Data!$A$4:$T$727,9,FALSE),VLOOKUP($B511,Data!$A$4:$T$727,7,FALSE))","v":{"$error":"#N/A"}},{"$f":"IF($B511=\"\",\"\",VLOOKUP($B511,Data!$A$4:$T$727,6,FALSE))","v":""},"",{"$f":"IF($B511=\"\",\"\",IF(VLOOKUP($B511,Data!$A$4:$T$727,11,FALSE)<1,\"\",VLOOKUP(B511,Data!$A$4:$T$727,11,FALSE)))","v":""}]
[null,null,{"$f":"IF($B512=\"\",\"\",VLOOKUP($B512,Data!$A$4:$T$727,2,FALSE))","v":""},{"$f":"IF($B512=\"\",\"\",VLOOKUP($B512,Data!$A$4:$T$727,10,FALSE))","v":""},{"$f":"IF($B512=\"\",\"\",VLOOKUP($B512,Data!$A$4:$T$727,4,FALSE))","v":""},{"$f":"IF($B512=\"\",\"\",VLOOKUP($B512,Data!$A$4:$T$727,5,FALSE))","v":""},{"$f":"IF($B512=\"\",\"\",VLOOKUP($B512,Data!$A$4:$T$727,7,FALSE))","v":""},"","","","",{"$f":"IF($I$15=\"Show\",VLOOKUP($B512,Data!$A$4:$T$727,9,FALSE),VLOOKUP($B512,Data!$A$4:$T$727,7,FALSE))","v":{"$error":"#N/A"}},{"$f":"IF($B512=\"\",\"\",VLOOKUP($B512,Data!$A$4:$T$727,6,FALSE))","v":""},"",{"$f":"IF($B512=\"\",\"\",IF(VLOOKUP($B512,Data!$A$4:$T$727,11,FALSE)<1,\"\",VLOOKUP(B512,Data!$A$4:$T$727,11,FALSE)))","v":""}]
[null,null,{"$f":"IF($B513=\"\",\"\",VLOOKUP($B513,Data!$A$4:$T$727,2,FALSE))","v":""},{"$f":"IF($B513=\"\",\"\",VLOOKUP($B513,Data!$A$4:$T$727,10,FALSE))","v":""},{"$f":"IF($B513=\"\",\"\",VLOOKUP($B513,Data!$A$4:$T$727,4,FALSE))","v":""},{"$f":"IF($B513=\"\",\"\",VLOOKUP($B513,Data!$A$4:$T$727,5,FALSE))","v":""},{"$f":"IF($B513=\"\",\"\",VLOOKUP($B513,Data!$A$4:$T$727,7,FALSE))","v":""},"","","","",{"$f":"IF($I$15=\"Show\",VLOOKUP($B513,Data!$A$4:$T$727,9,FALSE),VLOOKUP($B513,Data!$A$4:$T$727,7,FALSE))","v":{"$error":"#N/A"}},{"$f":"IF($B513=\"\",\"\",VLOOKUP($B513,Data!$A$4:$T$727,6,FALSE))","v":""},"",{"$f":"IF($B513=\"\",\"\",IF(VLOOKUP($B513,Data!$A$4:$T$727,11,FALSE)<1,\"\",VLOOKUP(B513,Data!$A$4:$T$727,11,FALSE)))","v":""}]
[null,null,{"$f":"IF($B514=\"\",\"\",VLOOKUP($B514,Data!$A$4:$T$727,2,FALSE))","v":""},{"$f":"IF($B514=\"\",\"\",VLOOKUP($B514,Data!$A$4:$T$727,10,FALSE))","v":""},{"$f":"IF($B514=\"\",\"\",VLOOKUP($B514,Data!$A$4:$T$727,4,FALSE))","v":""},{"$f":"IF($B514=\"\",\"\",VLOOKUP($B514,Data!$A$4:$T$727,5,FALSE))","v":""},{"$f":"IF($B514=\"\",\"\",VLOOKUP($B514,Data!$A$4:$T$727,7,FALSE))","v":""},"","","","",{"$f":"IF($I$15=\"Show\",VLOOKUP($B514,Data!$A$4:$T$727,9,FALSE),VLOOKUP($B514,Data!$A$4:$T$727,7,FALSE))","v":{"$error":"#N/A"}},{"$f":"IF($B514=\"\",\"\",VLOOKUP($B514,Data!$A$4:$T$727,6,FALSE))","v":""},"",{"$f":"IF($B514=\"\",\"\",IF(VLOOKUP($B514,Data!$A$4:$T$727,11,FALSE)<1,\"\",VLOOKUP(B514,Data!$A$4:$T$727,11,FALSE)))","v":""}]
[null,null,{"$f":"IF($B515=\"\",\"\",VLOOKUP($B515,Data!$A$4:$T$727,2,FALSE))","v":""},{"$f":"IF($B515=\"\",\"\",VLOOKUP($B515,Data!$A$4:$T$727,10,FALSE))","v":""},{"$f":"IF($B515=\"\",\"\",VLOOKUP($B515,Data!$A$4:$T$727,4,FALSE))","v":""},{"$f":"IF($B515=\"\",\"\",VLOOKUP($B515,Data!$A$4:$T$727,5,FALSE))","v":""},{"$f":"IF($B515=\"\",\"\",VLOOKUP($B515,Data!$A$4:$T$727,7,FALSE))","v":""},"","","","",{"$f":"IF($I$15=\"Show\",VLOOKUP($B515,Data!$A$4:$T$727,9,FALSE),VLOOKUP($B515,Data!$A$4:$T$727,7,FALSE))","v":{"$error":"#N/A"}},{"$f":"IF($B515=\"\",\"\",VLOOKUP($B515,Data!$A$4:$T$727,6,FALSE))","v":""},"",{"$f":"IF($B515=\"\",\"\",IF(VLOOKUP($B515,Data!$A$4:$T$727,11,FALSE)<1,\"\",VLOOKUP(B515,Data!$A$4:$T$727,11,FALSE)))","v":""}]
[null,null,{"$f":"IF($B516=\"\",\"\",VLOOKUP($B516,Data!$A$4:$T$727,2,FALSE))","v":""},{"$f":"IF($B516=\"\",\"\",VLOOKUP($B516,Data!$A$4:$T$727,10,FALSE))","v":""},{"$f":"IF($B516=\"\",\"\",VLOOKUP($B516,Data!$A$4:$T$727,4,FALSE))","v":""},{"$f":"IF($B516=\"\",\"\",VLOOKUP($B516,Data!$A$4:$T$727,5,FALSE))","v":""},{"$f":"IF($B516=\"\",\"\",VLOOKUP($B516,Data!$A$4:$T$727,7,FALSE))","v":""},"","","","",{"$f":"IF($I$15=\"Show\",VLOOKUP($B516,Data!$A$4:$T$727,9,FALSE),VLOOKUP($B516,Data!$A$4:$T$727,7,FALSE))","v":{"$error":"#N/A"}},{"$f":"IF($B516=\"\",\"\",VLOOKUP($B516,Data!$A$4:$T$727,6,FALSE))","v":""},"",{"$f":"IF($B516=\"\",\"\",IF(VLOOKUP($B516,Data!$A$4:$T$727,11,FALSE)<1,\"\",VLOOKUP(B516,Data!$A$4:$T$727,11,FALSE)))","v":""}]
[null,null,{"$f":"IF($B517=\"\",\"\",VLOOKUP($B517,Data!$A$4:$T$727,2,FALSE))","v":""},{"$f":"IF($B517=\"\",\"\",VLOOKUP($B517,Data!$A$4:$T$727,10,FALSE))","v":""},{"$f":"IF($B517=\"\",\"\",VLOOKUP($B517,Data!$A$4:$T$727,4,FALSE))","v":""},{"$f":"IF($B517=\"\",\"\",VLOOKUP($B517,Data!$A$4:$T$727,5,FALSE))","v":""},{"$f":"IF($B517=\"\",\"\",VLOOKUP($B517,Data!$A$4:$T$727,7,FALSE))","v":""},"","","","",{"$f":"IF($I$15=\"Show\",VLOOKUP($B517,Data!$A$4:$T$727,9,FALSE),VLOOKUP($B517,Data!$A$4:$T$727,7,FALSE))","v":{"$error":"#N/A"}},{"$f":"IF($B517=\"\",\"\",VLOOKUP($B517,Data!$A$4:$T$727,6,FALSE))","v":""},"",{"$f":"IF($B517=\"\",\"\",IF(VLOOKUP($B517,Data!$A$4:$T$727,11,FALSE)<1,\"\",VLOOKUP(B517,Data!$A$4:$T$727,11,FALSE)))","v":""}]
[null,null,{"$f":"IF($B518=\"\",\"\",VLOOKUP($B518,Data!$A$4:$T$727,2,FALSE))","v":""},{"$f":"IF($B518=\"\",\"\",VLOOKUP($B518,Data!$A$4:$T$727,10,FALSE))","v":""},{"$f":"IF($B518=\"\",\"\",VLOOKUP($B518,Data!$A$4:$T$727,4,FALSE))","v":""},{"$f":"IF($B518=\"\",\"\",VLOOKUP($B518,Data!$A$4:$T$727,5,FALSE))","v":""},{"$f":"IF($B518=\"\",\"\",VLOOKUP($B518,Data!$A$4:$T$727,7,FALSE))","v":""},"","","","",{"$f":"IF($I$15=\"Show\",VLOOKUP($B518,Data!$A$4:$T$727,9,FALSE),VLOOKUP($B518,Data!$A$4:$T$727,7,FALSE))","v":{"$error":"#N/A"}},{"$f":"IF($B518=\"\",\"\",VLOOKUP($B518,Data!$A$4:$T$727,6,FALSE))","v":""},"",{"$f":"IF($B518=\"\",\"\",IF(VLOOKUP($B518,Data!$A$4:$T$727,11,FALSE)<1,\"\",VLOOKUP(B518,Data!$A$4:$T$727,11,FALSE)))","v":""}]
[null,null,{"$f":"IF($B519=\"\",\"\",VLOOKUP($B519,Data!$A$4:$T$727,2,FALSE))","v":""},{"$f":"IF($B519=\"\",\"\",VLOOKUP($B519,Data!$A$4:$T$727,10,FALSE))","v":""},{"$f":"IF($B519=\"\",\"\",VLOOKUP($B519,Data!$A$4:$T$727,4,FALSE))","v":""},{"$f":"IF($B519=\"\",\"\",VLOOKUP($B519,Data!$A$4:$T$727,5,FALSE))","v":""},{"$f":"IF($B519=\"\",\"\",VLOOKUP($B519,Data!$A$4:$T$727,7,FALSE))","v":""},"","","","",{"$f":"IF($I$15=\"Show\",VLOOKUP($B519,Data!$A$4:$T$727,9,FALSE),VLOOKUP($B519,Data!$A$4:$T$727,7,FALSE))","v":{"$error":"#N/A"}},{"$f":"IF($B519=\"\",\"\",VLOOKUP($B519,Data!$A$4:$T$727,6,FALSE))","v":""},"",{"$f":"IF($B519=\"\",\"\",IF(VLOOKUP($B519,Data!$A$4:$T$727,11,FALSE)<1,\"\",VLOOKUP(B519,Data!$A$4:$T$727,11,FALSE)))","v":""}]
[null,null,{"$f":"IF($B520=\"\",\"\",VLOOKUP($B520,Data!$A$4:$T$727,2,FALSE))","v":""},{"$f":"IF($B520=\"\",\"\",VLOOKUP($B520,Data!$A$4:$T$727,10,FALSE))","v":""},{"$f":"IF($B520=\"\",\"\",VLOOKUP($B520,Data!$A$4:$T$727,4,FALSE))","v":""},{"$f":"IF($B520=\"\",\"\",VLOOKUP($B520,Data!$A$4:$T$727,5,FALSE))","v":""},{"$f":"IF($B520=\"\",\"\",VLOOKUP($B520,Data!$A$4:$T$727,7,FALSE))","v":""},"","","","",{"$f":"IF($I$15=\"Show\",VLOOKUP($B520,Data!$A$4:$T$727,9,FALSE),VLOOKUP($B520,Data!$A$4:$T$727,7,FALSE))","v":{"$error":"#N/A"}},{"$f":"IF($B520=\"\",\"\",VLOOKUP($B520,Data!$A$4:$T$727,6,FALSE))","v":""},"",{"$f":"IF($B520=\"\",\"\",IF(VLOOKUP($B520,Data!$A$4:$T$727,11,FALSE)<1,\"\",VLOOKUP(B520,Data!$A$4:$T$727,11,FALSE)))","v":""}]
[null,null,{"$f":"IF($B521=\"\",\"\",VLOOKUP($B521,Data!$A$4:$T$727,2,FALSE))","v":""},{"$f":"IF($B521=\"\",\"\",VLOOKUP($B521,Data!$A$4:$T$727,10,FALSE))","v":""},{"$f":"IF($B521=\"\",\"\",VLOOKUP($B521,Data!$A$4:$T$727,4,FALSE))","v":""},{"$f":"IF($B521=\"\",\"\",VLOOKUP($B521,Data!$A$4:$T$727,5,FALSE))","v":""},{"$f":"IF($B521=\"\",\"\",VLOOKUP($B521,Data!$A$4:$T$727,7,FALSE))","v":""},"","","","",{"$f":"IF($I$15=\"Show\",VLOOKUP($B521,Data!$A$4:$T$727,9,FALSE),VLOOKUP($B521,Data!$A$4:$T$727,7,FALSE))","v":{"$error":"#N/A"}},{"$f":"IF($B521=\"\",\"\",VLOOKUP($B521,Data!$A$4:$T$727,6,FALSE))","v":""},"",{"$f":"IF($B521=\"\",\"\",IF(VLOOKUP($B521,Data!$A$4:$T$727,11,FALSE)<1,\"\",VLOOKUP(B521,Data!$A$4:$T$727,11,FALSE)))","v":""}]
[null,null,{"$f":"IF($B522=\"\",\"\",VLOOKUP($B522,Data!$A$4:$T$727,2,FALSE))","v":""},{"$f":"IF($B522=\"\",\"\",VLOOKUP($B522,Data!$A$4:$T$727,10,FALSE))","v":""},{"$f":"IF($B522=\"\",\"\",VLOOKUP($B522,Data!$A$4:$T$727,4,FALSE))","v":""},{"$f":"IF($B522=\"\",\"\",VLOOKUP($B522,Data!$A$4:$T$727,5,FALSE))","v":""},{"$f":"IF($B522=\"\",\"\",VLOOKUP($B522,Data!$A$4:$T$727,7,FALSE))","v":""},"","","","",{"$f":"IF($I$15=\"Show\",VLOOKUP($B522,Data!$A$4:$T$727,9,FALSE),VLOOKUP($B522,Data!$A$4:$T$727,7,FALSE))","v":{"$error":"#N/A"}},{"$f":"IF($B522=\"\",\"\",VLOOKUP($B522,Data!$A$4:$T$727,6,FALSE))","v":""},"",{"$f":"IF($B522=\"\",\"\",IF(VLOOKUP($B522,Data!$A$4:$T$727,11,FALSE)<1,\"\",VLOOKUP(B522,Data!$A$4:$T$727,11,FALSE)))","v":""}]
[null,null,{"$f":"IF($B523=\"\",\"\",VLOOKUP($B523,Data!$A$4:$T$727,2,FALSE))","v":""},{"$f":"IF($B523=\"\",\"\",VLOOKUP($B523,Data!$A$4:$T$727,10,FALSE))","v":""},{"$f":"IF($B523=\"\",\"\",VLOOKUP($B523,Data!$A$4:$T$727,4,FALSE))","v":""},{"$f":"IF($B523=\"\",\"\",VLOOKUP($B523,Data!$A$4:$T$727,5,FALSE))","v":""},{"$f":"IF($B523=\"\",\"\",VLOOKUP($B523,Data!$A$4:$T$727,7,FALSE))","v":""},"","","","",{"$f":"IF($I$15=\"Show\",VLOOKUP($B523,Data!$A$4:$T$727,9,FALSE),VLOOKUP($B523,Data!$A$4:$T$727,7,FALSE))","v":{"$error":"#N/A"}},{"$f":"IF($B523=\"\",\"\",VLOOKUP($B523,Data!$A$4:$T$727,6,FALSE))","v":""},"",{"$f":"IF($B523=\"\",\"\",IF(VLOOKUP($B523,Data!$A$4:$T$727,11,FALSE)<1,\"\",VLOOKUP(B523,Data!$A$4:$T$727,11,FALSE)))","v":""}]
[null,null,{"$f":"IF($B524=\"\",\"\",VLOOKUP($B524,Data!$A$4:$T$727,2,FALSE))","v":""},{"$f":"IF($B524=\"\",\"\",VLOOKUP($B524,Data!$A$4:$T$727,10,FALSE))","v":""},{"$f":"IF($B524=\"\",\"\",VLOOKUP($B524,Data!$A$4:$T$727,4,FALSE))","v":""},{"$f":"IF($B524=\"\",\"\",VLOOKUP($B524,Data!$A$4:$T$727,5,FALSE))","v":""},{"$f":"IF($B524=\"\",\"\",VLOOKUP($B524,Data!$A$4:$T$727,7,FALSE))","v":""},"","","","",{"$f":"IF($I$15=\"Show\",VLOOKUP($B524,Data!$A$4:$T$727,9,FALSE),VLOOKUP($B524,Data!$A$4:$T$727,7,FALSE))","v":{"$error":"#N/A"}},{"$f":"IF($B524=\"\",\"\",VLOOKUP($B524,Data!$A$4:$T$727,6,FALSE))","v":""},"",{"$f":"IF($B524=\"\",\"\",IF(VLOOKUP($B524,Data!$A$4:$T$727,11,FALSE)<1,\"\",VLOOKUP(B524,Data!$A$4:$T$727,11,FALSE)))","v":""}]
[null,null,{"$f":"IF($B525=\"\",\"\",VLOOKUP($B525,Data!$A$4:$T$727,2,FALSE))","v":""},{"$f":"IF($B525=\"\",\"\",VLOOKUP($B525,Data!$A$4:$T$727,10,FALSE))","v":""},{"$f":"IF($B525=\"\",\"\",VLOOKUP($B525,Data!$A$4:$T$727,4,FALSE))","v":""},{"$f":"IF($B525=\"\",\"\",VLOOKUP($B525,Data!$A$4:$T$727,5,FALSE))","v":""},{"$f":"IF($B525=\"\",\"\",VLOOKUP($B525,Data!$A$4:$T$727,7,FALSE))","v":""},"","","","",{"$f":"IF($I$15=\"Show\",VLOOKUP($B525,Data!$A$4:$T$727,9,FALSE),VLOOKUP($B525,Data!$A$4:$T$727,7,FALSE))","v":{"$error":"#N/A"}},{"$f":"IF($B525=\"\",\"\",VLOOKUP($B525,Data!$A$4:$T$727,6,FALSE))","v":""},"",{"$f":"IF($B525=\"\",\"\",IF(VLOOKUP($B525,Data!$A$4:$T$727,11,FALSE)<1,\"\",VLOOKUP(B525,Data!$A$4:$T$727,11,FALSE)))","v":""}]
[null,null,{"$f":"IF($B526=\"\",\"\",VLOOKUP($B526,Data!$A$4:$T$727,2,FALSE))","v":""},{"$f":"IF($B526=\"\",\"\",VLOOKUP($B526,Data!$A$4:$T$727,10,FALSE))","v":""},{"$f":"IF($B526=\"\",\"\",VLOOKUP($B526,Data!$A$4:$T$727,4,FALSE))","v":""},{"$f":"IF($B526=\"\",\"\",VLOOKUP($B526,Data!$A$4:$T$727,5,FALSE))","v":""},{"$f":"IF($B526=\"\",\"\",VLOOKUP($B526,Data!$A$4:$T$727,7,FALSE))","v":""},"","","","",{"$f":"IF($I$15=\"Show\",VLOOKUP($B526,Data!$A$4:$T$727,9,FALSE),VLOOKUP($B526,Data!$A$4:$T$727,7,FALSE))","v":{"$error":"#N/A"}},{"$f":"IF($B526=\"\",\"\",VLOOKUP($B526,Data!$A$4:$T$727,6,FALSE))","v":""},"",{"$f":"IF($B526=\"\",\"\",IF(VLOOKUP($B526,Data!$A$4:$T$727,11,FALSE)<1,\"\",VLOOKUP(B526,Data!$A$4:$T$727,11,FALSE)))","v":""}]
[null,null,{"$f":"IF($B527=\"\",\"\",VLOOKUP($B527,Data!$A$4:$T$727,2,FALSE))","v":""},{"$f":"IF($B527=\"\",\"\",VLOOKUP($B527,Data!$A$4:$T$727,10,FALSE))","v":""},{"$f":"IF($B527=\"\",\"\",VLOOKUP($B527,Data!$A$4:$T$727,4,FALSE))","v":""},{"$f":"IF($B527=\"\",\"\",VLOOKUP($B527,Data!$A$4:$T$727,5,FALSE))","v":""},{"$f":"IF($B527=\"\",\"\",VLOOKUP($B527,Data!$A$4:$T$727,7,FALSE))","v":""},"","","","",{"$f":"IF($I$15=\"Show\",VLOOKUP($B527,Data!$A$4:$T$727,9,FALSE),VLOOKUP($B527,Data!$A$4:$T$727,7,FALSE))","v":{"$error":"#N/A"}},{"$f":"IF($B527=\"\",\"\",VLOOKUP($B527,Data!$A$4:$T$727,6,FALSE))","v":""},"",{"$f":"IF($B527=\"\",\"\",IF(VLOOKUP($B527,Data!$A$4:$T$727,11,FALSE)<1,\"\",VLOOKUP(B527,Data!$A$4:$T$727,11,FALSE)))","v":""}]
[null,null,{"$f":"IF($B528=\"\",\"\",VLOOKUP($B528,Data!$A$4:$T$727,2,FALSE))","v":""},{"$f":"IF($B528=\"\",\"\",VLOOKUP($B528,Data!$A$4:$T$727,10,FALSE))","v":""},{"$f":"IF($B528=\"\",\"\",VLOOKUP($B528,Data!$A$4:$T$727,4,FALSE))","v":""},{"$f":"IF($B528=\"\",\"\",VLOOKUP($B528,Data!$A$4:$T$727,5,FALSE))","v":""},{"$f":"IF($B528=\"\",\"\",VLOOKUP($B528,Data!$A$4:$T$727,7,FALSE))","v":""},"","","","",{"$f":"IF($I$15=\"Show\",VLOOKUP($B528,Data!$A$4:$T$727,9,FALSE),VLOOKUP($B528,Data!$A$4:$T$727,7,FALSE))","v":{"$error":"#N/A"}},{"$f":"IF($B528=\"\",\"\",VLOOKUP($B528,Data!$A$4:$T$727,6,FALSE))","v":""},"",{"$f":"IF($B528=\"\",\"\",IF(VLOOKUP($B528,Data!$A$4:$T$727,11,FALSE)<1,\"\",VLOOKUP(B528,Data!$A$4:$T$727,11,FALSE)))","v":""}]
[null,null,{"$f":"IF($B529=\"\",\"\",VLOOKUP($B529,Data!$A$4:$T$727,2,FALSE))","v":""},{"$f":"IF($B529=\"\",\"\",VLOOKUP($B529,Data!$A$4:$T$727,10,FALSE))","v":""},{"$f":"IF($B529=\"\",\"\",VLOOKUP($B529,Data!$A$4:$T$727,4,FALSE))","v":""},{"$f":"IF($B529=\"\",\"\",VLOOKUP($B529,Data!$A$4:$T$727,5,FALSE))","v":""},{"$f":"IF($B529=\"\",\"\",VLOOKUP($B529,Data!$A$4:$T$727,7,FALSE))","v":""},"","","","",{"$f":"IF($I$15=\"Show\",VLOOKUP($B529,Data!$A$4:$T$727,9,FALSE),VLOOKUP($B529,Data!$A$4:$T$727,7,FALSE))","v":{"$error":"#N/A"}},{"$f":"IF($B529=\"\",\"\",VLOOKUP($B529,Data!$A$4:$T$727,6,FALSE))","v":""},"",{"$f":"IF($B529=\"\",\"\",IF(VLOOKUP($B529,Data!$A$4:$T$727,11,FALSE)<1,\"\",VLOOKUP(B529,Data!$A$4:$T$727,11,FALSE)))","v":""}]
[null,null,{"$f":"IF($B530=\"\",\"\",VLOOKUP($B530,Data!$A$4:$T$727,2,FALSE))","v":""},{"$f":"IF($B530=\"\",\"\",VLOOKUP($B530,Data!$A$4:$T$727,10,FALSE))","v":""},{"$f":"IF($B530=\"\",\"\",VLOOKUP($B530,Data!$A$4:$T$727,4,FALSE))","v":""},{"$f":"IF($B530=\"\",\"\",VLOOKUP($B530,Data!$A$4:$T$727,5,FALSE))","v":""},{"$f":"IF($B530=\"\",\"\",VLOOKUP($B530,Data!$A$4:$T$727,7,FALSE))","v":""},"","","","",{"$f":"IF($I$15=\"Show\",VLOOKUP($B530,Data!$A$4:$T$727,9,FALSE),VLOOKUP($B530,Data!$A$4:$T$727,7,FALSE))","v":{"$error":"#N/A"}},{"$f":"IF($B530=\"\",\"\",VLOOKUP($B530,Data!$A$4:$T$727,6,FALSE))","v":""},"",{"$f":"IF($B530=\"\",\"\",IF(VLOOKUP($B530,Data!$A$4:$T$727,11,FALSE)<1,\"\",VLOOKUP(B530,Data!$A$4:$T$727,11,FALSE)))","v":""}]
[null,null,{"$f":"IF($B531=\"\",\"\",VLOOKUP($B531,Data!$A$4:$T$727,2,FALSE))","v":""},{"$f":"IF($B531=\"\",\"\",VLOOKUP($B531,Data!$A$4:$T$727,10,FALSE))","v":""},{"$f":"IF($B531=\"\",\"\",VLOOKUP($B531,Data!$A$4:$T$727,4,FALSE))","v":""},{"$f":"IF($B531=\"\",\"\",VLOOKUP($B531,Data!$A$4:$T$727,5,FALSE))","v":""},{"$f":"IF($B531=\"\",\"\",VLOOKUP($B531,Data!$A$4:$T$727,7,FALSE))","v":""},"","","","",{"$f":"IF($I$15=\"Show\",VLOOKUP($B531,Data!$A$4:$T$727,9,FALSE),VLOOKUP($B531,Data!$A$4:$T$727,7,FALSE))","v":{"$error":"#N/A"}},{"$f":"IF($B531=\"\",\"\",VLOOKUP($B531,Data!$A$4:$T$727,6,FALSE))","v":""},"",{"$f":"IF($B531=\"\",\"\",IF(VLOOKUP($B531,Data!$A$4:$T$727,11,FALSE)<1,\"\",VLOOKUP(B531,Data!$A$4:$T$727,11,FALSE)))","v":""}]
[null,null,{"$f":"IF($B532=\"\",\"\",VLOOKUP($B532,Data!$A$4:$T$727,2,FALSE))","v":""},{"$f":"IF($B532=\"\",\"\",VLOOKUP($B532,Data!$A$4:$T$727,10,FALSE))","v":""},{"$f":"IF($B532=\"\",\"\",VLOOKUP($B532,Data!$A$4:$T$727,4,FALSE))","v":""},{"$f":"IF($B532=\"\",\"\",VLOOKUP($B532,Data!$A$4:$T$727,5,FALSE))","v":""},{"$f":"IF($B532=\"\",\"\",VLOOKUP($B532,Data!$A$4:$T$727,7,FALSE))","v":""},"","","","",{"$f":"IF($I$15=\"Show\",VLOOKUP($B532,Data!$A$4:$T$727,9,FALSE),VLOOKUP($B532,Data!$A$4:$T$727,7,FALSE))","v":{"$error":"#N/A"}},{"$f":"IF($B532=\"\",\"\",VLOOKUP($B532,Data!$A$4:$T$727,6,FALSE))","v":""},"",{"$f":"IF($B532=\"\",\"\",IF(VLOOKUP($B532,Data!$A$4:$T$727,11,FALSE)<1,\"\",VLOOKUP(B532,Data!$A$4:$T$727,11,FALSE)))","v":""}]
[null,null,{"$f":"IF($B533=\"\",\"\",VLOOKUP($B533,Data!$A$4:$T$727,2,FALSE))","v":""},{"$f":"IF($B533=\"\",\"\",VLOOKUP($B533,Data!$A$4:$T$727,10,FALSE))","v":""},{"$f":"IF($B533=\"\",\"\",VLOOKUP($B533,Data!$A$4:$T$727,4,FALSE))","v":""},{"$f":"IF($B533=\"\",\"\",VLOOKUP($B533,Data!$A$4:$T$727,5,FALSE))","v":""},{"$f":"IF($B533=\"\",\"\",VLOOKUP($B533,Data!$A$4:$T$727,7,FALSE))","v":""},"","","","",{"$f":"IF($I$15=\"Show\",VLOOKUP($B533,Data!$A$4:$T$727,9,FALSE),VLOOKUP($B533,Data!$A$4:$T$727,7,FALSE))","v":{"$error":"#N/A"}},{"$f":"IF($B533=\"\",\"\",VLOOKUP($B533,Data!$A$4:$T$727,6,FALSE))","v":""},"",{"$f":"IF($B533=\"\",\"\",IF(VLOOKUP($B533,Data!$A$4:$T$727,11,FALSE)<1,\"\",VLOOKUP(B533,Data!$A$4:$T$727,11,FALSE)))","v":""}]
[null,null,{"$f":"IF($B534=\"\",\"\",VLOOKUP($B534,Data!$A$4:$T$727,2,FALSE))","v":""},{"$f":"IF($B534=\"\",\"\",VLOOKUP($B534,Data!$A$4:$T$727,10,FALSE))","v":""},{"$f":"IF($B534=\"\",\"\",VLOOKUP($B534,Data!$A$4:$T$727,4,FALSE))","v":""},{"$f":"IF($B534=\"\",\"\",VLOOKUP($B534,Data!$A$4:$T$727,5,FALSE))","v":""},{"$f":"IF($B534=\"\",\"\",VLOOKUP($B534,Data!$A$4:$T$727,7,FALSE))","v":""},{"$f":"IF($B534=\"\",\"\",IF($K$15=\"\",\"\",ROUND($G534*(1-($K$15*0.01)),2)))","v":""},{"$f":"IF($B534=\"\",\"\",IF($G534=$L534,\"\",L534))","v":""},{"$f":"IF($B534=\"\",\"\",IF($H534<$L534,$H534,$L534))","v":""},{"$f":"IF(A534=\"\",\"\",J534*A534)","v":""},{"$f":"IF($I$15=\"Show\",VLOOKUP($B534,Data!$A$4:$T$727,9,FALSE),VLOOKUP($B534,Data!$A$4:$T$727,7,FALSE))","v":{"$error":"#N/A"}},{"$f":"IF($B534=\"\",\"\",VLOOKUP($B534,Data!$A$4:$T$727,6,FALSE))","v":""},{"$f":"IF($A534=\"\",\"\",$A534/$M534)","v":""},{"$f":"IF($B534=\"\",\"\",IF(VLOOKUP($B534,Data!$A$4:$T$727,11,FALSE)<1,\"\",VLOOKUP(B534,Data!$A$4:$T$727,11,FALSE)))","v":""}]
[null,null,{"$f":"IF($B535=\"\",\"\",VLOOKUP($B535,Data!$A$4:$T$727,2,FALSE))","v":""},{"$f":"IF($B535=\"\",\"\",VLOOKUP($B535,Data!$A$4:$T$727,10,FALSE))","v":""},{"$f":"IF($B535=\"\",\"\",VLOOKUP($B535,Data!$A$4:$T$727,4,FALSE))","v":""},{"$f":"IF($B535=\"\",\"\",VLOOKUP($B535,Data!$A$4:$T$727,5,FALSE))","v":""},{"$f":"IF($B535=\"\",\"\",VLOOKUP($B535,Data!$A$4:$T$727,7,FALSE))","v":""},"","","","",{"$f":"IF($I$15=\"Show\",VLOOKUP($B535,Data!$A$4:$T$727,9,FALSE),VLOOKUP($B535,Data!$A$4:$T$727,7,FALSE))","v":{"$error":"#N/A"}},{"$f":"IF($B535=\"\",\"\",VLOOKUP($B535,Data!$A$4:$T$727,6,FALSE))","v":""},"",{"$f":"IF($B535=\"\",\"\",IF(VLOOKUP($B535,Data!$A$4:$T$727,11,FALSE)<1,\"\",VLOOKUP(B535,Data!$A$4:$T$727,11,FALSE)))","v":""}]
[null,null,{"$f":"IF($B536=\"\",\"\",VLOOKUP($B536,Data!$A$4:$T$727,2,FALSE))","v":""},{"$f":"IF($B536=\"\",\"\",VLOOKUP($B536,Data!$A$4:$T$727,10,FALSE))","v":""},{"$f":"IF($B536=\"\",\"\",VLOOKUP($B536,Data!$A$4:$T$727,4,FALSE))","v":""},{"$f":"IF($B536=\"\",\"\",VLOOKUP($B536,Data!$A$4:$T$727,5,FALSE))","v":""},{"$f":"IF($B536=\"\",\"\",VLOOKUP($B536,Data!$A$4:$T$727,7,FALSE))","v":""},"","","","",{"$f":"IF($I$15=\"Show\",VLOOKUP($B536,Data!$A$4:$T$727,9,FALSE),VLOOKUP($B536,Data!$A$4:$T$727,7,FALSE))","v":{"$error":"#N/A"}},{"$f":"IF($B536=\"\",\"\",VLOOKUP($B536,Data!$A$4:$T$727,6,FALSE))","v":""},"",{"$f":"IF($B536=\"\",\"\",IF(VLOOKUP($B536,Data!$A$4:$T$727,11,FALSE)<1,\"\",VLOOKUP(B536,Data!$A$4:$T$727,11,FALSE)))","v":""}]
[null,null,{"$f":"IF($B537=\"\",\"\",VLOOKUP($B537,Data!$A$4:$T$727,2,FALSE))","v":""},{"$f":"IF($B537=\"\",\"\",VLOOKUP($B537,Data!$A$4:$T$727,10,FALSE))","v":""},{"$f":"IF($B537=\"\",\"\",VLOOKUP($B537,Data!$A$4:$T$727,4,FALSE))","v":""},{"$f":"IF($B537=\"\",\"\",VLOOKUP($B537,Data!$A$4:$T$727,5,FALSE))","v":""},{"$f":"IF($B537=\"\",\"\",VLOOKUP($B537,Data!$A$4:$T$727,7,FALSE))","v":""},"","","","",{"$f":"IF($I$15=\"Show\",VLOOKUP($B537,Data!$A$4:$T$727,9,FALSE),VLOOKUP($B537,Data!$A$4:$T$727,7,FALSE))","v":{"$error":"#N/A"}},{"$f":"IF($B537=\"\",\"\",VLOOKUP($B537,Data!$A$4:$T$727,6,FALSE))","v":""},"",{"$f":"IF($B537=\"\",\"\",IF(VLOOKUP($B537,Data!$A$4:$T$727,11,FALSE)<1,\"\",VLOOKUP(B537,Data!$A$4:$T$727,11,FALSE)))","v":""}]
[null,null,{"$f":"IF($B538=\"\",\"\",VLOOKUP($B538,Data!$A$4:$T$727,2,FALSE))","v":""},{"$f":"IF($B538=\"\",\"\",VLOOKUP($B538,Data!$A$4:$T$727,10,FALSE))","v":""},{"$f":"IF($B538=\"\",\"\",VLOOKUP($B538,Data!$A$4:$T$727,4,FALSE))","v":""},{"$f":"IF($B538=\"\",\"\",VLOOKUP($B538,Data!$A$4:$T$727,5,FALSE))","v":""},{"$f":"IF($B538=\"\",\"\",VLOOKUP($B538,Data!$A$4:$T$727,7,FALSE))","v":""},"","","","",{"$f":"IF($I$15=\"Show\",VLOOKUP($B538,Data!$A$4:$T$727,9,FALSE),VLOOKUP($B538,Data!$A$4:$T$727,7,FALSE))","v":{"$error":"#N/A"}},{"$f":"IF($B538=\"\",\"\",VLOOKUP($B538,Data!$A$4:$T$727,6,FALSE))","v":""},"",{"$f":"IF($B538=\"\",\"\",IF(VLOOKUP($B538,Data!$A$4:$T$727,11,FALSE)<1,\"\",VLOOKUP(B538,Data!$A$4:$T$727,11,FALSE)))","v":""}]
[null,null,{"$f":"IF($B539=\"\",\"\",VLOOKUP($B539,Data!$A$4:$T$727,2,FALSE))","v":""},{"$f":"IF($B539=\"\",\"\",VLOOKUP($B539,Data!$A$4:$T$727,10,FALSE))","v":""},{"$f":"IF($B539=\"\",\"\",VLOOKUP($B539,Data!$A$4:$T$727,4,FALSE))","v":""},{"$f":"IF($B539=\"\",\"\",VLOOKUP($B539,Data!$A$4:$T$727,5,FALSE))","v":""},{"$f":"IF($B539=\"\",\"\",VLOOKUP($B539,Data!$A$4:$T$727,7,FALSE))","v":""},"","","","",{"$f":"IF($I$15=\"Show\",VLOOKUP($B539,Data!$A$4:$T$727,9,FALSE),VLOOKUP($B539,Data!$A$4:$T$727,7,FALSE))","v":{"$error":"#N/A"}},{"$f":"IF($B539=\"\",\"\",VLOOKUP($B539,Data!$A$4:$T$727,6,FALSE))","v":""},"",{"$f":"IF($B539=\"\",\"\",IF(VLOOKUP($B539,Data!$A$4:$T$727,11,FALSE)<1,\"\",VLOOKUP(B539,Data!$A$4:$T$727,11,FALSE)))","v":""}]
[null,null,{"$f":"IF($B540=\"\",\"\",VLOOKUP($B540,Data!$A$4:$T$727,2,FALSE))","v":""},{"$f":"IF($B540=\"\",\"\",VLOOKUP($B540,Data!$A$4:$T$727,10,FALSE))","v":""},{"$f":"IF($B540=\"\",\"\",VLOOKUP($B540,Data!$A$4:$T$727,4,FALSE))","v":""},{"$f":"IF($B540=\"\",\"\",VLOOKUP($B540,Data!$A$4:$T$727,5,FALSE))","v":""},{"$f":"IF($B540=\"\",\"\",VLOOKUP($B540,Data!$A$4:$T$727,7,FALSE))","v":""},"","","","",{"$f":"IF($I$15=\"Show\",VLOOKUP($B540,Data!$A$4:$T$727,9,FALSE),VLOOKUP($B540,Data!$A$4:$T$727,7,FALSE))","v":{"$error":"#N/A"}},{"$f":"IF($B540=\"\",\"\",VLOOKUP($B540,Data!$A$4:$T$727,6,FALSE))","v":""},"",{"$f":"IF($B540=\"\",\"\",IF(VLOOKUP($B540,Data!$A$4:$T$727,11,FALSE)<1,\"\",VLOOKUP(B540,Data!$A$4:$T$727,11,FALSE)))","v":""}]
[null,null,{"$f":"IF($B541=\"\",\"\",VLOOKUP($B541,Data!$A$4:$T$727,2,FALSE))","v":""},{"$f":"IF($B541=\"\",\"\",VLOOKUP($B541,Data!$A$4:$T$727,10,FALSE))","v":""},{"$f":"IF($B541=\"\",\"\",VLOOKUP($B541,Data!$A$4:$T$727,4,FALSE))","v":""},{"$f":"IF($B541=\"\",\"\",VLOOKUP($B541,Data!$A$4:$T$727,5,FALSE))","v":""},{"$f":"IF($B541=\"\",\"\",VLOOKUP($B541,Data!$A$4:$T$727,7,FALSE))","v":""},"","","","",{"$f":"IF($I$15=\"Show\",VLOOKUP($B541,Data!$A$4:$T$727,9,FALSE),VLOOKUP($B541,Data!$A$4:$T$727,7,FALSE))","v":{"$error":"#N/A"}},{"$f":"IF($B541=\"\",\"\",VLOOKUP($B541,Data!$A$4:$T$727,6,FALSE))","v":""},"",{"$f":"IF($B541=\"\",\"\",IF(VLOOKUP($B541,Data!$A$4:$T$727,11,FALSE)<1,\"\",VLOOKUP(B541,Data!$A$4:$T$727,11,FALSE)))","v":""}]
[null,null,{"$f":"IF($B542=\"\",\"\",VLOOKUP($B542,Data!$A$4:$T$727,2,FALSE))","v":""},{"$f":"IF($B542=\"\",\"\",VLOOKUP($B542,Data!$A$4:$T$727,10,FALSE))","v":""},{"$f":"IF($B542=\"\",\"\",VLOOKUP($B542,Data!$A$4:$T$727,4,FALSE))","v":""},{"$f":"IF($B542=\"\",\"\",VLOOKUP($B542,Data!$A$4:$T$727,5,FALSE))","v":""},{"$f":"IF($B542=\"\",\"\",VLOOKUP($B542,Data!$A$4:$T$727,7,FALSE))","v":""},"","","","",{"$f":"IF($I$15=\"Show\",VLOOKUP($B542,Data!$A$4:$T$727,9,FALSE),VLOOKUP($B542,Data!$A$4:$T$727,7,FALSE))","v":{"$error":"#N/A"}},{"$f":"IF($B542=\"\",\"\",VLOOKUP($B542,Data!$A$4:$T$727,6,FALSE))","v":""},"",{"$f":"IF($B542=\"\",\"\",IF(VLOOKUP($B542,Data!$A$4:$T$727,11,FALSE)<1,\"\",VLOOKUP(B542,Data!$A$4:$T$727,11,FALSE)))","v":""}]
[null,null,{"$f":"IF($B543=\"\",\"\",VLOOKUP($B543,Data!$A$4:$T$727,2,FALSE))","v":""},{"$f":"IF($B543=\"\",\"\",VLOOKUP($B543,Data!$A$4:$T$727,10,FALSE))","v":""},{"$f":"IF($B543=\"\",\"\",VLOOKUP($B543,Data!$A$4:$T$727,4,FALSE))","v":""},{"$f":"IF($B543=\"\",\"\",VLOOKUP($B543,Data!$A$4:$T$727,5,FALSE))","v":""},{"$f":"IF($B543=\"\",\"\",VLOOKUP($B543,Data!$A$4:$T$727,7,FALSE))","v":""},"","","","",{"$f":"IF($I$15=\"Show\",VLOOKUP($B543,Data!$A$4:$T$727,9,FALSE),VLOOKUP($B543,Data!$A$4:$T$727,7,FALSE))","v":{"$error":"#N/A"}},{"$f":"IF($B543=\"\",\"\",VLOOKUP($B543,Data!$A$4:$T$727,6,FALSE))","v":""},"",{"$f":"IF($B543=\"\",\"\",IF(VLOOKUP($B543,Data!$A$4:$T$727,11,FALSE)<1,\"\",VLOOKUP(B543,Data!$A$4:$T$727,11,FALSE)))","v":""}]
[null,null,{"$f":"IF($B544=\"\",\"\",VLOOKUP($B544,Data!$A$4:$T$727,2,FALSE))","v":""},{"$f":"IF($B544=\"\",\"\",VLOOKUP($B544,Data!$A$4:$T$727,10,FALSE))","v":""},{"$f":"IF($B544=\"\",\"\",VLOOKUP($B544,Data!$A$4:$T$727,4,FALSE))","v":""},{"$f":"IF($B544=\"\",\"\",VLOOKUP($B544,Data!$A$4:$T$727,5,FALSE))","v":""},{"$f":"IF($B544=\"\",\"\",VLOOKUP($B544,Data!$A$4:$T$727,7,FALSE))","v":""},"","","","",{"$f":"IF($I$15=\"Show\",VLOOKUP($B544,Data!$A$4:$T$727,9,FALSE),VLOOKUP($B544,Data!$A$4:$T$727,7,FALSE))","v":{"$error":"#N/A"}},{"$f":"IF($B544=\"\",\"\",VLOOKUP($B544,Data!$A$4:$T$727,6,FALSE))","v":""},"",{"$f":"IF($B544=\"\",\"\",IF(VLOOKUP($B544,Data!$A$4:$T$727,11,FALSE)<1,\"\",VLOOKUP(B544,Data!$A$4:$T$727,11,FALSE)))","v":""}]
[null,null,{"$f":"IF($B545=\"\",\"\",VLOOKUP($B545,Data!$A$4:$T$727,2,FALSE))","v":""},{"$f":"IF($B545=\"\",\"\",VLOOKUP($B545,Data!$A$4:$T$727,10,FALSE))","v":""},{"$f":"IF($B545=\"\",\"\",VLOOKUP($B545,Data!$A$4:$T$727,4,FALSE))","v":""},{"$f":"IF($B545=\"\",\"\",VLOOKUP($B545,Data!$A$4:$T$727,5,FALSE))","v":""},{"$f":"IF($B545=\"\",\"\",VLOOKUP($B545,Data!$A$4:$T$727,7,FALSE))","v":""},"","","","",{"$f":"IF($I$15=\"Show\",VLOOKUP($B545,Data!$A$4:$T$727,9,FALSE),VLOOKUP($B545,Data!$A$4:$T$727,7,FALSE))","v":{"$error":"#N/A"}},{"$f":"IF($B545=\"\",\"\",VLOOKUP($B545,Data!$A$4:$T$727,6,FALSE))","v":""},"",{"$f":"IF($B545=\"\",\"\",IF(VLOOKUP($B545,Data!$A$4:$T$727,11,FALSE)<1,\"\",VLOOKUP(B545,Data!$A$4:$T$727,11,FALSE)))","v":""}]
[null,null,{"$f":"IF($B546=\"\",\"\",VLOOKUP($B546,Data!$A$4:$T$727,2,FALSE))","v":""},{"$f":"IF($B546=\"\",\"\",VLOOKUP($B546,Data!$A$4:$T$727,10,FALSE))","v":""},{"$f":"IF($B546=\"\",\"\",VLOOKUP($B546,Data!$A$4:$T$727,4,FALSE))","v":""},{"$f":"IF($B546=\"\",\"\",VLOOKUP($B546,Data!$A$4:$T$727,5,FALSE))","v":""},{"$f":"IF($B546=\"\",\"\",VLOOKUP($B546,Data!$A$4:$T$727,7,FALSE))","v":""},"","","","",{"$f":"IF($I$15=\"Show\",VLOOKUP($B546,Data!$A$4:$T$727,9,FALSE),VLOOKUP($B546,Data!$A$4:$T$727,7,FALSE))","v":{"$error":"#N/A"}},{"$f":"IF($B546=\"\",\"\",VLOOKUP($B546,Data!$A$4:$T$727,6,FALSE))","v":""},"",{"$f":"IF($B546=\"\",\"\",IF(VLOOKUP($B546,Data!$A$4:$T$727,11,FALSE)<1,\"\",VLOOKUP(B546,Data!$A$4:$T$727,11,FALSE)))","v":""}]
[null,null,{"$f":"IF($B547=\"\",\"\",VLOOKUP($B547,Data!$A$4:$T$727,2,FALSE))","v":""},{"$f":"IF($B547=\"\",\"\",VLOOKUP($B547,Data!$A$4:$T$727,10,FALSE))","v":""},{"$f":"IF($B547=\"\",\"\",VLOOKUP($B547,Data!$A$4:$T$727,4,FALSE))","v":""},{"$f":"IF($B547=\"\",\"\",VLOOKUP($B547,Data!$A$4:$T$727,5,FALSE))","v":""},{"$f":"IF($B547=\"\",\"\",VLOOKUP($B547,Data!$A$4:$T$727,7,FALSE))","v":""},"","","","",{"$f":"IF($I$15=\"Show\",VLOOKUP($B547,Data!$A$4:$T$727,9,FALSE),VLOOKUP($B547,Data!$A$4:$T$727,7,FALSE))","v":{"$error":"#N/A"}},{"$f":"IF($B547=\"\",\"\",VLOOKUP($B547,Data!$A$4:$T$727,6,FALSE))","v":""},"",{"$f":"IF($B547=\"\",\"\",IF(VLOOKUP($B547,Data!$A$4:$T$727,11,FALSE)<1,\"\",VLOOKUP(B547,Data!$A$4:$T$727,11,FALSE)))","v":""}]
[null,null,{"$f":"IF($B548=\"\",\"\",VLOOKUP($B548,Data!$A$4:$T$727,2,FALSE))","v":""},{"$f":"IF($B548=\"\",\"\",VLOOKUP($B548,Data!$A$4:$T$727,10,FALSE))","v":""},{"$f":"IF($B548=\"\",\"\",VLOOKUP($B548,Data!$A$4:$T$727,4,FALSE))","v":""},{"$f":"IF($B548=\"\",\"\",VLOOKUP($B548,Data!$A$4:$T$727,5,FALSE))","v":""},{"$f":"IF($B548=\"\",\"\",VLOOKUP($B548,Data!$A$4:$T$727,7,FALSE))","v":""},"","","","",{"$f":"IF($I$15=\"Show\",VLOOKUP($B548,Data!$A$4:$T$727,9,FALSE),VLOOKUP($B548,Data!$A$4:$T$727,7,FALSE))","v":{"$error":"#N/A"}},{"$f":"IF($B548=\"\",\"\",VLOOKUP($B548,Data!$A$4:$T$727,6,FALSE))","v":""},"",{"$f":"IF($B548=\"\",\"\",IF(VLOOKUP($B548,Data!$A$4:$T$727,11,FALSE)<1,\"\",VLOOKUP(B548,Data!$A$4:$T$727,11,FALSE)))","v":""}]
[null,null,{"$f":"IF($B549=\"\",\"\",VLOOKUP($B549,Data!$A$4:$T$727,2,FALSE))","v":""},{"$f":"IF($B549=\"\",\"\",VLOOKUP($B549,Data!$A$4:$T$727,10,FALSE))","v":""},{"$f":"IF($B549=\"\",\"\",VLOOKUP($B549,Data!$A$4:$T$727,4,FALSE))","v":""},{"$f":"IF($B549=\"\",\"\",VLOOKUP($B549,Data!$A$4:$T$727,5,FALSE))","v":""},{"$f":"IF($B549=\"\",\"\",VLOOKUP($B549,Data!$A$4:$T$727,7,FALSE))","v":""},"","","","",{"$f":"IF($I$15=\"Show\",VLOOKUP($B549,Data!$A$4:$T$727,9,FALSE),VLOOKUP($B549,Data!$A$4:$T$727,7,FALSE))","v":{"$error":"#N/A"}},{"$f":"IF($B549=\"\",\"\",VLOOKUP($B549,Data!$A$4:$T$727,6,FALSE))","v":""},"",{"$f":"IF($B549=\"\",\"\",IF(VLOOKUP($B549,Data!$A$4:$T$727,11,FALSE)<1,\"\",VLOOKUP(B549,Data!$A$4:$T$727,11,FALSE)))","v":""}]
[null,null,{"$f":"IF($B550=\"\",\"\",VLOOKUP($B550,Data!$A$4:$T$727,2,FALSE))","v":""},{"$f":"IF($B550=\"\",\"\",VLOOKUP($B550,Data!$A$4:$T$727,10,FALSE))","v":""},{"$f":"IF($B550=\"\",\"\",VLOOKUP($B550,Data!$A$4:$T$727,4,FALSE))","v":""},{"$f":"IF($B550=\"\",\"\",VLOOKUP($B550,Data!$A$4:$T$727,5,FALSE))","v":""},{"$f":"IF($B550=\"\",\"\",VLOOKUP($B550,Data!$A$4:$T$727,7,FALSE))","v":""},"","","","",{"$f":"IF($I$15=\"Show\",VLOOKUP($B550,Data!$A$4:$T$727,9,FALSE),VLOOKUP($B550,Data!$A$4:$T$727,7,FALSE))","v":{"$error":"#N/A"}},{"$f":"IF($B550=\"\",\"\",VLOOKUP($B550,Data!$A$4:$T$727,6,FALSE))","v":""},"",{"$f":"IF($B550=\"\",\"\",IF(VLOOKUP($B550,Data!$A$4:$T$727,11,FALSE)<1,\"\",VLOOKUP(B550,Data!$A$4:$T$727,11,FALSE)))","v":""}]
[null,null,{"$f":"IF($B551=\"\",\"\",VLOOKUP($B551,Data!$A$4:$T$727,2,FALSE))","v":""},{"$f":"IF($B551=\"\",\"\",VLOOKUP($B551,Data!$A$4:$T$727,10,FALSE))","v":""},{"$f":"IF($B551=\"\",\"\",VLOOKUP($B551,Data!$A$4:$T$727,4,FALSE))","v":""},{"$f":"IF($B551=\"\",\"\",VLOOKUP($B551,Data!$A$4:$T$727,5,FALSE))","v":""},{"$f":"IF($B551=\"\",\"\",VLOOKUP($B551,Data!$A$4:$T$727,7,FALSE))","v":""},"","","","",{"$f":"IF($I$15=\"Show\",VLOOKUP($B551,Data!$A$4:$T$727,9,FALSE),VLOOKUP($B551,Data!$A$4:$T$727,7,FALSE))","v":{"$error":"#N/A"}},{"$f":"IF($B551=\"\",\"\",VLOOKUP($B551,Data!$A$4:$T$727,6,FALSE))","v":""},"",{"$f":"IF($B551=\"\",\"\",IF(VLOOKUP($B551,Data!$A$4:$T$727,11,FALSE)<1,\"\",VLOOKUP(B551,Data!$A$4:$T$727,11,FALSE)))","v":""}]
[null,null,{"$f":"IF($B552=\"\",\"\",VLOOKUP($B552,Data!$A$4:$T$727,2,FALSE))","v":""},{"$f":"IF($B552=\"\",\"\",VLOOKUP($B552,Data!$A$4:$T$727,10,FALSE))","v":""},{"$f":"IF($B552=\"\",\"\",VLOOKUP($B552,Data!$A$4:$T$727,4,FALSE))","v":""},{"$f":"IF($B552=\"\",\"\",VLOOKUP($B552,Data!$A$4:$T$727,5,FALSE))","v":""},{"$f":"IF($B552=\"\",\"\",VLOOKUP($B552,Data!$A$4:$T$727,7,FALSE))","v":""},"","","","",{"$f":"IF($I$15=\"Show\",VLOOKUP($B552,Data!$A$4:$T$727,9,FALSE),VLOOKUP($B552,Data!$A$4:$T$727,7,FALSE))","v":{"$error":"#N/A"}},{"$f":"IF($B552=\"\",\"\",VLOOKUP($B552,Data!$A$4:$T$727,6,FALSE))","v":""},"",{"$f":"IF($B552=\"\",\"\",IF(VLOOKUP($B552,Data!$A$4:$T$727,11,FALSE)<1,\"\",VLOOKUP(B552,Data!$A$4:$T$727,11,FALSE)))","v":""}]
[null,null,{"$f":"IF($B553=\"\",\"\",VLOOKUP($B553,Data!$A$4:$T$727,2,FALSE))","v":""},{"$f":"IF($B553=\"\",\"\",VLOOKUP($B553,Data!$A$4:$T$727,10,FALSE))","v":""},{"$f":"IF($B553=\"\",\"\",VLOOKUP($B553,Data!$A$4:$T$727,4,FALSE))","v":""},{"$f":"IF($B553=\"\",\"\",VLOOKUP($B553,Data!$A$4:$T$727,5,FALSE))","v":""},{"$f":"IF($B553=\"\",\"\",VLOOKUP($B553,Data!$A$4:$T$727,7,FALSE))","v":""},"","","","",{"$f":"IF($I$15=\"Show\",VLOOKUP($B553,Data!$A$4:$T$727,9,FALSE),VLOOKUP($B553,Data!$A$4:$T$727,7,FALSE))","v":{"$error":"#N/A"}},{"$f":"IF($B553=\"\",\"\",VLOOKUP($B553,Data!$A$4:$T$727,6,FALSE))","v":""},"",{"$f":"IF($B553=\"\",\"\",IF(VLOOKUP($B553,Data!$A$4:$T$727,11,FALSE)<1,\"\",VLOOKUP(B553,Data!$A$4:$T$727,11,FALSE)))","v":""}]
[null,null,{"$f":"IF($B554=\"\",\"\",VLOOKUP($B554,Data!$A$4:$T$727,2,FALSE))","v":""},{"$f":"IF($B554=\"\",\"\",VLOOKUP($B554,Data!$A$4:$T$727,10,FALSE))","v":""},{"$f":"IF($B554=\"\",\"\",VLOOKUP($B554,Data!$A$4:$T$727,4,FALSE))","v":""},{"$f":"IF($B554=\"\",\"\",VLOOKUP($B554,Data!$A$4:$T$727,5,FALSE))","v":""},{"$f":"IF($B554=\"\",\"\",VLOOKUP($B554,Data!$A$4:$T$727,7,FALSE))","v":""},"","","","",{"$f":"IF($I$15=\"Show\",VLOOKUP($B554,Data!$A$4:$T$727,9,FALSE),VLOOKUP($B554,Data!$A$4:$T$727,7,FALSE))","v":{"$error":"#N/A"}},{"$f":"IF($B554=\"\",\"\",VLOOKUP($B554,Data!$A$4:$T$727,6,FALSE))","v":""},"",{"$f":"IF($B554=\"\",\"\",IF(VLOOKUP($B554,Data!$A$4:$T$727,11,FALSE)<1,\"\",VLOOKUP(B554,Data!$A$4:$T$727,11,FALSE)))","v":""}]
[null,null,{"$f":"IF($B555=\"\",\"\",VLOOKUP($B555,Data!$A$4:$T$727,2,FALSE))","v":""},{"$f":"IF($B555=\"\",\"\",VLOOKUP($B555,Data!$A$4:$T$727,10,FALSE))","v":""},{"$f":"IF($B555=\"\",\"\",VLOOKUP($B555,Data!$A$4:$T$727,4,FALSE))","v":""},{"$f":"IF($B555=\"\",\"\",VLOOKUP($B555,Data!$A$4:$T$727,5,FALSE))","v":""},{"$f":"IF($B555=\"\",\"\",VLOOKUP($B555,Data!$A$4:$T$727,7,FALSE))","v":""},"","","","",{"$f":"IF($I$15=\"Show\",VLOOKUP($B555,Data!$A$4:$T$727,9,FALSE),VLOOKUP($B555,Data!$A$4:$T$727,7,FALSE))","v":{"$error":"#N/A"}},{"$f":"IF($B555=\"\",\"\",VLOOKUP($B555,Data!$A$4:$T$727,6,FALSE))","v":""},"",{"$f":"IF($B555=\"\",\"\",IF(VLOOKUP($B555,Data!$A$4:$T$727,11,FALSE)<1,\"\",VLOOKUP(B555,Data!$A$4:$T$727,11,FALSE)))","v":""}]
[null,null,{"$f":"IF($B556=\"\",\"\",VLOOKUP($B556,Data!$A$4:$T$727,2,FALSE))","v":""},{"$f":"IF($B556=\"\",\"\",VLOOKUP($B556,Data!$A$4:$T$727,10,FALSE))","v":""},{"$f":"IF($B556=\"\",\"\",VLOOKUP($B556,Data!$A$4:$T$727,4,FALSE))","v":""},{"$f":"IF($B556=\"\",\"\",VLOOKUP($B556,Data!$A$4:$T$727,5,FALSE))","v":""},{"$f":"IF($B556=\"\",\"\",VLOOKUP($B556,Data!$A$4:$T$727,7,FALSE))","v":""},"","","","",{"$f":"IF($I$15=\"Show\",VLOOKUP($B556,Data!$A$4:$T$727,9,FALSE),VLOOKUP($B556,Data!$A$4:$T$727,7,FALSE))","v":{"$error":"#N/A"}},{"$f":"IF($B556=\"\",\"\",VLOOKUP($B556,Data!$A$4:$T$727,6,FALSE))","v":""},"",{"$f":"IF($B556=\"\",\"\",IF(VLOOKUP($B556,Data!$A$4:$T$727,11,FALSE)<1,\"\",VLOOKUP(B556,Data!$A$4:$T$727,11,FALSE)))","v":""}]
[null,null,{"$f":"IF($B557=\"\",\"\",VLOOKUP($B557,Data!$A$4:$T$727,2,FALSE))","v":""},{"$f":"IF($B557=\"\",\"\",VLOOKUP($B557,Data!$A$4:$T$727,10,FALSE))","v":""},{"$f":"IF($B557=\"\",\"\",VLOOKUP($B557,Data!$A$4:$T$727,4,FALSE))","v":""},{"$f":"IF($B557=\"\",\"\",VLOOKUP($B557,Data!$A$4:$T$727,5,FALSE))","v":""},{"$f":"IF($B557=\"\",\"\",VLOOKUP($B557,Data!$A$4:$T$727,7,FALSE))","v":""},"","","","",{"$f":"IF($I$15=\"Show\",VLOOKUP($B557,Data!$A$4:$T$727,9,FALSE),VLOOKUP($B557,Data!$A$4:$T$727,7,FALSE))","v":{"$error":"#N/A"}},{"$f":"IF($B557=\"\",\"\",VLOOKUP($B557,Data!$A$4:$T$727,6,FALSE))","v":""},"",{"$f":"IF($B557=\"\",\"\",IF(VLOOKUP($B557,Data!$A$4:$T$727,11,FALSE)<1,\"\",VLOOKUP(B557,Data!$A$4:$T$727,11,FALSE)))","v":""}]
[null,null,{"$f":"IF($B558=\"\",\"\",VLOOKUP($B558,Data!$A$4:$T$727,2,FALSE))","v":""},{"$f":"IF($B558=\"\",\"\",VLOOKUP($B558,Data!$A$4:$T$727,10,FALSE))","v":""},{"$f":"IF($B558=\"\",\"\",VLOOKUP($B558,Data!$A$4:$T$727,4,FALSE))","v":""},{"$f":"IF($B558=\"\",\"\",VLOOKUP($B558,Data!$A$4:$T$727,5,FALSE))","v":""},{"$f":"IF($B558=\"\",\"\",VLOOKUP($B558,Data!$A$4:$T$727,7,FALSE))","v":""},"","","","",{"$f":"IF($I$15=\"Show\",VLOOKUP($B558,Data!$A$4:$T$727,9,FALSE),VLOOKUP($B558,Data!$A$4:$T$727,7,FALSE))","v":{"$error":"#N/A"}},{"$f":"IF($B558=\"\",\"\",VLOOKUP($B558,Data!$A$4:$T$727,6,FALSE))","v":""},"",{"$f":"IF($B558=\"\",\"\",IF(VLOOKUP($B558,Data!$A$4:$T$727,11,FALSE)<1,\"\",VLOOKUP(B558,Data!$A$4:$T$727,11,FALSE)))","v":""}]
[null,null,{"$f":"IF($B559=\"\",\"\",VLOOKUP($B559,Data!$A$4:$T$727,2,FALSE))","v":""},{"$f":"IF($B559=\"\",\"\",VLOOKUP($B559,Data!$A$4:$T$727,10,FALSE))","v":""},{"$f":"IF($B559=\"\",\"\",VLOOKUP($B559,Data!$A$4:$T$727,4,FALSE))","v":""},{"$f":"IF($B559=\"\",\"\",VLOOKUP($B559,Data!$A$4:$T$727,5,FALSE))","v":""},{"$f":"IF($B559=\"\",\"\",VLOOKUP($B559,Data!$A$4:$T$727,7,FALSE))","v":""},"","","","",{"$f":"IF($I$15=\"Show\",VLOOKUP($B559,Data!$A$4:$T$727,9,FALSE),VLOOKUP($B559,Data!$A$4:$T$727,7,FALSE))","v":{"$error":"#N/A"}},{"$f":"IF($B559=\"\",\"\",VLOOKUP($B559,Data!$A$4:$T$727,6,FALSE))","v":""},"",{"$f":"IF($B559=\"\",\"\",IF(VLOOKUP($B559,Data!$A$4:$T$727,11,FALSE)<1,\"\",VLOOKUP(B559,Data!$A$4:$T$727,11,FALSE)))","v":""}]
[null,null,{"$f":"IF($B560=\"\",\"\",VLOOKUP($B560,Data!$A$4:$T$727,2,FALSE))","v":""},{"$f":"IF($B560=\"\",\"\",VLOOKUP($B560,Data!$A$4:$T$727,10,FALSE))","v":""},{"$f":"IF($B560=\"\",\"\",VLOOKUP($B560,Data!$A$4:$T$727,4,FALSE))","v":""},{"$f":"IF($B560=\"\",\"\",VLOOKUP($B560,Data!$A$4:$T$727,5,FALSE))","v":""},{"$f":"IF($B560=\"\",\"\",VLOOKUP($B560,Data!$A$4:$T$727,7,FALSE))","v":""},"","","","",{"$f":"IF($I$15=\"Show\",VLOOKUP($B560,Data!$A$4:$T$727,9,FALSE),VLOOKUP($B560,Data!$A$4:$T$727,7,FALSE))","v":{"$error":"#N/A"}},{"$f":"IF($B560=\"\",\"\",VLOOKUP($B560,Data!$A$4:$T$727,6,FALSE))","v":""},"",{"$f":"IF($B560=\"\",\"\",IF(VLOOKUP($B560,Data!$A$4:$T$727,11,FALSE)<1,\"\",VLOOKUP(B560,Data!$A$4:$T$727,11,FALSE)))","v":""}]
[null,null,{"$f":"IF($B561=\"\",\"\",VLOOKUP($B561,Data!$A$4:$T$727,2,FALSE))","v":""},{"$f":"IF($B561=\"\",\"\",VLOOKUP($B561,Data!$A$4:$T$727,10,FALSE))","v":""},{"$f":"IF($B561=\"\",\"\",VLOOKUP($B561,Data!$A$4:$T$727,4,FALSE))","v":""},{"$f":"IF($B561=\"\",\"\",VLOOKUP($B561,Data!$A$4:$T$727,5,FALSE))","v":""},{"$f":"IF($B561=\"\",\"\",VLOOKUP($B561,Data!$A$4:$T$727,7,FALSE))","v":""},"","","","",{"$f":"IF($I$15=\"Show\",VLOOKUP($B561,Data!$A$4:$T$727,9,FALSE),VLOOKUP($B561,Data!$A$4:$T$727,7,FALSE))","v":{"$error":"#N/A"}},{"$f":"IF($B561=\"\",\"\",VLOOKUP($B561,Data!$A$4:$T$727,6,FALSE))","v":""},"",{"$f":"IF($B561=\"\",\"\",IF(VLOOKUP($B561,Data!$A$4:$T$727,11,FALSE)<1,\"\",VLOOKUP(B561,Data!$A$4:$T$727,11,FALSE)))","v":""}]
[null,null,{"$f":"IF($B562=\"\",\"\",VLOOKUP($B562,Data!$A$4:$T$727,2,FALSE))","v":""},{"$f":"IF($B562=\"\",\"\",VLOOKUP($B562,Data!$A$4:$T$727,10,FALSE))","v":""},{"$f":"IF($B562=\"\",\"\",VLOOKUP($B562,Data!$A$4:$T$727,4,FALSE))","v":""},{"$f":"IF($B562=\"\",\"\",VLOOKUP($B562,Data!$A$4:$T$727,5,FALSE))","v":""},{"$f":"IF($B562=\"\",\"\",VLOOKUP($B562,Data!$A$4:$T$727,7,FALSE))","v":""},"","","","",{"$f":"IF($I$15=\"Show\",VLOOKUP($B562,Data!$A$4:$T$727,9,FALSE),VLOOKUP($B562,Data!$A$4:$T$727,7,FALSE))","v":{"$error":"#N/A"}},{"$f":"IF($B562=\"\",\"\",VLOOKUP($B562,Data!$A$4:$T$727,6,FALSE))","v":""},"",{"$f":"IF($B562=\"\",\"\",IF(VLOOKUP($B562,Data!$A$4:$T$727,11,FALSE)<1,\"\",VLOOKUP(B562,Data!$A$4:$T$727,11,FALSE)))","v":""}]
[null,null,{"$f":"IF($B563=\"\",\"\",VLOOKUP($B563,Data!$A$4:$T$727,2,FALSE))","v":""},{"$f":"IF($B563=\"\",\"\",VLOOKUP($B563,Data!$A$4:$T$727,10,FALSE))","v":""},{"$f":"IF($B563=\"\",\"\",VLOOKUP($B563,Data!$A$4:$T$727,4,FALSE))","v":""},{"$f":"IF($B563=\"\",\"\",VLOOKUP($B563,Data!$A$4:$T$727,5,FALSE))","v":""},{"$f":"IF($B563=\"\",\"\",VLOOKUP($B563,Data!$A$4:$T$727,7,FALSE))","v":""},"","","","",{"$f":"IF($I$15=\"Show\",VLOOKUP($B563,Data!$A$4:$T$727,9,FALSE),VLOOKUP($B563,Data!$A$4:$T$727,7,FALSE))","v":{"$error":"#N/A"}},{"$f":"IF($B563=\"\",\"\",VLOOKUP($B563,Data!$A$4:$T$727,6,FALSE))","v":""},"",{"$f":"IF($B563=\"\",\"\",IF(VLOOKUP($B563,Data!$A$4:$T$727,11,FALSE)<1,\"\",VLOOKUP(B563,Data!$A$4:$T$727,11,FALSE)))","v":""}]
[null,null,{"$f":"IF($B564=\"\",\"\",VLOOKUP($B564,Data!$A$4:$T$727,2,FALSE))","v":""},{"$f":"IF($B564=\"\",\"\",VLOOKUP($B564,Data!$A$4:$T$727,10,FALSE))","v":""},{"$f":"IF($B564=\"\",\"\",VLOOKUP($B564,Data!$A$4:$T$727,4,FALSE))","v":""},{"$f":"IF($B564=\"\",\"\",VLOOKUP($B564,Data!$A$4:$T$727,5,FALSE))","v":""},{"$f":"IF($B564=\"\",\"\",VLOOKUP($B564,Data!$A$4:$T$727,7,FALSE))","v":""},"","","","",{"$f":"IF($I$15=\"Show\",VLOOKUP($B564,Data!$A$4:$T$727,9,FALSE),VLOOKUP($B564,Data!$A$4:$T$727,7,FALSE))","v":{"$error":"#N/A"}},{"$f":"IF($B564=\"\",\"\",VLOOKUP($B564,Data!$A$4:$T$727,6,FALSE))","v":""},"",{"$f":"IF($B564=\"\",\"\",IF(VLOOKUP($B564,Data!$A$4:$T$727,11,FALSE)<1,\"\",VLOOKUP(B564,Data!$A$4:$T$727,11,FALSE)))","v":""}]
[null,null,{"$f":"IF($B565=\"\",\"\",VLOOKUP($B565,Data!$A$4:$T$727,2,FALSE))","v":""},{"$f":"IF($B565=\"\",\"\",VLOOKUP($B565,Data!$A$4:$T$727,10,FALSE))","v":""},{"$f":"IF($B565=\"\",\"\",VLOOKUP($B565,Data!$A$4:$T$727,4,FALSE))","v":""},{"$f":"IF($B565=\"\",\"\",VLOOKUP($B565,Data!$A$4:$T$727,5,FALSE))","v":""},{"$f":"IF($B565=\"\",\"\",VLOOKUP($B565,Data!$A$4:$T$727,7,FALSE))","v":""},"","","","",{"$f":"IF($I$15=\"Show\",VLOOKUP($B565,Data!$A$4:$T$727,9,FALSE),VLOOKUP($B565,Data!$A$4:$T$727,7,FALSE))","v":{"$error":"#N/A"}},{"$f":"IF($B565=\"\",\"\",VLOOKUP($B565,Data!$A$4:$T$727,6,FALSE))","v":""},"",{"$f":"IF($B565=\"\",\"\",IF(VLOOKUP($B565,Data!$A$4:$T$727,11,FALSE)<1,\"\",VLOOKUP(B565,Data!$A$4:$T$727,11,FALSE)))","v":""}]
[null,null,{"$f":"IF($B566=\"\",\"\",VLOOKUP($B566,Data!$A$4:$T$727,2,FALSE))","v":""},{"$f":"IF($B566=\"\",\"\",VLOOKUP($B566,Data!$A$4:$T$727,10,FALSE))","v":""},{"$f":"IF($B566=\"\",\"\",VLOOKUP($B566,Data!$A$4:$T$727,4,FALSE))","v":""},{"$f":"IF($B566=\"\",\"\",VLOOKUP($B566,Data!$A$4:$T$727,5,FALSE))","v":""},{"$f":"IF($B566=\"\",\"\",VLOOKUP($B566,Data!$A$4:$T$727,7,FALSE))","v":""},"","","","",{"$f":"IF($I$15=\"Show\",VLOOKUP($B566,Data!$A$4:$T$727,9,FALSE),VLOOKUP($B566,Data!$A$4:$T$727,7,FALSE))","v":{"$error":"#N/A"}},{"$f":"IF($B566=\"\",\"\",VLOOKUP($B566,Data!$A$4:$T$727,6,FALSE))","v":""},"",{"$f":"IF($B566=\"\",\"\",IF(VLOOKUP($B566,Data!$A$4:$T$727,11,FALSE)<1,\"\",VLOOKUP(B566,Data!$A$4:$T$727,11,FALSE)))","v":""}]
[null,null,{"$f":"IF($B567=\"\",\"\",VLOOKUP($B567,Data!$A$4:$T$727,2,FALSE))","v":""},{"$f":"IF($B567=\"\",\"\",VLOOKUP($B567,Data!$A$4:$T$727,10,FALSE))","v":""},{"$f":"IF($B567=\"\",\"\",VLOOKUP($B567,Data!$A$4:$T$727,4,FALSE))","v":""},{"$f":"IF($B567=\"\",\"\",VLOOKUP($B567,Data!$A$4:$T$727,5,FALSE))","v":""},{"$f":"IF($B567=\"\",\"\",VLOOKUP($B567,Data!$A$4:$T$727,7,FALSE))","v":""},"","","","",{"$f":"IF($I$15=\"Show\",VLOOKUP($B567,Data!$A$4:$T$727,9,FALSE),VLOOKUP($B567,Data!$A$4:$T$727,7,FALSE))","v":{"$error":"#N/A"}},{"$f":"IF($B567=\"\",\"\",VLOOKUP($B567,Data!$A$4:$T$727,6,FALSE))","v":""},"",{"$f":"IF($B567=\"\",\"\",IF(VLOOKUP($B567,Data!$A$4:$T$727,11,FALSE)<1,\"\",VLOOKUP(B567,Data!$A$4:$T$727,11,FALSE)))","v":""}]
[null,null,{"$f":"IF($B568=\"\",\"\",VLOOKUP($B568,Data!$A$4:$T$727,2,FALSE))","v":""},{"$f":"IF($B568=\"\",\"\",VLOOKUP($B568,Data!$A$4:$T$727,10,FALSE))","v":""},{"$f":"IF($B568=\"\",\"\",VLOOKUP($B568,Data!$A$4:$T$727,4,FALSE))","v":""},{"$f":"IF($B568=\"\",\"\",VLOOKUP($B568,Data!$A$4:$T$727,5,FALSE))","v":""},{"$f":"IF($B568=\"\",\"\",VLOOKUP($B568,Data!$A$4:$T$727,7,FALSE))","v":""},"","","","",{"$f":"IF($I$15=\"Show\",VLOOKUP($B568,Data!$A$4:$T$727,9,FALSE),VLOOKUP($B568,Data!$A$4:$T$727,7,FALSE))","v":{"$error":"#N/A"}},{"$f":"IF($B568=\"\",\"\",VLOOKUP($B568,Data!$A$4:$T$727,6,FALSE))","v":""},"",{"$f":"IF($B568=\"\",\"\",IF(VLOOKUP($B568,Data!$A$4:$T$727,11,FALSE)<1,\"\",VLOOKUP(B568,Data!$A$4:$T$727,11,FALSE)))","v":""}]
[null,null,{"$f":"IF($B569=\"\",\"\",VLOOKUP($B569,Data!$A$4:$T$727,2,FALSE))","v":""},{"$f":"IF($B569=\"\",\"\",VLOOKUP($B569,Data!$A$4:$T$727,10,FALSE))","v":""},{"$f":"IF($B569=\"\",\"\",VLOOKUP($B569,Data!$A$4:$T$727,4,FALSE))","v":""},{"$f":"IF($B569=\"\",\"\",VLOOKUP($B569,Data!$A$4:$T$727,5,FALSE))","v":""},{"$f":"IF($B569=\"\",\"\",VLOOKUP($B569,Data!$A$4:$T$727,7,FALSE))","v":""},"","","","",{"$f":"IF($I$15=\"Show\",VLOOKUP($B569,Data!$A$4:$T$727,9,FALSE),VLOOKUP($B569,Data!$A$4:$T$727,7,FALSE))","v":{"$error":"#N/A"}},{"$f":"IF($B569=\"\",\"\",VLOOKUP($B569,Data!$A$4:$T$727,6,FALSE))","v":""},"",{"$f":"IF($B569=\"\",\"\",IF(VLOOKUP($B569,Data!$A$4:$T$727,11,FALSE)<1,\"\",VLOOKUP(B569,Data!$A$4:$T$727,11,FALSE)))","v":""}]
[null,null,{"$f":"IF($B570=\"\",\"\",VLOOKUP($B570,Data!$A$4:$T$727,2,FALSE))","v":""},{"$f":"IF($B570=\"\",\"\",VLOOKUP($B570,Data!$A$4:$T$727,10,FALSE))","v":""},{"$f":"IF($B570=\"\",\"\",VLOOKUP($B570,Data!$A$4:$T$727,4,FALSE))","v":""},{"$f":"IF($B570=\"\",\"\",VLOOKUP($B570,Data!$A$4:$T$727,5,FALSE))","v":""},{"$f":"IF($B570=\"\",\"\",VLOOKUP($B570,Data!$A$4:$T$727,7,FALSE))","v":""},"","","","",{"$f":"IF($I$15=\"Show\",VLOOKUP($B570,Data!$A$4:$T$727,9,FALSE),VLOOKUP($B570,Data!$A$4:$T$727,7,FALSE))","v":{"$error":"#N/A"}},{"$f":"IF($B570=\"\",\"\",VLOOKUP($B570,Data!$A$4:$T$727,6,FALSE))","v":""},"",{"$f":"IF($B570=\"\",\"\",IF(VLOOKUP($B570,Data!$A$4:$T$727,11,FALSE)<1,\"\",VLOOKUP(B570,Data!$A$4:$T$727,11,FALSE)))","v":""}]
[null,null,{"$f":"IF($B571=\"\",\"\",VLOOKUP($B571,Data!$A$4:$T$727,2,FALSE))","v":""},{"$f":"IF($B571=\"\",\"\",VLOOKUP($B571,Data!$A$4:$T$727,10,FALSE))","v":""},{"$f":"IF($B571=\"\",\"\",VLOOKUP($B571,Data!$A$4:$T$727,4,FALSE))","v":""},{"$f":"IF($B571=\"\",\"\",VLOOKUP($B571,Data!$A$4:$T$727,5,FALSE))","v":""},{"$f":"IF($B571=\"\",\"\",VLOOKUP($B571,Data!$A$4:$T$727,7,FALSE))","v":""},"","","","",{"$f":"IF($I$15=\"Show\",VLOOKUP($B571,Data!$A$4:$T$727,9,FALSE),VLOOKUP($B571,Data!$A$4:$T$727,7,FALSE))","v":{"$error":"#N/A"}},{"$f":"IF($B571=\"\",\"\",VLOOKUP($B571,Data!$A$4:$T$727,6,FALSE))","v":""},"",{"$f":"IF($B571=\"\",\"\",IF(VLOOKUP($B571,Data!$A$4:$T$727,11,FALSE)<1,\"\",VLOOKUP(B571,Data!$A$4:$T$727,11,FALSE)))","v":""}]
[null,null,{"$f":"IF($B572=\"\",\"\",VLOOKUP($B572,Data!$A$4:$T$727,2,FALSE))","v":""},{"$f":"IF($B572=\"\",\"\",VLOOKUP($B572,Data!$A$4:$T$727,10,FALSE))","v":""},{"$f":"IF($B572=\"\",\"\",VLOOKUP($B572,Data!$A$4:$T$727,4,FALSE))","v":""},{"$f":"IF($B572=\"\",\"\",VLOOKUP($B572,Data!$A$4:$T$727,5,FALSE))","v":""},{"$f":"IF($B572=\"\",\"\",VLOOKUP($B572,Data!$A$4:$T$727,7,FALSE))","v":""},"","","","",{"$f":"IF($I$15=\"Show\",VLOOKUP($B572,Data!$A$4:$T$727,9,FALSE),VLOOKUP($B572,Data!$A$4:$T$727,7,FALSE))","v":{"$error":"#N/A"}},{"$f":"IF($B572=\"\",\"\",VLOOKUP($B572,Data!$A$4:$T$727,6,FALSE))","v":""},"",{"$f":"IF($B572=\"\",\"\",IF(VLOOKUP($B572,Data!$A$4:$T$727,11,FALSE)<1,\"\",VLOOKUP(B572,Data!$A$4:$T$727,11,FALSE)))","v":""}]
[null,null,{"$f":"IF($B573=\"\",\"\",VLOOKUP($B573,Data!$A$4:$T$727,2,FALSE))","v":""},{"$f":"IF($B573=\"\",\"\",VLOOKUP($B573,Data!$A$4:$T$727,10,FALSE))","v":""},{"$f":"IF($B573=\"\",\"\",VLOOKUP($B573,Data!$A$4:$T$727,4,FALSE))","v":""},{"$f":"IF($B573=\"\",\"\",VLOOKUP($B573,Data!$A$4:$T$727,5,FALSE))","v":""},{"$f":"IF($B573=\"\",\"\",VLOOKUP($B573,Data!$A$4:$T$727,7,FALSE))","v":""},"","","","",{"$f":"IF($I$15=\"Show\",VLOOKUP($B573,Data!$A$4:$T$727,9,FALSE),VLOOKUP($B573,Data!$A$4:$T$727,7,FALSE))","v":{"$error":"#N/A"}},{"$f":"IF($B573=\"\",\"\",VLOOKUP($B573,Data!$A$4:$T$727,6,FALSE))","v":""},"",{"$f":"IF($B573=\"\",\"\",IF(VLOOKUP($B573,Data!$A$4:$T$727,11,FALSE)<1,\"\",VLOOKUP(B573,Data!$A$4:$T$727,11,FALSE)))","v":""}]
[null,null,{"$f":"IF($B574=\"\",\"\",VLOOKUP($B574,Data!$A$4:$T$727,2,FALSE))","v":""},{"$f":"IF($B574=\"\",\"\",VLOOKUP($B574,Data!$A$4:$T$727,10,FALSE))","v":""},{"$f":"IF($B574=\"\",\"\",VLOOKUP($B574,Data!$A$4:$T$727,4,FALSE))","v":""},{"$f":"IF($B574=\"\",\"\",VLOOKUP($B574,Data!$A$4:$T$727,5,FALSE))","v":""},{"$f":"IF($B574=\"\",\"\",VLOOKUP($B574,Data!$A$4:$T$727,7,FALSE))","v":""},"","","","",{"$f":"IF($I$15=\"Show\",VLOOKUP($B574,Data!$A$4:$T$727,9,FALSE),VLOOKUP($B574,Data!$A$4:$T$727,7,FALSE))","v":{"$error":"#N/A"}},{"$f":"IF($B574=\"\",\"\",VLOOKUP($B574,Data!$A$4:$T$727,6,FALSE))","v":""},"",{"$f":"IF($B574=\"\",\"\",IF(VLOOKUP($B574,Data!$A$4:$T$727,11,FALSE)<1,\"\",VLOOKUP(B574,Data!$A$4:$T$727,11,FALSE)))","v":""}]
[null,null,{"$f":"IF($B575=\"\",\"\",VLOOKUP($B575,Data!$A$4:$T$727,2,FALSE))","v":""},{"$f":"IF($B575=\"\",\"\",VLOOKUP($B575,Data!$A$4:$T$727,10,FALSE))","v":""},{"$f":"IF($B575=\"\",\"\",VLOOKUP($B575,Data!$A$4:$T$727,4,FALSE))","v":""},{"$f":"IF($B575=\"\",\"\",VLOOKUP($B575,Data!$A$4:$T$727,5,FALSE))","v":""},{"$f":"IF($B575=\"\",\"\",VLOOKUP($B575,Data!$A$4:$T$727,7,FALSE))","v":""},"","","","",{"$f":"IF($I$15=\"Show\",VLOOKUP($B575,Data!$A$4:$T$727,9,FALSE),VLOOKUP($B575,Data!$A$4:$T$727,7,FALSE))","v":{"$error":"#N/A"}},{"$f":"IF($B575=\"\",\"\",VLOOKUP($B575,Data!$A$4:$T$727,6,FALSE))","v":""},"",{"$f":"IF($B575=\"\",\"\",IF(VLOOKUP($B575,Data!$A$4:$T$727,11,FALSE)<1,\"\",VLOOKUP(B575,Data!$A$4:$T$727,11,FALSE)))","v":""}]
[null,null,{"$f":"IF($B576=\"\",\"\",VLOOKUP($B576,Data!$A$4:$T$727,2,FALSE))","v":""},{"$f":"IF($B576=\"\",\"\",VLOOKUP($B576,Data!$A$4:$T$727,10,FALSE))","v":""},{"$f":"IF($B576=\"\",\"\",VLOOKUP($B576,Data!$A$4:$T$727,4,FALSE))","v":""},{"$f":"IF($B576=\"\",\"\",VLOOKUP($B576,Data!$A$4:$T$727,5,FALSE))","v":""},{"$f":"IF($B576=\"\",\"\",VLOOKUP($B576,Data!$A$4:$T$727,7,FALSE))","v":""},"","","","",{"$f":"IF($I$15=\"Show\",VLOOKUP($B576,Data!$A$4:$T$727,9,FALSE),VLOOKUP($B576,Data!$A$4:$T$727,7,FALSE))","v":{"$error":"#N/A"}},{"$f":"IF($B576=\"\",\"\",VLOOKUP($B576,Data!$A$4:$T$727,6,FALSE))","v":""},"",{"$f":"IF($B576=\"\",\"\",IF(VLOOKUP($B576,Data!$A$4:$T$727,11,FALSE)<1,\"\",VLOOKUP(B576,Data!$A$4:$T$727,11,FALSE)))","v":""}]
[null,null,{"$f":"IF($B577=\"\",\"\",VLOOKUP($B577,Data!$A$4:$T$727,2,FALSE))","v":""},{"$f":"IF($B577=\"\",\"\",VLOOKUP($B577,Data!$A$4:$T$727,10,FALSE))","v":""},{"$f":"IF($B577=\"\",\"\",VLOOKUP($B577,Data!$A$4:$T$727,4,FALSE))","v":""},{"$f":"IF($B577=\"\",\"\",VLOOKUP($B577,Data!$A$4:$T$727,5,FALSE))","v":""},{"$f":"IF($B577=\"\",\"\",VLOOKUP($B577,Data!$A$4:$T$727,7,FALSE))","v":""},"","","","",{"$f":"IF($I$15=\"Show\",VLOOKUP($B577,Data!$A$4:$T$727,9,FALSE),VLOOKUP($B577,Data!$A$4:$T$727,7,FALSE))","v":{"$error":"#N/A"}},{"$f":"IF($B577=\"\",\"\",VLOOKUP($B577,Data!$A$4:$T$727,6,FALSE))","v":""},"",{"$f":"IF($B577=\"\",\"\",IF(VLOOKUP($B577,Data!$A$4:$T$727,11,FALSE)<1,\"\",VLOOKUP(B577,Data!$A$4:$T$727,11,FALSE)))","v":""}]
[null,null,{"$f":"IF($B578=\"\",\"\",VLOOKUP($B578,Data!$A$4:$T$727,2,FALSE))","v":""},{"$f":"IF($B578=\"\",\"\",VLOOKUP($B578,Data!$A$4:$T$727,10,FALSE))","v":""},{"$f":"IF($B578=\"\",\"\",VLOOKUP($B578,Data!$A$4:$T$727,4,FALSE))","v":""},{"$f":"IF($B578=\"\",\"\",VLOOKUP($B578,Data!$A$4:$T$727,5,FALSE))","v":""},{"$f":"IF($B578=\"\",\"\",VLOOKUP($B578,Data!$A$4:$T$727,7,FALSE))","v":""},"","","","",{"$f":"IF($I$15=\"Show\",VLOOKUP($B578,Data!$A$4:$T$727,9,FALSE),VLOOKUP($B578,Data!$A$4:$T$727,7,FALSE))","v":{"$error":"#N/A"}},{"$f":"IF($B578=\"\",\"\",VLOOKUP($B578,Data!$A$4:$T$727,6,FALSE))","v":""},"",{"$f":"IF($B578=\"\",\"\",IF(VLOOKUP($B578,Data!$A$4:$T$727,11,FALSE)<1,\"\",VLOOKUP(B578,Data!$A$4:$T$727,11,FALSE)))","v":""}]
[null,null,{"$f":"IF($B579=\"\",\"\",VLOOKUP($B579,Data!$A$4:$T$727,2,FALSE))","v":""},{"$f":"IF($B579=\"\",\"\",VLOOKUP($B579,Data!$A$4:$T$727,10,FALSE))","v":""},{"$f":"IF($B579=\"\",\"\",VLOOKUP($B579,Data!$A$4:$T$727,4,FALSE))","v":""},{"$f":"IF($B579=\"\",\"\",VLOOKUP($B579,Data!$A$4:$T$727,5,FALSE))","v":""},{"$f":"IF($B579=\"\",\"\",VLOOKUP($B579,Data!$A$4:$T$727,7,FALSE))","v":""},"","","","",{"$f":"IF($I$15=\"Show\",VLOOKUP($B579,Data!$A$4:$T$727,9,FALSE),VLOOKUP($B579,Data!$A$4:$T$727,7,FALSE))","v":{"$error":"#N/A"}},{"$f":"IF($B579=\"\",\"\",VLOOKUP($B579,Data!$A$4:$T$727,6,FALSE))","v":""},"",{"$f":"IF($B579=\"\",\"\",IF(VLOOKUP($B579,Data!$A$4:$T$727,11,FALSE)<1,\"\",VLOOKUP(B579,Data!$A$4:$T$727,11,FALSE)))","v":""}]
[null,null,{"$f":"IF($B580=\"\",\"\",VLOOKUP($B580,Data!$A$4:$T$727,2,FALSE))","v":""},{"$f":"IF($B580=\"\",\"\",VLOOKUP($B580,Data!$A$4:$T$727,10,FALSE))","v":""},{"$f":"IF($B580=\"\",\"\",VLOOKUP($B580,Data!$A$4:$T$727,4,FALSE))","v":""},{"$f":"IF($B580=\"\",\"\",VLOOKUP($B580,Data!$A$4:$T$727,5,FALSE))","v":""},{"$f":"IF($B580=\"\",\"\",VLOOKUP($B580,Data!$A$4:$T$727,7,FALSE))","v":""},"","","","",{"$f":"IF($I$15=\"Show\",VLOOKUP($B580,Data!$A$4:$T$727,9,FALSE),VLOOKUP($B580,Data!$A$4:$T$727,7,FALSE))","v":{"$error":"#N/A"}},{"$f":"IF($B580=\"\",\"\",VLOOKUP($B580,Data!$A$4:$T$727,6,FALSE))","v":""},"",{"$f":"IF($B580=\"\",\"\",IF(VLOOKUP($B580,Data!$A$4:$T$727,11,FALSE)<1,\"\",VLOOKUP(B580,Data!$A$4:$T$727,11,FALSE)))","v":""}]
[null,null,{"$f":"IF($B581=\"\",\"\",VLOOKUP($B581,Data!$A$4:$T$727,2,FALSE))","v":""},{"$f":"IF($B581=\"\",\"\",VLOOKUP($B581,Data!$A$4:$T$727,10,FALSE))","v":""},{"$f":"IF($B581=\"\",\"\",VLOOKUP($B581,Data!$A$4:$T$727,4,FALSE))","v":""},{"$f":"IF($B581=\"\",\"\",VLOOKUP($B581,Data!$A$4:$T$727,5,FALSE))","v":""},{"$f":"IF($B581=\"\",\"\",VLOOKUP($B581,Data!$A$4:$T$727,7,FALSE))","v":""},"","","","",{"$f":"IF($I$15=\"Show\",VLOOKUP($B581,Data!$A$4:$T$727,9,FALSE),VLOOKUP($B581,Data!$A$4:$T$727,7,FALSE))","v":{"$error":"#N/A"}},{"$f":"IF($B581=\"\",\"\",VLOOKUP($B581,Data!$A$4:$T$727,6,FALSE))","v":""},"",{"$f":"IF($B581=\"\",\"\",IF(VLOOKUP($B581,Data!$A$4:$T$727,11,FALSE)<1,\"\",VLOOKUP(B581,Data!$A$4:$T$727,11,FALSE)))","v":""}]
[null,null,{"$f":"IF($B582=\"\",\"\",VLOOKUP($B582,Data!$A$4:$T$727,2,FALSE))","v":""},{"$f":"IF($B582=\"\",\"\",VLOOKUP($B582,Data!$A$4:$T$727,10,FALSE))","v":""},{"$f":"IF($B582=\"\",\"\",VLOOKUP($B582,Data!$A$4:$T$727,4,FALSE))","v":""},{"$f":"IF($B582=\"\",\"\",VLOOKUP($B582,Data!$A$4:$T$727,5,FALSE))","v":""},{"$f":"IF($B582=\"\",\"\",VLOOKUP($B582,Data!$A$4:$T$727,7,FALSE))","v":""},"","","","",{"$f":"IF($I$15=\"Show\",VLOOKUP($B582,Data!$A$4:$T$727,9,FALSE),VLOOKUP($B582,Data!$A$4:$T$727,7,FALSE))","v":{"$error":"#N/A"}},{"$f":"IF($B582=\"\",\"\",VLOOKUP($B582,Data!$A$4:$T$727,6,FALSE))","v":""},"",{"$f":"IF($B582=\"\",\"\",IF(VLOOKUP($B582,Data!$A$4:$T$727,11,FALSE)<1,\"\",VLOOKUP(B582,Data!$A$4:$T$727,11,FALSE)))","v":""}]
[null,null,{"$f":"IF($B583=\"\",\"\",VLOOKUP($B583,Data!$A$4:$T$727,2,FALSE))","v":""},{"$f":"IF($B583=\"\",\"\",VLOOKUP($B583,Data!$A$4:$T$727,10,FALSE))","v":""},{"$f":"IF($B583=\"\",\"\",VLOOKUP($B583,Data!$A$4:$T$727,4,FALSE))","v":""},{"$f":"IF($B583=\"\",\"\",VLOOKUP($B583,Data!$A$4:$T$727,5,FALSE))","v":""},{"$f":"IF($B583=\"\",\"\",VLOOKUP($B583,Data!$A$4:$T$727,7,FALSE))","v":""},"","","","",{"$f":"IF($I$15=\"Show\",VLOOKUP($B583,Data!$A$4:$T$727,9,FALSE),VLOOKUP($B583,Data!$A$4:$T$727,7,FALSE))","v":{"$error":"#N/A"}},{"$f":"IF($B583=\"\",\"\",VLOOKUP($B583,Data!$A$4:$T$727,6,FALSE))","v":""},"",{"$f":"IF($B583=\"\",\"\",IF(VLOOKUP($B583,Data!$A$4:$T$727,11,FALSE)<1,\"\",VLOOKUP(B583,Data!$A$4:$T$727,11,FALSE)))","v":""}]
[null,null,{"$f":"IF($B584=\"\",\"\",VLOOKUP($B584,Data!$A$4:$T$727,2,FALSE))","v":""},{"$f":"IF($B584=\"\",\"\",VLOOKUP($B584,Data!$A$4:$T$727,10,FALSE))","v":""},{"$f":"IF($B584=\"\",\"\",VLOOKUP($B584,Data!$A$4:$T$727,4,FALSE))","v":""},{"$f":"IF($B584=\"\",\"\",VLOOKUP($B584,Data!$A$4:$T$727,5,FALSE))","v":""},{"$f":"IF($B584=\"\",\"\",VLOOKUP($B584,Data!$A$4:$T$727,7,FALSE))","v":""},"","","","",{"$f":"IF($I$15=\"Show\",VLOOKUP($B584,Data!$A$4:$T$727,9,FALSE),VLOOKUP($B584,Data!$A$4:$T$727,7,FALSE))","v":{"$error":"#N/A"}},{"$f":"IF($B584=\"\",\"\",VLOOKUP($B584,Data!$A$4:$T$727,6,FALSE))","v":""},"",{"$f":"IF($B584=\"\",\"\",IF(VLOOKUP($B584,Data!$A$4:$T$727,11,FALSE)<1,\"\",VLOOKUP(B584,Data!$A$4:$T$727,11,FALSE)))","v":""}]
[null,null,{"$f":"IF($B585=\"\",\"\",VLOOKUP($B585,Data!$A$4:$T$727,2,FALSE))","v":""},{"$f":"IF($B585=\"\",\"\",VLOOKUP($B585,Data!$A$4:$T$727,10,FALSE))","v":""},{"$f":"IF($B585=\"\",\"\",VLOOKUP($B585,Data!$A$4:$T$727,4,FALSE))","v":""},{"$f":"IF($B585=\"\",\"\",VLOOKUP($B585,Data!$A$4:$T$727,5,FALSE))","v":""},{"$f":"IF($B585=\"\",\"\",VLOOKUP($B585,Data!$A$4:$T$727,7,FALSE))","v":""},"","","","",{"$f":"IF($I$15=\"Show\",VLOOKUP($B585,Data!$A$4:$T$727,9,FALSE),VLOOKUP($B585,Data!$A$4:$T$727,7,FALSE))","v":{"$error":"#N/A"}},{"$f":"IF($B585=\"\",\"\",VLOOKUP($B585,Data!$A$4:$T$727,6,FALSE))","v":""},"",{"$f":"IF($B585=\"\",\"\",IF(VLOOKUP($B585,Data!$A$4:$T$727,11,FALSE)<1,\"\",VLOOKUP(B585,Data!$A$4:$T$727,11,FALSE)))","v":""}]
[null,null,{"$f":"IF($B586=\"\",\"\",VLOOKUP($B586,Data!$A$4:$T$727,2,FALSE))","v":""},{"$f":"IF($B586=\"\",\"\",VLOOKUP($B586,Data!$A$4:$T$727,10,FALSE))","v":""},{"$f":"IF($B586=\"\",\"\",VLOOKUP($B586,Data!$A$4:$T$727,4,FALSE))","v":""},{"$f":"IF($B586=\"\",\"\",VLOOKUP($B586,Data!$A$4:$T$727,5,FALSE))","v":""},{"$f":"IF($B586=\"\",\"\",VLOOKUP($B586,Data!$A$4:$T$727,7,FALSE))","v":""},"","","","",{"$f":"IF($I$15=\"Show\",VLOOKUP($B586,Data!$A$4:$T$727,9,FALSE),VLOOKUP($B586,Data!$A$4:$T$727,7,FALSE))","v":{"$error":"#N/A"}},{"$f":"IF($B586=\"\",\"\",VLOOKUP($B586,Data!$A$4:$T$727,6,FALSE))","v":""},"",{"$f":"IF($B586=\"\",\"\",IF(VLOOKUP($B586,Data!$A$4:$T$727,11,FALSE)<1,\"\",VLOOKUP(B586,Data!$A$4:$T$727,11,FALSE)))","v":""}]
[null,null,{"$f":"IF($B587=\"\",\"\",VLOOKUP($B587,Data!$A$4:$T$727,2,FALSE))","v":""},{"$f":"IF($B587=\"\",\"\",VLOOKUP($B587,Data!$A$4:$T$727,10,FALSE))","v":""},{"$f":"IF($B587=\"\",\"\",VLOOKUP($B587,Data!$A$4:$T$727,4,FALSE))","v":""},{"$f":"IF($B587=\"\",\"\",VLOOKUP($B587,Data!$A$4:$T$727,5,FALSE))","v":""},{"$f":"IF($B587=\"\",\"\",VLOOKUP($B587,Data!$A$4:$T$727,7,FALSE))","v":""},"","","","",{"$f":"IF($I$15=\"Show\",VLOOKUP($B587,Data!$A$4:$T$727,9,FALSE),VLOOKUP($B587,Data!$A$4:$T$727,7,FALSE))","v":{"$error":"#N/A"}},{"$f":"IF($B587=\"\",\"\",VLOOKUP($B587,Data!$A$4:$T$727,6,FALSE))","v":""},"",{"$f":"IF($B587=\"\",\"\",IF(VLOOKUP($B587,Data!$A$4:$T$727,11,FALSE)<1,\"\",VLOOKUP(B587,Data!$A$4:$T$727,11,FALSE)))","v":""}]
[null,null,{"$f":"IF($B588=\"\",\"\",VLOOKUP($B588,Data!$A$4:$T$727,2,FALSE))","v":""},{"$f":"IF($B588=\"\",\"\",VLOOKUP($B588,Data!$A$4:$T$727,10,FALSE))","v":""},{"$f":"IF($B588=\"\",\"\",VLOOKUP($B588,Data!$A$4:$T$727,4,FALSE))","v":""},{"$f":"IF($B588=\"\",\"\",VLOOKUP($B588,Data!$A$4:$T$727,5,FALSE))","v":""},{"$f":"IF($B588=\"\",\"\",VLOOKUP($B588,Data!$A$4:$T$727,7,FALSE))","v":""},"","","","",{"$f":"IF($I$15=\"Show\",VLOOKUP($B588,Data!$A$4:$T$727,9,FALSE),VLOOKUP($B588,Data!$A$4:$T$727,7,FALSE))","v":{"$error":"#N/A"}},{"$f":"IF($B588=\"\",\"\",VLOOKUP($B588,Data!$A$4:$T$727,6,FALSE))","v":""},"",{"$f":"IF($B588=\"\",\"\",IF(VLOOKUP($B588,Data!$A$4:$T$727,11,FALSE)<1,\"\",VLOOKUP(B588,Data!$A$4:$T$727,11,FALSE)))","v":""}]
[null,null,{"$f":"IF($B589=\"\",\"\",VLOOKUP($B589,Data!$A$4:$T$727,2,FALSE))","v":""},{"$f":"IF($B589=\"\",\"\",VLOOKUP($B589,Data!$A$4:$T$727,10,FALSE))","v":""},{"$f":"IF($B589=\"\",\"\",VLOOKUP($B589,Data!$A$4:$T$727,4,FALSE))","v":""},{"$f":"IF($B589=\"\",\"\",VLOOKUP($B589,Data!$A$4:$T$727,5,FALSE))","v":""},{"$f":"IF($B589=\"\",\"\",VLOOKUP($B589,Data!$A$4:$T$727,7,FALSE))","v":""},"","","","",{"$f":"IF($I$15=\"Show\",VLOOKUP($B589,Data!$A$4:$T$727,9,FALSE),VLOOKUP($B589,Data!$A$4:$T$727,7,FALSE))","v":{"$error":"#N/A"}},{"$f":"IF($B589=\"\",\"\",VLOOKUP($B589,Data!$A$4:$T$727,6,FALSE))","v":""},"",{"$f":"IF($B589=\"\",\"\",IF(VLOOKUP($B589,Data!$A$4:$T$727,11,FALSE)<1,\"\",VLOOKUP(B589,Data!$A$4:$T$727,11,FALSE)))","v":""}]
[null,null,{"$f":"IF($B590=\"\",\"\",VLOOKUP($B590,Data!$A$4:$T$727,2,FALSE))","v":""},{"$f":"IF($B590=\"\",\"\",VLOOKUP($B590,Data!$A$4:$T$727,10,FALSE))","v":""},{"$f":"IF($B590=\"\",\"\",VLOOKUP($B590,Data!$A$4:$T$727,4,FALSE))","v":""},{"$f":"IF($B590=\"\",\"\",VLOOKUP($B590,Data!$A$4:$T$727,5,FALSE))","v":""},{"$f":"IF($B590=\"\",\"\",VLOOKUP($B590,Data!$A$4:$T$727,7,FALSE))","v":""},"","","","",{"$f":"IF($I$15=\"Show\",VLOOKUP($B590,Data!$A$4:$T$727,9,FALSE),VLOOKUP($B590,Data!$A$4:$T$727,7,FALSE))","v":{"$error":"#N/A"}},{"$f":"IF($B590=\"\",\"\",VLOOKUP($B590,Data!$A$4:$T$727,6,FALSE))","v":""},"",{"$f":"IF($B590=\"\",\"\",IF(VLOOKUP($B590,Data!$A$4:$T$727,11,FALSE)<1,\"\",VLOOKUP(B590,Data!$A$4:$T$727,11,FALSE)))","v":""}]
[null,null,{"$f":"IF($B591=\"\",\"\",VLOOKUP($B591,Data!$A$4:$T$727,2,FALSE))","v":""},{"$f":"IF($B591=\"\",\"\",VLOOKUP($B591,Data!$A$4:$T$727,10,FALSE))","v":""},{"$f":"IF($B591=\"\",\"\",VLOOKUP($B591,Data!$A$4:$T$727,4,FALSE))","v":""},{"$f":"IF($B591=\"\",\"\",VLOOKUP($B591,Data!$A$4:$T$727,5,FALSE))","v":""},{"$f":"IF($B591=\"\",\"\",VLOOKUP($B591,Data!$A$4:$T$727,7,FALSE))","v":""},"","","","",{"$f":"IF($I$15=\"Show\",VLOOKUP($B591,Data!$A$4:$T$727,9,FALSE),VLOOKUP($B591,Data!$A$4:$T$727,7,FALSE))","v":{"$error":"#N/A"}},{"$f":"IF($B591=\"\",\"\",VLOOKUP($B591,Data!$A$4:$T$727,6,FALSE))","v":""},"",{"$f":"IF($B591=\"\",\"\",IF(VLOOKUP($B591,Data!$A$4:$T$727,11,FALSE)<1,\"\",VLOOKUP(B591,Data!$A$4:$T$727,11,FALSE)))","v":""}]
[null,null,{"$f":"IF($B592=\"\",\"\",VLOOKUP($B592,Data!$A$4:$T$727,2,FALSE))","v":""},{"$f":"IF($B592=\"\",\"\",VLOOKUP($B592,Data!$A$4:$T$727,10,FALSE))","v":""},{"$f":"IF($B592=\"\",\"\",VLOOKUP($B592,Data!$A$4:$T$727,4,FALSE))","v":""},{"$f":"IF($B592=\"\",\"\",VLOOKUP($B592,Data!$A$4:$T$727,5,FALSE))","v":""},{"$f":"IF($B592=\"\",\"\",VLOOKUP($B592,Data!$A$4:$T$727,7,FALSE))","v":""},"","","","",{"$f":"IF($I$15=\"Show\",VLOOKUP($B592,Data!$A$4:$T$727,9,FALSE),VLOOKUP($B592,Data!$A$4:$T$727,7,FALSE))","v":{"$error":"#N/A"}},{"$f":"IF($B592=\"\",\"\",VLOOKUP($B592,Data!$A$4:$T$727,6,FALSE))","v":""},"",{"$f":"IF($B592=\"\",\"\",IF(VLOOKUP($B592,Data!$A$4:$T$727,11,FALSE)<1,\"\",VLOOKUP(B592,Data!$A$4:$T$727,11,FALSE)))","v":""}]
[null,null,{"$f":"IF($B593=\"\",\"\",VLOOKUP($B593,Data!$A$4:$T$727,2,FALSE))","v":""},{"$f":"IF($B593=\"\",\"\",VLOOKUP($B593,Data!$A$4:$T$727,10,FALSE))","v":""},{"$f":"IF($B593=\"\",\"\",VLOOKUP($B593,Data!$A$4:$T$727,4,FALSE))","v":""},{"$f":"IF($B593=\"\",\"\",VLOOKUP($B593,Data!$A$4:$T$727,5,FALSE))","v":""},{"$f":"IF($B593=\"\",\"\",VLOOKUP($B593,Data!$A$4:$T$727,7,FALSE))","v":""},"","","","",{"$f":"IF($I$15=\"Show\",VLOOKUP($B593,Data!$A$4:$T$727,9,FALSE),VLOOKUP($B593,Data!$A$4:$T$727,7,FALSE))","v":{"$error":"#N/A"}},{"$f":"IF($B593=\"\",\"\",VLOOKUP($B593,Data!$A$4:$T$727,6,FALSE))","v":""},"",{"$f":"IF($B593=\"\",\"\",IF(VLOOKUP($B593,Data!$A$4:$T$727,11,FALSE)<1,\"\",VLOOKUP(B593,Data!$A$4:$T$727,11,FALSE)))","v":""}]
[null,null,{"$f":"IF($B594=\"\",\"\",VLOOKUP($B594,Data!$A$4:$T$727,2,FALSE))","v":""},{"$f":"IF($B594=\"\",\"\",VLOOKUP($B594,Data!$A$4:$T$727,10,FALSE))","v":""},{"$f":"IF($B594=\"\",\"\",VLOOKUP($B594,Data!$A$4:$T$727,4,FALSE))","v":""},{"$f":"IF($B594=\"\",\"\",VLOOKUP($B594,Data!$A$4:$T$727,5,FALSE))","v":""},{"$f":"IF($B594=\"\",\"\",VLOOKUP($B594,Data!$A$4:$T$727,7,FALSE))","v":""},"","","","",{"$f":"IF($I$15=\"Show\",VLOOKUP($B594,Data!$A$4:$T$727,9,FALSE),VLOOKUP($B594,Data!$A$4:$T$727,7,FALSE))","v":{"$error":"#N/A"}},{"$f":"IF($B594=\"\",\"\",VLOOKUP($B594,Data!$A$4:$T$727,6,FALSE))","v":""},"",{"$f":"IF($B594=\"\",\"\",IF(VLOOKUP($B594,Data!$A$4:$T$727,11,FALSE)<1,\"\",VLOOKUP(B594,Data!$A$4:$T$727,11,FALSE)))","v":""}]
[null,null,{"$f":"IF($B595=\"\",\"\",VLOOKUP($B595,Data!$A$4:$T$727,2,FALSE))","v":""},{"$f":"IF($B595=\"\",\"\",VLOOKUP($B595,Data!$A$4:$T$727,10,FALSE))","v":""},{"$f":"IF($B595=\"\",\"\",VLOOKUP($B595,Data!$A$4:$T$727,4,FALSE))","v":""},{"$f":"IF($B595=\"\",\"\",VLOOKUP($B595,Data!$A$4:$T$727,5,FALSE))","v":""},{"$f":"IF($B595=\"\",\"\",VLOOKUP($B595,Data!$A$4:$T$727,7,FALSE))","v":""},"","","","",{"$f":"IF($I$15=\"Show\",VLOOKUP($B595,Data!$A$4:$T$727,9,FALSE),VLOOKUP($B595,Data!$A$4:$T$727,7,FALSE))","v":{"$error":"#N/A"}},{"$f":"IF($B595=\"\",\"\",VLOOKUP($B595,Data!$A$4:$T$727,6,FALSE))","v":""},"",{"$f":"IF($B595=\"\",\"\",IF(VLOOKUP($B595,Data!$A$4:$T$727,11,FALSE)<1,\"\",VLOOKUP(B595,Data!$A$4:$T$727,11,FALSE)))","v":""}]
[null,null,{"$f":"IF($B596=\"\",\"\",VLOOKUP($B596,Data!$A$4:$T$727,2,FALSE))","v":""},{"$f":"IF($B596=\"\",\"\",VLOOKUP($B596,Data!$A$4:$T$727,10,FALSE))","v":""},{"$f":"IF($B596=\"\",\"\",VLOOKUP($B596,Data!$A$4:$T$727,4,FALSE))","v":""},{"$f":"IF($B596=\"\",\"\",VLOOKUP($B596,Data!$A$4:$T$727,5,FALSE))","v":""},{"$f":"IF($B596=\"\",\"\",VLOOKUP($B596,Data!$A$4:$T$727,7,FALSE))","v":""},"","","","",{"$f":"IF($I$15=\"Show\",VLOOKUP($B596,Data!$A$4:$T$727,9,FALSE),VLOOKUP($B596,Data!$A$4:$T$727,7,FALSE))","v":{"$error":"#N/A"}},{"$f":"IF($B596=\"\",\"\",VLOOKUP($B596,Data!$A$4:$T$727,6,FALSE))","v":""},"",{"$f":"IF($B596=\"\",\"\",IF(VLOOKUP($B596,Data!$A$4:$T$727,11,FALSE)<1,\"\",VLOOKUP(B596,Data!$A$4:$T$727,11,FALSE)))","v":""}]
[null,null,{"$f":"IF($B597=\"\",\"\",VLOOKUP($B597,Data!$A$4:$T$727,2,FALSE))","v":""},{"$f":"IF($B597=\"\",\"\",VLOOKUP($B597,Data!$A$4:$T$727,10,FALSE))","v":""},{"$f":"IF($B597=\"\",\"\",VLOOKUP($B597,Data!$A$4:$T$727,4,FALSE))","v":""},{"$f":"IF($B597=\"\",\"\",VLOOKUP($B597,Data!$A$4:$T$727,5,FALSE))","v":""},{"$f":"IF($B597=\"\",\"\",VLOOKUP($B597,Data!$A$4:$T$727,7,FALSE))","v":""},"","","","",{"$f":"IF($I$15=\"Show\",VLOOKUP($B597,Data!$A$4:$T$727,9,FALSE),VLOOKUP($B597,Data!$A$4:$T$727,7,FALSE))","v":{"$error":"#N/A"}},{"$f":"IF($B597=\"\",\"\",VLOOKUP($B597,Data!$A$4:$T$727,6,FALSE))","v":""},"",{"$f":"IF($B597=\"\",\"\",IF(VLOOKUP($B597,Data!$A$4:$T$727,11,FALSE)<1,\"\",VLOOKUP(B597,Data!$A$4:$T$727,11,FALSE)))","v":""}]
[null,null,{"$f":"IF($B598=\"\",\"\",VLOOKUP($B598,Data!$A$4:$T$727,2,FALSE))","v":""},{"$f":"IF($B598=\"\",\"\",VLOOKUP($B598,Data!$A$4:$T$727,10,FALSE))","v":""},{"$f":"IF($B598=\"\",\"\",VLOOKUP($B598,Data!$A$4:$T$727,4,FALSE))","v":""},{"$f":"IF($B598=\"\",\"\",VLOOKUP($B598,Data!$A$4:$T$727,5,FALSE))","v":""},{"$f":"IF($B598=\"\",\"\",VLOOKUP($B598,Data!$A$4:$T$727,7,FALSE))","v":""},"","","",{"$f":"IF(A598=\"\",\"\",J598*A598)","v":""},{"$f":"IF($I$15=\"Show\",VLOOKUP($B598,Data!$A$4:$T$727,9,FALSE),VLOOKUP($B598,Data!$A$4:$T$727,7,FALSE))","v":{"$error":"#N/A"}},{"$f":"IF($B598=\"\",\"\",VLOOKUP($B598,Data!$A$4:$T$727,6,FALSE))","v":""},"",{"$f":"IF($B598=\"\",\"\",IF(VLOOKUP($B598,Data!$A$4:$T$727,11,FALSE)<1,\"\",VLOOKUP(B598,Data!$A$4:$T$727,11,FALSE)))","v":""}]
[null,null,{"$f":"IF($B599=\"\",\"\",VLOOKUP($B599,Data!$A$4:$T$727,2,FALSE))","v":""},{"$f":"IF($B599=\"\",\"\",VLOOKUP($B599,Data!$A$4:$T$727,10,FALSE))","v":""},{"$f":"IF($B599=\"\",\"\",VLOOKUP($B599,Data!$A$4:$T$727,4,FALSE))","v":""},{"$f":"IF($B599=\"\",\"\",VLOOKUP($B599,Data!$A$4:$T$727,5,FALSE))","v":""},{"$f":"IF($B599=\"\",\"\",VLOOKUP($B599,Data!$A$4:$T$727,7,FALSE))","v":""},"","","",{"$f":"IF(A599=\"\",\"\",J599*A599)","v":""},{"$f":"IF($I$15=\"Show\",VLOOKUP($B599,Data!$A$4:$T$727,9,FALSE),VLOOKUP($B599,Data!$A$4:$T$727,7,FALSE))","v":{"$error":"#N/A"}},{"$f":"IF($B599=\"\",\"\",VLOOKUP($B599,Data!$A$4:$T$727,6,FALSE))","v":""},"",{"$f":"IF($B599=\"\",\"\",IF(VLOOKUP($B599,Data!$A$4:$T$727,11,FALSE)<1,\"\",VLOOKUP(B599,Data!$A$4:$T$727,11,FALSE)))","v":""}]
[null,null,{"$f":"IF($B600=\"\",\"\",VLOOKUP($B600,Data!$A$4:$T$727,2,FALSE))","v":""},{"$f":"IF($B600=\"\",\"\",VLOOKUP($B600,Data!$A$4:$T$727,10,FALSE))","v":""},{"$f":"IF($B600=\"\",\"\",VLOOKUP($B600,Data!$A$4:$T$727,4,FALSE))","v":""},{"$f":"IF($B600=\"\",\"\",VLOOKUP($B600,Data!$A$4:$T$727,5,FALSE))","v":""},{"$f":"IF($B600=\"\",\"\",VLOOKUP($B600,Data!$A$4:$T$727,7,FALSE))","v":""},"","","",{"$f":"IF(A600=\"\",\"\",J600*A600)","v":""},{"$f":"IF($I$15=\"Show\",VLOOKUP($B600,Data!$A$4:$T$727,9,FALSE),VLOOKUP($B600,Data!$A$4:$T$727,7,FALSE))","v":{"$error":"#N/A"}},{"$f":"IF($B600=\"\",\"\",VLOOKUP($B600,Data!$A$4:$T$727,6,FALSE))","v":""},"",{"$f":"IF($B600=\"\",\"\",IF(VLOOKUP($B600,Data!$A$4:$T$727,11,FALSE)<1,\"\",VLOOKUP(B600,Data!$A$4:$T$727,11,FALSE)))","v":""}]
["x","x",null,null,null,null,null,null,null,"TOTAL",{"$f":"SUM(K22:K600)","v":0}]

{"sheet":"Data","index":1,"n_rows":354,"n_cols":11,"rows_kept":354,"cut":false,"hidden":false,"merged":[]}
["1",2,3,4,5,6,7,8,9,10,11]
[]
["Item","Description ",null,"Catalog","Pg","CS PK","2025 WP","2025 SS","Check","UPC Code","Status"]
["222216G","Life-Size Animated KD-Freddy Krueger","NEW",2025,2,1,253.25,175,{"$f":"H4","v":175},"191245222163",{"$f":"IF($A4=\"\",\"\",IF(ISNA(VLOOKUP($A4,'PFA Direct'!$A$2:$J$96,1,FALSE)),\"\",\"On PFA Direct Import\"))","v":""}]
["222218G","Life-Size Animated KD-Jason Voorhees","NEW",2025,2,1,261.14999999999998,175,175,"191245222187",{"$f":"IF($A5=\"\",\"\",IF(ISNA(VLOOKUP($A5,'PFA Direct'!$A$2:$J$96,1,FALSE)),\"\",\"On PFA Direct Import\"))","v":""}]
["552068G","12' Life Size Animated KD-Poseable-ShortCircuit-Mummy (RGBC)",null,2025,2,1,380,250,250,"191245520689",{"$f":"IF($A6=\"\",\"\",IF(ISNA(VLOOKUP($A6,'PFA Direct'!$A$2:$J$96,1,FALSE)),\"\",\"On PFA Direct Import\"))","v":""}]
["66267","5' Animated Faux Chomp Plant","NEW",2025,2,1,86.95,65,65,"762543662670",{"$f":"IF($A7=\"\",\"\",IF(ISNA(VLOOKUP($A7,'PFA Direct'!$A$2:$J$96,1,FALSE)),\"\",\"On PFA Direct Import\"))","v":""}]
["66724","5.5' Standing Pop Up Creepy Lady","NEW",2025,2,1,58.1,42,42,"762543667248",{"$f":"IF($A8=\"\",\"\",IF(ISNA(VLOOKUP($A8,'PFA Direct'!$A$2:$J$96,1,FALSE)),\"\",\"On PFA Direct Import\"))","v":""}]
["66468","8.5' Animated Standing Up & Down Reaper","NEW",2025,3,1,82.15,65,65,"762543664681",{"$f":"IF($A9=\"\",\"\",IF(ISNA(VLOOKUP($A9,'PFA Direct'!$A$2:$J$96,1,FALSE)),\"\",\"On PFA Direct Import\"))","v":""}]
["66502","8' Animated Standing Clown","NEW",2025,3,1,96.9,74.5,74.5,"762543665022",{"$f":"IF($A10=\"\",\"\",IF(ISNA(VLOOKUP($A10,'PFA Direct'!$A$2:$J$96,1,FALSE)),\"\",\"On PFA Direct Import\"))","v":"On PFA Direct Import"}]
["66720","6' Standing Pop Up Pumpkin Man","NEW",2025,3,1,66.8,50,50,"762543667200",{"$f":"IF($A11=\"\",\"\",IF(ISNA(VLOOKUP($A11,'PFA Direct'!$A$2:$J$96,1,FALSE)),\"\",\"On PFA Direct Import\"))","v":""}]
["66721","5.5' Standing Animated Wings Reaper","NEW",2025,3,1,90.55,65,65,"762543667217",{"$f":"IF($A12=\"\",\"\",IF(ISNA(VLOOKUP($A12,'PFA Direct'!$A$2:$J$96,1,FALSE)),\"\",\"On PFA Direct Import\"))","v":""}]
["66782","6' Animated Werewolf","NEW",2025,3,1,178.1,130,130,"762543667828",{"$f":"IF($A13=\"\",\"\",IF(ISNA(VLOOKUP($A13,'PFA Direct'!$A$2:$J$96,1,FALSE)),\"\",\"On PFA Direct Import\"))","v":""}]
["64869","31.5\" Floating Girl",null,2025,4,4,21.3,18.100000000000001,18.100000000000001,"762543648698",{"$f":"IF($A14=\"\",\"\",IF(ISNA(VLOOKUP($A14,'PFA Direct'!$A$2:$J$96,1,FALSE)),\"\",\"On PFA Direct Import\"))","v":""}]
["66181","5.5' Standing Animated Creepy JOL Doll","NEW",2025,4,1,46.95,35,35,"762543661819",{"$f":"IF($A15=\"\",\"\",IF(ISNA(VLOOKUP($A15,'PFA Direct'!$A$2:$J$96,1,FALSE)),\"\",\"On PFA Direct Import\"))","v":""}]
["66622","Animated Standing Clown/Leather Shoes","NEW",2025,4,2,34.5,24.25,24.25,"762543666227",{"$f":"IF($A16=\"\",\"\",IF(ISNA(VLOOKUP($A16,'PFA Direct'!$A$2:$J$96,1,FALSE)),\"\",\"On PFA Direct Import\"))","v":""}]
["66631","Animated Mummy Groundbreaker","NEW",2025,4,2,33.799999999999997,28.75,28.75,"762543666319",{"$f":"IF($A17=\"\",\"\",IF(ISNA(VLOOKUP($A17,'PFA Direct'!$A$2:$J$96,1,FALSE)),\"\",\"On PFA Direct Import\"))","v":""}]
["66717","3' Standing Animated Leather Shoes Girl","NEW",2025,4,2,31.1,21.5,21.5,"762543667170",{"$f":"IF($A18=\"\",\"\",IF(ISNA(VLOOKUP($A18,'PFA Direct'!$A$2:$J$96,1,FALSE)),\"\",\"On PFA Direct Import\"))","v":""}]
["66723","5.7' Standing Animated Clown w/Balloon","NEW",2025,4,1,61.75,44,44,"762543667231",{"$f":"IF($A19=\"\",\"\",IF(ISNA(VLOOKUP($A19,'PFA Direct'!$A$2:$J$96,1,FALSE)),\"\",\"On PFA Direct Import\"))","v":""}]
["66736","5' Animated Talking Skeleton","NEW",2025,4,1,90.85,65,65,"762543667361",{"$f":"IF($A20=\"\",\"\",IF(ISNA(VLOOKUP($A20,'PFA Direct'!$A$2:$J$96,1,FALSE)),\"\",\"On PFA Direct Import\"))","v":""}]
["66766","5.6' Animated Standing Witch","NEW",2025,4,1,40.200000000000003,34.15,34.15,"762543667668",{"$f":"IF($A21=\"\",\"\",IF(ISNA(VLOOKUP($A21,'PFA Direct'!$A$2:$J$96,1,FALSE)),\"\",\"On PFA Direct Import\"))","v":""}]
["64934","35\" Peek-a-Boo Ghost",null,2025,5,4,19.2,16.3,16.3,"762543649343",{"$f":"IF($A22=\"\",\"\",IF(ISNA(VLOOKUP($A22,'PFA Direct'!$A$2:$J$96,1,FALSE)),\"\",\"On PFA Direct Import\"))","v":""}]
["65626","6' Hanging Shaking Bloody Reaper","NEW",2025,5,2,29.45,25,25,"762543656266",{"$f":"IF($A23=\"\",\"\",IF(ISNA(VLOOKUP($A23,'PFA Direct'!$A$2:$J$96,1,FALSE)),\"\",\"On PFA Direct Import\"))","v":""}]
["65947","35\" Animated Hanging White Girl","NEW",2025,5,6,10.1,8.6,8.6,"762543659472",{"$f":"IF($A24=\"\",\"\",IF(ISNA(VLOOKUP($A24,'PFA Direct'!$A$2:$J$96,1,FALSE)),\"\",\"On PFA Direct Import\"))","v":""}]
["66561","Hanging Animated Burlap Scarecrow","NEW",2025,5,2,35.549999999999997,30.2,30.2,"762543665619",{"$f":"IF($A25=\"\",\"\",IF(ISNA(VLOOKUP($A25,'PFA Direct'!$A$2:$J$96,1,FALSE)),\"\",\"On PFA Direct Import\"))","v":""}]
["66690","3' Hanging Animated Clown","NEW",2025,5,6,17.55,14.9,14.9,"762543666906",{"$f":"IF($A26=\"\",\"\",IF(ISNA(VLOOKUP($A26,'PFA Direct'!$A$2:$J$96,1,FALSE)),\"\",\"On PFA Direct Import\"))","v":""}]
["66700","5' Hanging Shaking Scarecrow","NEW",2025,5,2,29.25,24.85,24.85,"762543667002",{"$f":"IF($A27=\"\",\"\",IF(ISNA(VLOOKUP($A27,'PFA Direct'!$A$2:$J$96,1,FALSE)),\"\",\"On PFA Direct Import\"))","v":""}]
["66702","5' Hanging Animated Reaper","NEW",2025,5,4,25.05,21.3,21.3,"762543667026",{"$f":"IF($A28=\"\",\"\",IF(ISNA(VLOOKUP($A28,'PFA Direct'!$A$2:$J$96,1,FALSE)),\"\",\"On PFA Direct Import\"))","v":""}]
["82327","Small Faceless Spectre in Chains",null,2025,5,6,16.3,13.85,13.85,"762543823279",{"$f":"IF($A29=\"\",\"\",IF(ISNA(VLOOKUP($A29,'PFA Direct'!$A$2:$J$96,1,FALSE)),\"\",\"On PFA Direct Import\"))","v":""}]
["62886","31.5\" Animated Walking Spider w/Web",null,2025,6,6,13,11.05,11.05,"762543628867",{"$f":"IF($A30=\"\",\"\",IF(ISNA(VLOOKUP($A30,'PFA Direct'!$A$2:$J$96,1,FALSE)),\"\",\"On PFA Direct Import\"))","v":""}]
["65993","16\" Hanging Shaking Spider","NEW",2025,6,4,9.6999999999999993,8.25,8.25,"762543659939",{"$f":"IF($A31=\"\",\"\",IF(ISNA(VLOOKUP($A31,'PFA Direct'!$A$2:$J$96,1,FALSE)),\"\",\"On PFA Direct Import\"))","v":""}]
["66571","6' Hanging Animated Reaper","NEW",2025,6,4,23.45,19.95,19.95,"762543665718",{"$f":"IF($A32=\"\",\"\",IF(ISNA(VLOOKUP($A32,'PFA Direct'!$A$2:$J$96,1,FALSE)),\"\",\"On PFA Direct Import\"))","v":""}]
["66572","6' Hanging Animated Witch","NEW",2025,6,4,23.85,20.25,20.25,"762543665725",{"$f":"IF($A33=\"\",\"\",IF(ISNA(VLOOKUP($A33,'PFA Direct'!$A$2:$J$96,1,FALSE)),\"\",\"On PFA Direct Import\"))","v":""}]
["79012","Floating Spider",null,2025,6,4,12.45,10.6,10.6,"762543790120",{"$f":"IF($A34=\"\",\"\",IF(ISNA(VLOOKUP($A34,'PFA Direct'!$A$2:$J$96,1,FALSE)),\"\",\"On PFA Direct Import\"))","v":""}]
["48873","11\" Squeaking Rat","NEW",2025,6,6,9.85,8.3000000000000007,8.3000000000000007,"762543488737",{"$f":"IF($A35=\"\",\"\",IF(ISNA(VLOOKUP($A35,'PFA Direct'!$A$2:$J$96,1,FALSE)),\"\",\"On PFA Direct Import\"))","v":"On PFA Direct Import"}]
["66365","Animated Upside Down Grey Bat","NEW",2025,6,6,16.149999999999999,11,{"$f":"H36","v":11},"762543663653",{"$f":"IF($A36=\"\",\"\",IF(ISNA(VLOOKUP($A36,'PFA Direct'!$A$2:$J$96,1,FALSE)),\"\",\"On PFA Direct Import\"))","v":""}]
["65831","55\" Hanging Talking Pumpkin Ghost",null,2025,6,6,15.45,13.15,13.15,"762543658314",{"$f":"IF($A37=\"\",\"\",IF(ISNA(VLOOKUP($A37,'PFA Direct'!$A$2:$J$96,1,FALSE)),\"\",\"On PFA Direct Import\"))","v":""}]
["66670","6' Hanging Animated Scary Witch","NEW",2025,6,6,16.399999999999999,13.95,13.95,"762543666708",{"$f":"IF($A38=\"\",\"\",IF(ISNA(VLOOKUP($A38,'PFA Direct'!$A$2:$J$96,1,FALSE)),\"\",\"On PFA Direct Import\"))","v":""}]
["65602","47\" Hanging Creepy Clown",null,2025,7,4,22,18.7,18.7,"762543656020",{"$f":"IF($A39=\"\",\"\",IF(ISNA(VLOOKUP($A39,'PFA Direct'!$A$2:$J$96,1,FALSE)),\"\",\"On PFA Direct Import\"))","v":""}]
["66172","4' Turning Head Hanging Girl","NEW",2025,7,4,16.75,14.25,14.25,"762543661727",{"$f":"IF($A40=\"\",\"\",IF(ISNA(VLOOKUP($A40,'PFA Direct'!$A$2:$J$96,1,FALSE)),\"\",\"On PFA Direct Import\"))","v":""}]
["66235","4' Slashing Ghost Reaper","NEW",2025,7,4,17.95,15.25,15.25,"762543662359",{"$f":"IF($A41=\"\",\"\",IF(ISNA(VLOOKUP($A41,'PFA Direct'!$A$2:$J$96,1,FALSE)),\"\",\"On PFA Direct Import\"))","v":""}]
["66236","4'  Shaking Scarecrow","NEW",2025,7,6,14.9,12.65,12.65,"762543662366",{"$f":"IF($A42=\"\",\"\",IF(ISNA(VLOOKUP($A42,'PFA Direct'!$A$2:$J$96,1,FALSE)),\"\",\"On PFA Direct Import\"))","v":""}]
["66698","4' Hanging Sonic Pumpkin Man","NEW",2025,7,4,18.649999999999999,15.9,15.9,"762543666982",{"$f":"IF($A43=\"\",\"\",IF(ISNA(VLOOKUP($A43,'PFA Direct'!$A$2:$J$96,1,FALSE)),\"\",\"On PFA Direct Import\"))","v":""}]
["66800","Animated Spider Legs","NEW",2025,7,4,22.75,19.3,19.3,"762543668009",{"$f":"IF($A44=\"\",\"\",IF(ISNA(VLOOKUP($A44,'PFA Direct'!$A$2:$J$96,1,FALSE)),\"\",\"On PFA Direct Import\"))","v":""}]
["66801","Animated Spider Head Band","NEW",2025,7,8,8.6999999999999993,7.5,7.5,"762543668016",{"$f":"IF($A45=\"\",\"\",IF(ISNA(VLOOKUP($A45,'PFA Direct'!$A$2:$J$96,1,FALSE)),\"\",\"On PFA Direct Import\"))","v":""}]
["46936","2.5' Ghost w/Dog ","NEW",2025,8,4,33.450000000000003,23.5,23.5,"762543469361",{"$f":"IF($A46=\"\",\"\",IF(ISNA(VLOOKUP($A46,'PFA Direct'!$A$2:$J$96,1,FALSE)),\"\",\"On PFA Direct Import\"))","v":""}]
["65631","35.4\" Groundbreaker-Animated Zombie",null,2025,8,4,29,24.65,24.65,"762543656310",{"$f":"IF($A47=\"\",\"\",IF(ISNA(VLOOKUP($A47,'PFA Direct'!$A$2:$J$96,1,FALSE)),\"\",\"On PFA Direct Import\"))","v":""}]
["66092","Animated Witch w/Cauldron","NEW",2025,8,2,24.15,20.55,20.55,"762543660928",{"$f":"IF($A48=\"\",\"\",IF(ISNA(VLOOKUP($A48,'PFA Direct'!$A$2:$J$96,1,FALSE)),\"\",\"On PFA Direct Import\"))","v":""}]
["66361","3' Rising Reaper w/Tombstone","NEW",2025,8,1,63.3,52,52,"762543663615",{"$f":"IF($A49=\"\",\"\",IF(ISNA(VLOOKUP($A49,'PFA Direct'!$A$2:$J$96,1,FALSE)),\"\",\"On PFA Direct Import\"))","v":""}]
["66641","Animated Groundbreaker","NEW",2025,8,4,21.5,14.9,14.9,"762543666418",{"$f":"IF($A50=\"\",\"\",IF(ISNA(VLOOKUP($A50,'PFA Direct'!$A$2:$J$96,1,FALSE)),\"\",\"On PFA Direct Import\"))","v":""}]
["66722","4' Giant Rising Groundbreaker Reaper","NEW",2025,8,1,116.55,85,85,"762543667224",{"$f":"IF($A51=\"\",\"\",IF(ISNA(VLOOKUP($A51,'PFA Direct'!$A$2:$J$96,1,FALSE)),\"\",\"On PFA Direct Import\"))","v":"On PFA Direct Import"}]
["66744","36\" Animated Tombstone","NEW",2025,8,1,57.7,49.05,49.05,"762543667446","CANCELLED"]
["95700","7.9\" Resin LU JOL w/Witch Hat A2","NEW",2025,8,4,7.25,6.15,6.15,"762543957004",{"$f":"IF($A53=\"\",\"\",IF(ISNA(VLOOKUP($A53,'PFA Direct'!$A$2:$J$96,1,FALSE)),\"\",\"On PFA Direct Import\"))","v":""}]
["225461G","Halloween Lightshow Projection-FireBlaze (RRPm)",null,2025,9,6,18.3,14,14,"191245254614",{"$f":"IF($A54=\"\",\"\",IF(ISNA(VLOOKUP($A54,'PFA Direct'!$A$2:$J$96,1,FALSE)),\"\",\"On PFA Direct Import\"))","v":""}]
["228334G","Halloween Lightshow Projection Plus-Xray+Thermal-6 Slides-JOL Reaper/Witch/Ghoul/Ghost/Vampire/Skele",null,2025,9,4,28.55,21,21,"191245283348",{"$f":"IF($A55=\"\",\"\",IF(ISNA(VLOOKUP($A55,'PFA Direct'!$A$2:$J$96,1,FALSE)),\"\",\"On PFA Direct Import\"))","v":""}]
["48046","11.7\" Flaming LEDs Plastic Lantern - Spider",null,2025,9,4,9.25,7.85,7.85,"762543480465",{"$f":"IF($A56=\"\",\"\",IF(ISNA(VLOOKUP($A56,'PFA Direct'!$A$2:$J$96,1,FALSE)),\"\",\"On PFA Direct Import\"))","v":""}]
["48183","9.8\" LU Ghost",null,2025,9,6,7.95,6.6,6.6,"762543481837",{"$f":"IF($A57=\"\",\"\",IF(ISNA(VLOOKUP($A57,'PFA Direct'!$A$2:$J$96,1,FALSE)),\"\",\"On PFA Direct Import\"))","v":""}]
["48323","Smiling JOL Stack w/Witch Hat","NEW",2025,9,1,30.4,25.85,25.85,"762543483237",{"$f":"IF($A58=\"\",\"\",IF(ISNA(VLOOKUP($A58,'PFA Direct'!$A$2:$J$96,1,FALSE)),\"\",\"On PFA Direct Import\"))","v":""}]
["48435","14\" Resin Pumpkin w/Witch Hat LED","NEW",2025,9,4,10.65,9.0500000000000007,9.0500000000000007,"762543484357",{"$f":"IF($A59=\"\",\"\",IF(ISNA(VLOOKUP($A59,'PFA Direct'!$A$2:$J$96,1,FALSE)),\"\",\"On PFA Direct Import\"))","v":""}]
["48819","Pumpkin Head","NEW",2025,9,6,9.9,8.4,8.4,"762543488195",{"$f":"IF($A60=\"\",\"\",IF(ISNA(VLOOKUP($A60,'PFA Direct'!$A$2:$J$96,1,FALSE)),\"\",\"On PFA Direct Import\"))","v":""}]
["48879","Smiling LU JOL","NEW",2025,9,2,22.55,19.149999999999999,19.149999999999999,"762543488799",{"$f":"IF($A61=\"\",\"\",IF(ISNA(VLOOKUP($A61,'PFA Direct'!$A$2:$J$96,1,FALSE)),\"\",\"On PFA Direct Import\"))","v":""}]
["61609","JOL LU Garland",null,2025,9,4,11.4,9.6999999999999993,9.6999999999999993,"762543616093",{"$f":"IF($A62=\"\",\"\",IF(ISNA(VLOOKUP($A62,'PFA Direct'!$A$2:$J$96,1,FALSE)),\"\",\"On PFA Direct Import\"))","v":""}]
["63992G","Jack O Lantern-Traditional",null,2025,9,6,9.3000000000000007,7.9,7.9,"086786639924",{"$f":"IF($A63=\"\",\"\",IF(ISNA(VLOOKUP($A63,'PFA Direct'!$A$2:$J$96,1,FALSE)),\"\",\"On PFA Direct Import\"))","v":""}]
["66218","8\" Disco Ball Jack-o-lantern","NEW",2025,9,6,8.0500000000000007,6.85,6.85,"762543662182",{"$f":"IF($A64=\"\",\"\",IF(ISNA(VLOOKUP($A64,'PFA Direct'!$A$2:$J$96,1,FALSE)),\"\",\"On PFA Direct Import\"))","v":""}]
["66706","23\" Pumpkin Stack","NEW",2025,9,4,9.85,6.8,6.8,"762543667064",{"$f":"IF($A65=\"\",\"\",IF(ISNA(VLOOKUP($A65,'PFA Direct'!$A$2:$J$96,1,FALSE)),\"\",\"On PFA Direct Import\"))","v":""}]
["73183","Magic Light Orb",null,2025,9,6,11.35,9.65,9.65,"762543731833",{"$f":"IF($A66=\"\",\"\",IF(ISNA(VLOOKUP($A66,'PFA Direct'!$A$2:$J$96,1,FALSE)),\"\",\"On PFA Direct Import\"))","v":""}]
["78711","40\" LU Garland-Baby Heads",null,2025,9,6,7.3,6.2,6.2,"762543787113",{"$f":"IF($A67=\"\",\"\",IF(ISNA(VLOOKUP($A67,'PFA Direct'!$A$2:$J$96,1,FALSE)),\"\",\"On PFA Direct Import\"))","v":""}]
["222147G","Tabletop Green Misting Lab Beaker","NEW",2025,10,6,21.55,15.5,{"$f":"H68","v":15.5},"191245221470",{"$f":"IF($A68=\"\",\"\",IF(ISNA(VLOOKUP($A68,'PFA Direct'!$A$2:$J$96,1,FALSE)),\"\",\"On PFA Direct Import\"))","v":""}]
["25367G","Animated Monster Hand - Orange Bowl",null,2025,10,6,15.5,13.25,13.25,"086786253670",{"$f":"IF($A69=\"\",\"\",IF(ISNA(VLOOKUP($A69,'PFA Direct'!$A$2:$J$96,1,FALSE)),\"\",\"On PFA Direct Import\"))","v":""}]
["48324","Spooky Spell Book","NEW",2025,10,4,9.4,8,8,"762543483244",{"$f":"IF($A70=\"\",\"\",IF(ISNA(VLOOKUP($A70,'PFA Direct'!$A$2:$J$96,1,FALSE)),\"\",\"On PFA Direct Import\"))","v":""}]
["48500","Resin Ghost Tree w/JOL LED","NEW",2025,10,4,14.45,12.3,12.3,"762543485002",{"$f":"IF($A71=\"\",\"\",IF(ISNA(VLOOKUP($A71,'PFA Direct'!$A$2:$J$96,1,FALSE)),\"\",\"On PFA Direct Import\"))","v":""}]
["48597","12\" LU Resin Infested Creepy Gnome","NEW",2025,10,4,16.2,13.7,13.7,"762543485972",{"$f":"IF($A72=\"\",\"\",IF(ISNA(VLOOKUP($A72,'PFA Direct'!$A$2:$J$96,1,FALSE)),\"\",\"On PFA Direct Import\"))","v":""}]
["48855","Sonic Reaper On Skull Throne","NEW",2025,10,4,19.5,13,13,"762543488553",{"$f":"IF($A73=\"\",\"\",IF(ISNA(VLOOKUP($A73,'PFA Direct'!$A$2:$J$96,1,FALSE)),\"\",\"On PFA Direct Import\"))","v":""}]
["48875","Talking Skull Bust","NEW",2025,10,6,16.350000000000001,13.9,13.9,"762543488751",{"$f":"IF($A74=\"\",\"\",IF(ISNA(VLOOKUP($A74,'PFA Direct'!$A$2:$J$96,1,FALSE)),\"\",\"On PFA Direct Import\"))","v":"On PFA Direct Import"}]
["65832","Tabletop Animated Witch Hat on Books",null,2025,10,4,17.600000000000001,14.95,14.95,"762543658321",{"$f":"IF($A75=\"\",\"\",IF(ISNA(VLOOKUP($A75,'PFA Direct'!$A$2:$J$96,1,FALSE)),\"\",\"On PFA Direct Import\"))","v":""}]
["66501","11\" Creepers Outdoor","NEW",2025,10,4,6.7,5.7,5.7,"762543665015",{"$f":"IF($A76=\"\",\"\",IF(ISNA(VLOOKUP($A76,'PFA Direct'!$A$2:$J$96,1,FALSE)),\"\",\"On PFA Direct Import\"))","v":""}]
["66627","Talking Pumpkin","NEW",2025,10,4,13.4,11.4,11.4,"762543666272",{"$f":"IF($A77=\"\",\"\",IF(ISNA(VLOOKUP($A77,'PFA Direct'!$A$2:$J$96,1,FALSE)),\"\",\"On PFA Direct Import\"))","v":""}]
["73568G","Animated Tabletop Decor-Moving Books-Halloween Night",null,2025,10,4,24,18.7,18.7,"086786735688",{"$f":"IF($A78=\"\",\"\",IF(ISNA(VLOOKUP($A78,'PFA Direct'!$A$2:$J$96,1,FALSE)),\"\",\"On PFA Direct Import\"))","v":""}]
["224923G","Animated Decor-Chainsaw-SM-Red Rusted Finish",null,2025,11,4,26.45,20.6,20.6,"191245249238",{"$f":"IF($A79=\"\",\"\",IF(ISNA(VLOOKUP($A79,'PFA Direct'!$A$2:$J$96,1,FALSE)),\"\",\"On PFA Direct Import\"))","v":""}]
["48779","24\" Chainsaw w/Sound","NEW",2025,11,4,11.2,9.5,9.5,"762543487792",{"$f":"IF($A80=\"\",\"\",IF(ISNA(VLOOKUP($A80,'PFA Direct'!$A$2:$J$96,1,FALSE)),\"\",\"On PFA Direct Import\"))","v":""}]
["48871","10\" Animated Moving Foot","NEW",2025,11,6,12.15,10.3,10.3,"762543488713",{"$f":"IF($A81=\"\",\"\",IF(ISNA(VLOOKUP($A81,'PFA Direct'!$A$2:$J$96,1,FALSE)),\"\",\"On PFA Direct Import\"))","v":"On PFA Direct Import"}]
["48872","7.5\" Haunted Phone","NEW",2025,11,6,11.4,9.6999999999999993,9.6999999999999993,"762543488720",{"$f":"IF($A82=\"\",\"\",IF(ISNA(VLOOKUP($A82,'PFA Direct'!$A$2:$J$96,1,FALSE)),\"\",\"On PFA Direct Import\"))","v":"On PFA Direct Import"}]
["48874","Cauldron w/Eyeballs","NEW",2025,11,6,15.85,13.4,13.4,"762543488744",{"$f":"IF($A83=\"\",\"\",IF(ISNA(VLOOKUP($A83,'PFA Direct'!$A$2:$J$96,1,FALSE)),\"\",\"On PFA Direct Import\"))","v":"On PFA Direct Import"}]
["65466","7\" Crawling Severed Hand",null,2025,11,6,12.65,10.75,10.75,"762543654668",{"$f":"IF($A84=\"\",\"\",IF(ISNA(VLOOKUP($A84,'PFA Direct'!$A$2:$J$96,1,FALSE)),\"\",\"On PFA Direct Import\"))","v":"On PFA Direct Import"}]
["65833","22\" Half Skeleton Rock Guitar-Lights & Music",null,2025,11,4,19.45,16.55,16.55,"762543658338",{"$f":"IF($A85=\"\",\"\",IF(ISNA(VLOOKUP($A85,'PFA Direct'!$A$2:$J$96,1,FALSE)),\"\",\"On PFA Direct Import\"))","v":""}]
["66363","13\" Hat Caudron w/Animated Hand","NEW",2025,11,2,34,28.9,28.9,"762543663639",{"$f":"IF($A86=\"\",\"\",IF(ISNA(VLOOKUP($A86,'PFA Direct'!$A$2:$J$96,1,FALSE)),\"\",\"On PFA Direct Import\"))","v":""}]
["66697","15\" Table Top-Sonic Skull","NEW",2025,11,6,12.5,10.65,10.65,"762543666975",{"$f":"IF($A87=\"\",\"\",IF(ISNA(VLOOKUP($A87,'PFA Direct'!$A$2:$J$96,1,FALSE)),\"\",\"On PFA Direct Import\"))","v":""}]
["66740","Animated Book w/Sharp Teeth","NEW",2025,11,6,12.65,10.75,10.75,"762543667408",{"$f":"IF($A88=\"\",\"\",IF(ISNA(VLOOKUP($A88,'PFA Direct'!$A$2:$J$96,1,FALSE)),\"\",\"On PFA Direct Import\"))","v":""}]
["64947","8\" Creepy Girl With Crying Eyes Doorbell",null,2025,11,6,11.65,9.9,9.9,"762543649473",{"$f":"IF($A89=\"\",\"\",IF(ISNA(VLOOKUP($A89,'PFA Direct'!$A$2:$J$96,1,FALSE)),\"\",\"On PFA Direct Import\"))","v":""}]
["65633","35.4\" Hanging Girl",null,2025,12,6,10.9,9.25,9.25,"762543656334",{"$f":"IF($A90=\"\",\"\",IF(ISNA(VLOOKUP($A90,'PFA Direct'!$A$2:$J$96,1,FALSE)),\"\",\"On PFA Direct Import\"))","v":""}]
["65970","3' Hanging Doll w/Sounds & Lights","NEW",2025,12,4,13.7,11.65,11.65,"762543659700",{"$f":"IF($A91=\"\",\"\",IF(ISNA(VLOOKUP($A91,'PFA Direct'!$A$2:$J$96,1,FALSE)),\"\",\"On PFA Direct Import\"))","v":"On PFA Direct Import"}]
["66178","5' LU Hanging Devil w/Sickle","NEW",2025,12,4,15.2,10.75,10.75,"762543661789",{"$f":"IF($A92=\"\",\"\",IF(ISNA(VLOOKUP($A92,'PFA Direct'!$A$2:$J$96,1,FALSE)),\"\",\"On PFA Direct Import\"))","v":""}]
["66687","6' Scaled Skull Reaper","NEW",2025,12,4,26.35,22.4,22.4,"762543666876",{"$f":"IF($A93=\"\",\"\",IF(ISNA(VLOOKUP($A93,'PFA Direct'!$A$2:$J$96,1,FALSE)),\"\",\"On PFA Direct Import\"))","v":""}]
["66703","100\" Hanging Clown","NEW",2025,12,2,56.1,40,40,"762543667033",{"$f":"IF($A94=\"\",\"\",IF(ISNA(VLOOKUP($A94,'PFA Direct'!$A$2:$J$96,1,FALSE)),\"\",\"On PFA Direct Import\"))","v":""}]
["66725","5' Hanging Pumpkin Face Girl w/Lights & Sound","NEW",2025,12,4,20.350000000000001,17.3,17.3,"762543667255",{"$f":"IF($A95=\"\",\"\",IF(ISNA(VLOOKUP($A95,'PFA Direct'!$A$2:$J$96,1,FALSE)),\"\",\"On PFA Direct Import\"))","v":""}]
["85549","48\" LU White Reaper","NEW",2025,12,6,10.15,8.6,8.6,"762543855492",{"$f":"IF($A96=\"\",\"\",IF(ISNA(VLOOKUP($A96,'PFA Direct'!$A$2:$J$96,1,FALSE)),\"\",\"On PFA Direct Import\"))","v":""}]
["64669","6' Hanging LU Creepy Mummy",null,2025,12,6,16.5,14.05,14.05,"762543646694",{"$f":"IF($A97=\"\",\"\",IF(ISNA(VLOOKUP($A97,'PFA Direct'!$A$2:$J$96,1,FALSE)),\"\",\"On PFA Direct Import\"))","v":""}]
["48054","12' LU Hanging Reaper",null,2025,13,2,42.1,35.799999999999997,35.799999999999997,"762543480540",{"$f":"IF($A98=\"\",\"\",IF(ISNA(VLOOKUP($A98,'PFA Direct'!$A$2:$J$96,1,FALSE)),\"\",\"On PFA Direct Import\"))","v":""}]
["48794","8.5' Hanging LU Scarecrow","NEW",2025,13,1,52.45,44.6,44.6,"762543487945",{"$f":"IF($A99=\"\",\"\",IF(ISNA(VLOOKUP($A99,'PFA Direct'!$A$2:$J$96,1,FALSE)),\"\",\"On PFA Direct Import\"))","v":""}]
["62034","35\" LU Hanging Scarecrow",null,2025,13,6,10.55,8.9499999999999993,{"$f":"H100","v":8.9499999999999993},"762543620342",{"$f":"IF($A100=\"\",\"\",IF(ISNA(VLOOKUP($A100,'PFA Direct'!$A$2:$J$96,1,FALSE)),\"\",\"On PFA Direct Import\"))","v":""}]
["66639","3' Standing Double-Head Creepy Girl","NEW",2025,13,2,22.95,19.5,19.5,"762543666395",{"$f":"IF($A101=\"\",\"\",IF(ISNA(VLOOKUP($A101,'PFA Direct'!$A$2:$J$96,1,FALSE)),\"\",\"On PFA Direct Import\"))","v":""}]
["76019","LU Haunted Doll - Black/Purple",null,2025,13,6,10.199999999999999,8.6,8.6,"762543760192",{"$f":"IF($A102=\"\",\"\",IF(ISNA(VLOOKUP($A102,'PFA Direct'!$A$2:$J$96,1,FALSE)),\"\",\"On PFA Direct Import\"))","v":""}]
["48279","6' Standing Mummy w/LU Body",null,2025,14,1,104,84,84,"762543482797",{"$f":"IF($A103=\"\",\"\",IF(ISNA(VLOOKUP($A103,'PFA Direct'!$A$2:$J$96,1,FALSE)),\"\",\"On PFA Direct Import\"))","v":""}]
["66666","51\" Pumpkin Head Reaper","NEW",2025,14,6,10.15,8.65,8.65,"762543666661",{"$f":"IF($A104=\"\",\"\",IF(ISNA(VLOOKUP($A104,'PFA Direct'!$A$2:$J$96,1,FALSE)),\"\",\"On PFA Direct Import\"))","v":""}]
["66667","5' Cocoon","NEW",2025,14,6,9.1,7.75,7.75,"762543666678",{"$f":"IF($A105=\"\",\"\",IF(ISNA(VLOOKUP($A105,'PFA Direct'!$A$2:$J$96,1,FALSE)),\"\",\"On PFA Direct Import\"))","v":""}]
["66675","4' Hanging Reaper w/Sound","NEW",2025,14,6,12.35,10.5,10.5,"762543666753",{"$f":"IF($A106=\"\",\"\",IF(ISNA(VLOOKUP($A106,'PFA Direct'!$A$2:$J$96,1,FALSE)),\"\",\"On PFA Direct Import\"))","v":""}]
["95726","35\" Hanging  Reaper A3","NEW",2025,14,12,2.7,2.2999999999999998,2.2999999999999998,"762543957264",{"$f":"IF($A107=\"\",\"\",IF(ISNA(VLOOKUP($A107,'PFA Direct'!$A$2:$J$96,1,FALSE)),\"\",\"On PFA Direct Import\"))","v":""}]
["66368","51\" Hanging Girl","NEW",2025,15,6,9.6,8.15,8.15,"762543663684",{"$f":"IF($A108=\"\",\"\",IF(ISNA(VLOOKUP($A108,'PFA Direct'!$A$2:$J$96,1,FALSE)),\"\",\"On PFA Direct Import\"))","v":""}]
["66370","3' Standing Girl","NEW",2025,15,6,18.75,15.9,15.9,"762543663707",{"$f":"IF($A109=\"\",\"\",IF(ISNA(VLOOKUP($A109,'PFA Direct'!$A$2:$J$96,1,FALSE)),\"\",\"On PFA Direct Import\"))","v":""}]
["95725","43\" Hanging Reaper A3 ","NEW",2025,15,12,5.85,4.95,4.95,"762543957257",{"$f":"IF($A110=\"\",\"\",IF(ISNA(VLOOKUP($A110,'PFA Direct'!$A$2:$J$96,1,FALSE)),\"\",\"On PFA Direct Import\"))","v":""}]
["95728","47\" Hanging Burlap Characters A3","NEW",2025,15,9,8.4499999999999993,7.2,7.2,"762543957288",{"$f":"IF($A111=\"\",\"\",IF(ISNA(VLOOKUP($A111,'PFA Direct'!$A$2:$J$96,1,FALSE)),\"\",\"On PFA Direct Import\"))","v":""}]
["66614","3' Hanging Pumpkin Man w/Burlap Head","NEW",2025,16,12,4.4000000000000004,3.1,3.1,"762543666142",{"$f":"IF($A112=\"\",\"\",IF(ISNA(VLOOKUP($A112,'PFA Direct'!$A$2:$J$96,1,FALSE)),\"\",\"On PFA Direct Import\"))","v":""}]
["66646","32\" Mini Ghoul Black in Chains","NEW",2025,16,6,6.3,5.35,5.35,"762543666463",{"$f":"IF($A113=\"\",\"\",IF(ISNA(VLOOKUP($A113,'PFA Direct'!$A$2:$J$96,1,FALSE)),\"\",\"On PFA Direct Import\"))","v":""}]
["72372","30\" Hanging Black Reaper",null,2025,16,12,3.45,2.9,2.9,"762543723722",{"$f":"IF($A114=\"\",\"\",IF(ISNA(VLOOKUP($A114,'PFA Direct'!$A$2:$J$96,1,FALSE)),\"\",\"On PFA Direct Import\"))","v":""}]
["72373","30\" Hanging White Reaper",null,2025,16,12,3.45,2.9,2.9,"762543723739",{"$f":"IF($A115=\"\",\"\",IF(ISNA(VLOOKUP($A115,'PFA Direct'!$A$2:$J$96,1,FALSE)),\"\",\"On PFA Direct Import\"))","v":""}]
["95004","3' Hanging Crazy Clown Asst",null,2025,16,6,9.0500000000000007,7.7,7.7,"762543950043",{"$f":"IF($A116=\"\",\"\",IF(ISNA(VLOOKUP($A116,'PFA Direct'!$A$2:$J$96,1,FALSE)),\"\",\"On PFA Direct Import\"))","v":""}]
["95663","27.5 Creepy Doll A2 ",null,2025,16,12,3.6,3,3,"762543956632",{"$f":"IF($A117=\"\",\"\",IF(ISNA(VLOOKUP($A117,'PFA Direct'!$A$2:$J$96,1,FALSE)),\"\",\"On PFA Direct Import\"))","v":""}]
["48661","Wrong Way Witch - Purple Hair","NEW",2025,17,6,7,5.95,5.95,"762543486610",{"$f":"IF($A118=\"\",\"\",IF(ISNA(VLOOKUP($A118,'PFA Direct'!$A$2:$J$96,1,FALSE)),\"\",\"On PFA Direct Import\"))","v":""}]
["64678","40\" Hanging Witch",null,2025,17,6,5.55,4.7,4.7,"762543646786",{"$f":"IF($A119=\"\",\"\",IF(ISNA(VLOOKUP($A119,'PFA Direct'!$A$2:$J$96,1,FALSE)),\"\",\"On PFA Direct Import\"))","v":""}]
["95463","Hanging Scarecrow Pumpkin Asst",null,2025,17,12,3.55,2.5,2.5,"762543954638",{"$f":"IF($A120=\"\",\"\",IF(ISNA(VLOOKUP($A120,'PFA Direct'!$A$2:$J$96,1,FALSE)),\"\",\"On PFA Direct Import\"))","v":""}]
["95648","47\" Hanging DOD Bride/Groom A2 ",null,2025,17,6,10.25,8.6999999999999993,8.6999999999999993,"762543956489",{"$f":"IF($A121=\"\",\"\",IF(ISNA(VLOOKUP($A121,'PFA Direct'!$A$2:$J$96,1,FALSE)),\"\",\"On PFA Direct Import\"))","v":""}]
["63227","17.3\" Hanging Skeleton Bride",null,2025,18,6,4.5999999999999996,3.9,3.9,"762543632277",{"$f":"IF($A122=\"\",\"\",IF(ISNA(VLOOKUP($A122,'PFA Direct'!$A$2:$J$96,1,FALSE)),\"\",\"On PFA Direct Import\"))","v":""}]
["64991","23.6\" Hanging Pumpkin Man – Swampy",null,2025,18,12,3.6,3,3,"762543649916",{"$f":"IF($A123=\"\",\"\",IF(ISNA(VLOOKUP($A123,'PFA Direct'!$A$2:$J$96,1,FALSE)),\"\",\"On PFA Direct Import\"))","v":""}]
["92747","21\" Hanging Zombie A/2 ",null,2025,18,12,3.6,3,3,"762543927472",{"$f":"IF($A124=\"\",\"\",IF(ISNA(VLOOKUP($A124,'PFA Direct'!$A$2:$J$96,1,FALSE)),\"\",\"On PFA Direct Import\"))","v":"On PFA Direct Import"}]
["95074","21\" Faceless Reaper A/3",null,2025,18,12,3.45,2.9,2.9,"762543950746",{"$f":"IF($A125=\"\",\"\",IF(ISNA(VLOOKUP($A125,'PFA Direct'!$A$2:$J$96,1,FALSE)),\"\",\"On PFA Direct Import\"))","v":""}]
["95589","16\" Skeleton Doll A2",null,2025,18,12,3.25,2.75,2.75,"762543955895",{"$f":"IF($A126=\"\",\"\",IF(ISNA(VLOOKUP($A126,'PFA Direct'!$A$2:$J$96,1,FALSE)),\"\",\"On PFA Direct Import\"))","v":""}]
["95729","24\" Hanging Characters A3","NEW",2025,18,12,1.7,1.4,1.4,"762543957295",{"$f":"IF($A127=\"\",\"\",IF(ISNA(VLOOKUP($A127,'PFA Direct'!$A$2:$J$96,1,FALSE)),\"\",\"On PFA Direct Import\"))","v":""}]
["95730","24\" Clown A2 ","NEW",2025,18,12,1.6,1.4,1.4,"762543957301",{"$f":"IF($A128=\"\",\"\",IF(ISNA(VLOOKUP($A128,'PFA Direct'!$A$2:$J$96,1,FALSE)),\"\",\"On PFA Direct Import\"))","v":""}]
["95731","24\" Creepy Doll A3","NEW",2025,18,12,1.65,1.4,1.4,"762543957318",{"$f":"IF($A129=\"\",\"\",IF(ISNA(VLOOKUP($A129,'PFA Direct'!$A$2:$J$96,1,FALSE)),\"\",\"On PFA Direct Import\"))","v":""}]
["65848","2' Pumpkin Reaper",null,2025,19,12,3.45,2.9,2.9,"762543658482",{"$f":"IF($A130=\"\",\"\",IF(ISNA(VLOOKUP($A130,'PFA Direct'!$A$2:$J$96,1,FALSE)),\"\",\"On PFA Direct Import\"))","v":""}]
["66642","16\" Reaper Creeper","NEW",2025,19,6,7.15,6.1,6.1,"762543666425",{"$f":"IF($A131=\"\",\"\",IF(ISNA(VLOOKUP($A131,'PFA Direct'!$A$2:$J$96,1,FALSE)),\"\",\"On PFA Direct Import\"))","v":""}]
["95704","26\" Sonic Hanging Clown A2","NEW",2025,19,4,10.199999999999999,8.65,{"$f":"H132","v":8.65},"762543957042",{"$f":"IF($A132=\"\",\"\",IF(ISNA(VLOOKUP($A132,'PFA Direct'!$A$2:$J$96,1,FALSE)),\"\",\"On PFA Direct Import\"))","v":""}]
["95705","Hanging Creepy Bloody Doll A2","NEW",2025,19,6,5.85,4.95,4.95,"762543957059",{"$f":"IF($A133=\"\",\"\",IF(ISNA(VLOOKUP($A133,'PFA Direct'!$A$2:$J$96,1,FALSE)),\"\",\"On PFA Direct Import\"))","v":""}]
["95706","20\" Creepy Bride and Nun A2","NEW",2025,19,12,3.85,2.7,2.7,"762543957066",{"$f":"IF($A134=\"\",\"\",IF(ISNA(VLOOKUP($A134,'PFA Direct'!$A$2:$J$96,1,FALSE)),\"\",\"On PFA Direct Import\"))","v":""}]
["95733","18\" Hanging Creepy Big Eye Girl A3","NEW",2025,19,12,7.1,6.05,6.05,"762543957332",{"$f":"IF($A135=\"\",\"\",IF(ISNA(VLOOKUP($A135,'PFA Direct'!$A$2:$J$96,1,FALSE)),\"\",\"On PFA Direct Import\"))","v":""}]
["95734","20\" Hanging Clown A4 ","NEW",2025,19,12,4.25,3,3,"762543957349",{"$f":"IF($A136=\"\",\"\",IF(ISNA(VLOOKUP($A136,'PFA Direct'!$A$2:$J$96,1,FALSE)),\"\",\"On PFA Direct Import\"))","v":""}]
["95735","14\" Hanging Doll Head Decor A3 ","NEW",2025,19,12,2.1,1.8,1.8,"762543957356",{"$f":"IF($A137=\"\",\"\",IF(ISNA(VLOOKUP($A137,'PFA Direct'!$A$2:$J$96,1,FALSE)),\"\",\"On PFA Direct Import\"))","v":""}]
["66575","3' Hanging Ghost","NEW",2025,20,12,4.6500000000000004,3.95,3.95,"762543665756",{"$f":"IF($A138=\"\",\"\",IF(ISNA(VLOOKUP($A138,'PFA Direct'!$A$2:$J$96,1,FALSE)),\"\",\"On PFA Direct Import\"))","v":""}]
["66686","35\" LU Ghost","NEW",2025,20,9,9.1999999999999993,7.8,7.8,"762543666869",{"$f":"IF($A139=\"\",\"\",IF(ISNA(VLOOKUP($A139,'PFA Direct'!$A$2:$J$96,1,FALSE)),\"\",\"On PFA Direct Import\"))","v":""}]
["75392","32\" Hanging Ghost",null,2025,20,12,4.5,3.85,3.85,"762543753927",{"$f":"IF($A140=\"\",\"\",IF(ISNA(VLOOKUP($A140,'PFA Direct'!$A$2:$J$96,1,FALSE)),\"\",\"On PFA Direct Import\"))","v":""}]
["94443","18\" Hanging Ghost- Asst",null,2025,20,12,2.0499999999999998,1.75,1.75,"762543944431",{"$f":"IF($A141=\"\",\"\",IF(ISNA(VLOOKUP($A141,'PFA Direct'!$A$2:$J$96,1,FALSE)),\"\",\"On PFA Direct Import\"))","v":"On PFA Direct Import"}]
["95558","17\" Hanging Cute Ghost Asst",null,2025,20,12,3,2.5499999999999998,2.5499999999999998,"762543955581",{"$f":"IF($A142=\"\",\"\",IF(ISNA(VLOOKUP($A142,'PFA Direct'!$A$2:$J$96,1,FALSE)),\"\",\"On PFA Direct Import\"))","v":""}]
["95732","39\" LU Ghost w/Witch Hat A3","NEW",2025,20,12,6.15,5.25,5.25,"762543957325",{"$f":"IF($A143=\"\",\"\",IF(ISNA(VLOOKUP($A143,'PFA Direct'!$A$2:$J$96,1,FALSE)),\"\",\"On PFA Direct Import\"))","v":""}]
["45898","7' Ghost",null,2025,21,6,6.8,5.8,5.8,"762543458983",{"$f":"IF($A144=\"\",\"\",IF(ISNA(VLOOKUP($A144,'PFA Direct'!$A$2:$J$96,1,FALSE)),\"\",\"On PFA Direct Import\"))","v":""}]
["66574","12' Hanging Creepy Ghost","NEW",2025,21,2,46.5,39.549999999999997,39.549999999999997,"762543665749",{"$f":"IF($A145=\"\",\"\",IF(ISNA(VLOOKUP($A145,'PFA Direct'!$A$2:$J$96,1,FALSE)),\"\",\"On PFA Direct Import\"))","v":""}]
["66644","5.9' Hanging Ghost w/Pumpkin Bag","NEW",2025,21,4,14.5,9.9,9.9,"762543666449",{"$f":"IF($A146=\"\",\"\",IF(ISNA(VLOOKUP($A146,'PFA Direct'!$A$2:$J$96,1,FALSE)),\"\",\"On PFA Direct Import\"))","v":""}]
["94851","28\" Hanging Ghost w/Hat A/4 ",null,2025,21,12,3.35,2.85,2.85,"762543948514",{"$f":"IF($A147=\"\",\"\",IF(ISNA(VLOOKUP($A147,'PFA Direct'!$A$2:$J$96,1,FALSE)),\"\",\"On PFA Direct Import\"))","v":"On PFA Direct Import"}]
["05465","Plastic Realistic Skeleton-Med",null,2025,22,12,2,1.7,1.7,"762543054659",{"$f":"IF($A148=\"\",\"\",IF(ISNA(VLOOKUP($A148,'PFA Direct'!$A$2:$J$96,1,FALSE)),\"\",\"On PFA Direct Import\"))","v":""}]
["46804","60in Posable Skeleton",null,2025,22,1,35.35,25,25,"762543468043",{"$f":"IF($A149=\"\",\"\",IF(ISNA(VLOOKUP($A149,'PFA Direct'!$A$2:$J$96,1,FALSE)),\"\",\"On PFA Direct Import\"))","v":"On PFA Direct Import"}]
["47342","7' Skeleton (Pose And Hold)",null,2025,22,1,90,76.5,76.5,"762543473429",{"$f":"IF($A150=\"\",\"\",IF(ISNA(VLOOKUP($A150,'PFA Direct'!$A$2:$J$96,1,FALSE)),\"\",\"On PFA Direct Import\"))","v":""}]
["48310","10' Standing Titan Skeleton w/Multicolor Lights",null,2025,22,1,237,170,170,"762543483107",{"$f":"IF($A151=\"\",\"\",IF(ISNA(VLOOKUP($A151,'PFA Direct'!$A$2:$J$96,1,FALSE)),\"\",\"On PFA Direct Import\"))","v":"On PFA Direct Import"}]
["48474","5 ' Skeleton w/Whole Body Light Strings","NEW",2025,22,1,48.85,35.5,{"$f":"H152","v":35.5},"762543484746",{"$f":"IF($A152=\"\",\"\",IF(ISNA(VLOOKUP($A152,'PFA Direct'!$A$2:$J$96,1,FALSE)),\"\",\"On PFA Direct Import\"))","v":"On PFA Direct Import"}]
["65107","15.7\" Hanging Skeleton",null,2025,22,12,2.15,1.8,1.8,"762543651070",{"$f":"IF($A153=\"\",\"\",IF(ISNA(VLOOKUP($A153,'PFA Direct'!$A$2:$J$96,1,FALSE)),\"\",\"On PFA Direct Import\"))","v":""}]
["80010","36in Realistic Skeleton",null,2025,22,4,10.4,8.8000000000000007,8.8000000000000007,"762543800102",{"$f":"IF($A154=\"\",\"\",IF(ISNA(VLOOKUP($A154,'PFA Direct'!$A$2:$J$96,1,FALSE)),\"\",\"On PFA Direct Import\"))","v":""}]
["84297","20\" Plastic Realistic Skeleton",null,2025,22,12,3.8,3.2,3.2,"762543842973",{"$f":"IF($A155=\"\",\"\",IF(ISNA(VLOOKUP($A155,'PFA Direct'!$A$2:$J$96,1,FALSE)),\"\",\"On PFA Direct Import\"))","v":""}]
["48499","16\" Pumpkin Skeleton w/Loose Joints-Orange","NEW",2025,23,12,2.7,2.2999999999999998,2.2999999999999998,"762543484999",{"$f":"IF($A156=\"\",\"\",IF(ISNA(VLOOKUP($A156,'PFA Direct'!$A$2:$J$96,1,FALSE)),\"\",\"On PFA Direct Import\"))","v":""}]
["64107","8\" Skeleton Torso Groundbreaker",null,2025,23,4,6.35,5.4,5.4,"762543641071",{"$f":"IF($A157=\"\",\"\",IF(ISNA(VLOOKUP($A157,'PFA Direct'!$A$2:$J$96,1,FALSE)),\"\",\"On PFA Direct Import\"))","v":""}]
["65278","18\" Hanging Skeleton Angel",null,2025,23,8,4.0999999999999996,3.5,3.5,"762543652787",{"$f":"IF($A158=\"\",\"\",IF(ISNA(VLOOKUP($A158,'PFA Direct'!$A$2:$J$96,1,FALSE)),\"\",\"On PFA Direct Import\"))","v":""}]
["80012","Lifesize Groundbreaking Skeleton",null,2025,23,4,12.35,10.5,10.5,"762543800126",{"$f":"IF($A159=\"\",\"\",IF(ISNA(VLOOKUP($A159,'PFA Direct'!$A$2:$J$96,1,FALSE)),\"\",\"On PFA Direct Import\"))","v":""}]
["94840","16\" DOD B/G Skeleton A/2 ",null,2025,23,12,2.9,2.4500000000000002,2.4500000000000002,"762543948408",{"$f":"IF($A160=\"\",\"\",IF(ISNA(VLOOKUP($A160,'PFA Direct'!$A$2:$J$96,1,FALSE)),\"\",\"On PFA Direct Import\"))","v":""}]
["95647","16\" Dressed Skeleton A6",null,2025,23,48,3.45,2.9,2.9,"762543956472",{"$f":"IF($A161=\"\",\"\",IF(ISNA(VLOOKUP($A161,'PFA Direct'!$A$2:$J$96,1,FALSE)),\"\",\"On PFA Direct Import\"))","v":""}]
["95655","6\" Dressed Skeleton A4",null,2025,23,24,2.15,1.8,1.8,"762543956557",{"$f":"IF($A162=\"\",\"\",IF(ISNA(VLOOKUP($A162,'PFA Direct'!$A$2:$J$96,1,FALSE)),\"\",\"On PFA Direct Import\"))","v":""}]
["48878","3\" Ghost w/LU Eyes","NEW",2025,23,12,2.15,1.85,1.85,"762543488782",{"$f":"IF($A163=\"\",\"\",IF(ISNA(VLOOKUP($A163,'PFA Direct'!$A$2:$J$96,1,FALSE)),\"\",\"On PFA Direct Import\"))","v":""}]
["48876","3\" Monster Head w/LU Eyes","NEW",2025,23,12,2.15,1.85,1.85,"762543488768",{"$f":"IF($A164=\"\",\"\",IF(ISNA(VLOOKUP($A164,'PFA Direct'!$A$2:$J$96,1,FALSE)),\"\",\"On PFA Direct Import\"))","v":""}]
["39292","Bag of Bones - 12 Assorted Bones",null,2025,24,6,8,6.8,6.8,"762543392928",{"$f":"IF($A165=\"\",\"\",IF(ISNA(VLOOKUP($A165,'PFA Direct'!$A$2:$J$96,1,FALSE)),\"\",\"On PFA Direct Import\"))","v":""}]
["65745","Faux Eyeballs In Mesh Bag - Set of 8",null,2025,24,24,1.7,1.45,1.45,"762543657454",{"$f":"IF($A166=\"\",\"\",IF(ISNA(VLOOKUP($A166,'PFA Direct'!$A$2:$J$96,1,FALSE)),\"\",\"On PFA Direct Import\"))","v":"On PFA Direct Import"}]
["66261","3\" Hanging Bag of Eyeballs-6pcs","NEW",2025,24,12,3.25,2.75,2.75,"762543662618",{"$f":"IF($A167=\"\",\"\",IF(ISNA(VLOOKUP($A167,'PFA Direct'!$A$2:$J$96,1,FALSE)),\"\",\"On PFA Direct Import\"))","v":""}]
["78148","Bag Of Doll Parts",null,2025,24,12,3.8,3.2,3.2,"762543781487",{"$f":"IF($A168=\"\",\"\",IF(ISNA(VLOOKUP($A168,'PFA Direct'!$A$2:$J$96,1,FALSE)),\"\",\"On PFA Direct Import\"))","v":""}]
["81720","Bag of 12 1.5\" Skulls",null,2025,24,12,2.4500000000000002,2.1,2.1,"762543817209",{"$f":"IF($A169=\"\",\"\",IF(ISNA(VLOOKUP($A169,'PFA Direct'!$A$2:$J$96,1,FALSE)),\"\",\"On PFA Direct Import\"))","v":""}]
["82142","PDQ Bones",null,2025,24,24,1.1499999999999999,1,1,"762543821428",{"$f":"IF($A170=\"\",\"\",IF(ISNA(VLOOKUP($A170,'PFA Direct'!$A$2:$J$96,1,FALSE)),\"\",\"On PFA Direct Import\"))","v":""}]
["82366","4\" Plastic Skull",null,2025,24,12,1.6,1.35,1.35,"762543823668",{"$f":"IF($A171=\"\",\"\",IF(ISNA(VLOOKUP($A171,'PFA Direct'!$A$2:$J$96,1,FALSE)),\"\",\"On PFA Direct Import\"))","v":""}]
["82467","Skulls in Bag-6pcs",null,2025,24,12,3.1,2.65,2.65,"762543824672",{"$f":"IF($A172=\"\",\"\",IF(ISNA(VLOOKUP($A172,'PFA Direct'!$A$2:$J$96,1,FALSE)),\"\",\"On PFA Direct Import\"))","v":""}]
["83552","6PK 4\" Skulls",null,2025,24,6,5.8,4.95,4.95,"762543835524",{"$f":"IF($A173=\"\",\"\",IF(ISNA(VLOOKUP($A173,'PFA Direct'!$A$2:$J$96,1,FALSE)),\"\",\"On PFA Direct Import\"))","v":""}]
["48800","Torso w/Lite Up Eyes & Flame Body","NEW",2025,25,1,20.75,16.5,16.5,"762543488003",{"$f":"IF($A174=\"\",\"\",IF(ISNA(VLOOKUP($A174,'PFA Direct'!$A$2:$J$96,1,FALSE)),\"\",\"On PFA Direct Import\"))","v":""}]
["48830","10“ Golden Fabric Disco Skull","NEW",2025,25,4,7.45,6.3,6.3,"762543488300",{"$f":"IF($A175=\"\",\"\",IF(ISNA(VLOOKUP($A175,'PFA Direct'!$A$2:$J$96,1,FALSE)),\"\",\"On PFA Direct Import\"))","v":""}]
["48854","10“ Silver Fabric Disco Skull","NEW",2025,25,4,7.45,6.3,6.3,"762543488546",{"$f":"IF($A176=\"\",\"\",IF(ISNA(VLOOKUP($A176,'PFA Direct'!$A$2:$J$96,1,FALSE)),\"\",\"On PFA Direct Import\"))","v":""}]
["61294","Flaming Giant Skull",null,2025,25,4,17,14.45,14.45,"762543612941",{"$f":"IF($A177=\"\",\"\",IF(ISNA(VLOOKUP($A177,'PFA Direct'!$A$2:$J$96,1,FALSE)),\"\",\"On PFA Direct Import\"))","v":""}]
["63508","8\" Vinyl Devil Horn Skull",null,2025,25,6,7.8,6.65,6.65,"762543635087",{"$f":"IF($A178=\"\",\"\",IF(ISNA(VLOOKUP($A178,'PFA Direct'!$A$2:$J$96,1,FALSE)),\"\",\"On PFA Direct Import\"))","v":""}]
["65689","7.9\" Bloody Creepy Skull",null,2025,25,6,5.15,4.4000000000000004,4.4000000000000004,"762543656891",{"$f":"IF($A179=\"\",\"\",IF(ISNA(VLOOKUP($A179,'PFA Direct'!$A$2:$J$96,1,FALSE)),\"\",\"On PFA Direct Import\"))","v":""}]
["66279","5\" Silver Disco Fabric Skull","NEW",2025,25,6,4.75,4.05,4.05,"762543662793",{"$f":"IF($A180=\"\",\"\",IF(ISNA(VLOOKUP($A180,'PFA Direct'!$A$2:$J$96,1,FALSE)),\"\",\"On PFA Direct Import\"))","v":""}]
["66455","7\" Decaying Skull","NEW",2025,25,6,3.35,2.85,2.85,"762543664551",{"$f":"IF($A181=\"\",\"\",IF(ISNA(VLOOKUP($A181,'PFA Direct'!$A$2:$J$96,1,FALSE)),\"\",\"On PFA Direct Import\"))","v":""}]
["66629","Glass Disco Skull","NEW",2025,25,4,19.100000000000001,13.3,13.3,"762543666296",{"$f":"IF($A182=\"\",\"\",IF(ISNA(VLOOKUP($A182,'PFA Direct'!$A$2:$J$96,1,FALSE)),\"\",\"On PFA Direct Import\"))","v":""}]
["82510","Resin Skull",null,2025,25,8,6.8,5.3,5.3,"762543825105",{"$f":"IF($A183=\"\",\"\",IF(ISNA(VLOOKUP($A183,'PFA Direct'!$A$2:$J$96,1,FALSE)),\"\",\"On PFA Direct Import\"))","v":""}]
["84342","7\" Realistic Plastic Skull",null,2025,25,12,4,3.4,3.4,"762543843420",{"$f":"IF($A184=\"\",\"\",IF(ISNA(VLOOKUP($A184,'PFA Direct'!$A$2:$J$96,1,FALSE)),\"\",\"On PFA Direct Import\"))","v":""}]
["95645","Hand Stake A2",null,2025,25,12,3,2.5499999999999998,2.5499999999999998,"762543956458",{"$f":"IF($A185=\"\",\"\",IF(ISNA(VLOOKUP($A185,'PFA Direct'!$A$2:$J$96,1,FALSE)),\"\",\"On PFA Direct Import\"))","v":""}]
["95646","7\" Fortune Telling Skull A2",null,2025,25,8,4.2,3.55,3.55,"762543956465",{"$f":"IF($A186=\"\",\"\",IF(ISNA(VLOOKUP($A186,'PFA Direct'!$A$2:$J$96,1,FALSE)),\"\",\"On PFA Direct Import\"))","v":""}]
["48454","Metal Birdcage S/3","NEW",2025,26,2,22.85,19.399999999999999,19.399999999999999,"762543484548",{"$f":"IF($A187=\"\",\"\",IF(ISNA(VLOOKUP($A187,'PFA Direct'!$A$2:$J$96,1,FALSE)),\"\",\"On PFA Direct Import\"))","v":"On PFA Direct Import"}]
["48601","32.3\" Death Angel Tombstone","NEW",2025,26,1,65.05,55.3,55.3,"762543486016",{"$f":"IF($A188=\"\",\"\",IF(ISNA(VLOOKUP($A188,'PFA Direct'!$A$2:$J$96,1,FALSE)),\"\",\"On PFA Direct Import\"))","v":""}]
["48652","20\" MGO Zombie LED","NEW",2025,26,2,37.700000000000003,32.049999999999997,32.049999999999997,"762543486528",{"$f":"IF($A189=\"\",\"\",IF(ISNA(VLOOKUP($A189,'PFA Direct'!$A$2:$J$96,1,FALSE)),\"\",\"On PFA Direct Import\"))","v":""}]
["48792","8.5'  Cemetery Archway w/Gates","NEW",2025,26,1,130,95,95,"762543487921",{"$f":"IF($A190=\"\",\"\",IF(ISNA(VLOOKUP($A190,'PFA Direct'!$A$2:$J$96,1,FALSE)),\"\",\"On PFA Direct Import\"))","v":"On PFA Direct Import"}]
["66476","5.5' KD Angel Statue","NEW",2025,26,1,120.45,75,{"$f":"H191","v":75},"762543664766",{"$f":"IF($A191=\"\",\"\",IF(ISNA(VLOOKUP($A191,'PFA Direct'!$A$2:$J$96,1,FALSE)),\"\",\"On PFA Direct Import\"))","v":"On PFA Direct Import"}]
["66708","Skeleton Dog w/Lightup Jack of Lantern","NEW",2025,26,6,16.350000000000001,13.9,13.9,"762543667088",{"$f":"IF($A192=\"\",\"\",IF(ISNA(VLOOKUP($A192,'PFA Direct'!$A$2:$J$96,1,FALSE)),\"\",\"On PFA Direct Import\"))","v":""}]
["66709","2.8' Statue w/Sonic Skull Pile","NEW",2025,26,2,40.9,34.75,34.75,"762543667095",{"$f":"IF($A193=\"\",\"\",IF(ISNA(VLOOKUP($A193,'PFA Direct'!$A$2:$J$96,1,FALSE)),\"\",\"On PFA Direct Import\"))","v":""}]
["66738","11\" Moss Toadstool Coffin","NEW",2025,26,3,8.5,7.25,7.25,"762543667385",{"$f":"IF($A194=\"\",\"\",IF(ISNA(VLOOKUP($A194,'PFA Direct'!$A$2:$J$96,1,FALSE)),\"\",\"On PFA Direct Import\"))","v":""}]
["48330","27\" LU Plastic Tombstone Bone Skull","NEW",2025,27,1,68.75,47.5,47.5,"762543483305",{"$f":"IF($A195=\"\",\"\",IF(ISNA(VLOOKUP($A195,'PFA Direct'!$A$2:$J$96,1,FALSE)),\"\",\"On PFA Direct Import\"))","v":"On PFA Direct Import"}]
["66512","36\" Tombstone - Angel","NEW",2025,27,6,15.45,13.1,13.1,"762543665121",{"$f":"IF($A196=\"\",\"\",IF(ISNA(VLOOKUP($A196,'PFA Direct'!$A$2:$J$96,1,FALSE)),\"\",\"On PFA Direct Import\"))","v":""}]
["66711","5' Witch Cauldron","NEW",2025,27,2,31.95,22.5,22.5,"762543667118",{"$f":"IF($A197=\"\",\"\",IF(ISNA(VLOOKUP($A197,'PFA Direct'!$A$2:$J$96,1,FALSE)),\"\",\"On PFA Direct Import\"))","v":""}]
["66743","21\" Light Up Tombstone","NEW",2025,27,9,8.25,7,7,"762543667439",{"$f":"IF($A198=\"\",\"\",IF(ISNA(VLOOKUP($A198,'PFA Direct'!$A$2:$J$96,1,FALSE)),\"\",\"On PFA Direct Import\"))","v":""}]
["94325","21\" Tombstone A/3 ",null,2025,27,12,4.4000000000000004,3.75,3.75,"762543943250",{"$f":"IF($A199=\"\",\"\",IF(ISNA(VLOOKUP($A199,'PFA Direct'!$A$2:$J$96,1,FALSE)),\"\",\"On PFA Direct Import\"))","v":""}]
["95563","21\" Tombstone A3",null,2025,27,12,5.05,4.3,4.3,"762543955635",{"$f":"IF($A200=\"\",\"\",IF(ISNA(VLOOKUP($A200,'PFA Direct'!$A$2:$J$96,1,FALSE)),\"\",\"On PFA Direct Import\"))","v":""}]
["95736","24\" Tombstones A2","NEW",2025,27,12,7.15,6.1,6.1,"762543957363",{"$f":"IF($A201=\"\",\"\",IF(ISNA(VLOOKUP($A201,'PFA Direct'!$A$2:$J$96,1,FALSE)),\"\",\"On PFA Direct Import\"))","v":""}]
["64890","63\" Halloween Banner - SPOOKY",null,2025,28,12,4.45,3.8,3.8,"762543648902",{"$f":"IF($A202=\"\",\"\",IF(ISNA(VLOOKUP($A202,'PFA Direct'!$A$2:$J$96,1,FALSE)),\"\",\"On PFA Direct Import\"))","v":""}]
["65277","Plastic Shackle",null,2025,28,12,3,2.5499999999999998,2.5499999999999998,"762543652770",{"$f":"IF($A203=\"\",\"\",IF(ISNA(VLOOKUP($A203,'PFA Direct'!$A$2:$J$96,1,FALSE)),\"\",\"On PFA Direct Import\"))","v":""}]
["65905","59\" Hocus Pocus Banner","NEW",2025,28,6,8.35,7.1,7.1,"762543659052",{"$f":"IF($A204=\"\",\"\",IF(ISNA(VLOOKUP($A204,'PFA Direct'!$A$2:$J$96,1,FALSE)),\"\",\"On PFA Direct Import\"))","v":""}]
["66056","6.5' Door Curtain","NEW",2025,28,12,5.85,4.95,4.95,"762543660560",{"$f":"IF($A205=\"\",\"\",IF(ISNA(VLOOKUP($A205,'PFA Direct'!$A$2:$J$96,1,FALSE)),\"\",\"On PFA Direct Import\"))","v":""}]
["78960","60in Creepy Cloth-Green",null,2025,28,18,1.6,1.35,1.35,"762543789605",{"$f":"IF($A206=\"\",\"\",IF(ISNA(VLOOKUP($A206,'PFA Direct'!$A$2:$J$96,1,FALSE)),\"\",\"On PFA Direct Import\"))","v":""}]
["88628","60in Creepy Cloth-Black",null,2025,28,18,1.6,1.35,1.35,"762543886281",{"$f":"IF($A207=\"\",\"\",IF(ISNA(VLOOKUP($A207,'PFA Direct'!$A$2:$J$96,1,FALSE)),\"\",\"On PFA Direct Import\"))","v":""}]
["88673","60in Creepy Cloth-Cream",null,2025,28,18,1.6,1.35,1.35,"762543886731",{"$f":"IF($A208=\"\",\"\",IF(ISNA(VLOOKUP($A208,'PFA Direct'!$A$2:$J$96,1,FALSE)),\"\",\"On PFA Direct Import\"))","v":""}]
["95644","20.9\" Halloween Wall Decor A2",null,2025,28,12,7.1,6,6,"762543956441",{"$f":"IF($A209=\"\",\"\",IF(ISNA(VLOOKUP($A209,'PFA Direct'!$A$2:$J$96,1,FALSE)),\"\",\"On PFA Direct Import\"))","v":""}]
["65938","25\" Halloween Banner - Trick or Treat","NEW",2025,28,12,8.35,7.1,7.1,"762543659380",{"$f":"IF($A210=\"\",\"\",IF(ISNA(VLOOKUP($A210,'PFA Direct'!$A$2:$J$96,1,FALSE)),\"\",\"On PFA Direct Import\"))","v":""}]
["47615","24.5\" Chain w/Shackles ",null,2025,29,10,4.25,3.6,3.6,"762543476154",{"$f":"IF($A211=\"\",\"\",IF(ISNA(VLOOKUP($A211,'PFA Direct'!$A$2:$J$96,1,FALSE)),\"\",\"On PFA Direct Import\"))","v":""}]
["65284","15.7\" Creepy LU Eyes Wreath",null,2025,29,4,14.95,12.7,12.7,"762543652848",{"$f":"IF($A212=\"\",\"\",IF(ISNA(VLOOKUP($A212,'PFA Direct'!$A$2:$J$96,1,FALSE)),\"\",\"On PFA Direct Import\"))","v":""}]
["65930","13\" Halloween Wreath - Candy Corn","NEW",2025,29,6,6.3,5.35,5.35,"762543659304",{"$f":"IF($A213=\"\",\"\",IF(ISNA(VLOOKUP($A213,'PFA Direct'!$A$2:$J$96,1,FALSE)),\"\",\"On PFA Direct Import\"))","v":""}]
["65932","13\" Halloween Wreath - Bat","NEW",2025,29,6,6.3,5.35,5.35,"762543659328",{"$f":"IF($A214=\"\",\"\",IF(ISNA(VLOOKUP($A214,'PFA Direct'!$A$2:$J$96,1,FALSE)),\"\",\"On PFA Direct Import\"))","v":""}]
["66624","15\" LU Wreath w/Spiders","NEW",2025,29,6,14.75,12.55,12.55,"762543666241",{"$f":"IF($A215=\"\",\"\",IF(ISNA(VLOOKUP($A215,'PFA Direct'!$A$2:$J$96,1,FALSE)),\"\",\"On PFA Direct Import\"))","v":""}]
["73708","6' Chain - Silver/Gray","NEW",2025,29,8,5,4,4,"762543737088",{"$f":"IF($A216=\"\",\"\",IF(ISNA(VLOOKUP($A216,'PFA Direct'!$A$2:$J$96,1,FALSE)),\"\",\"On PFA Direct Import\"))","v":""}]
["94472","Cast Iron Lock & Keys in Ring A/3",null,2025,29,12,7.65,6.5,6.5,"762543944721",{"$f":"IF($A217=\"\",\"\",IF(ISNA(VLOOKUP($A217,'PFA Direct'!$A$2:$J$96,1,FALSE)),\"\",\"On PFA Direct Import\"))","v":""}]
["95627","17.5\" Skull Wreath A2",null,2025,29,4,12.95,11,11,"762543956274",{"$f":"IF($A218=\"\",\"\",IF(ISNA(VLOOKUP($A218,'PFA Direct'!$A$2:$J$96,1,FALSE)),\"\",\"On PFA Direct Import\"))","v":""}]
["95701","Hanging Halloween Plaque A3","NEW",2025,29,12,2.95,2.5,2.5,"762543957011",{"$f":"IF($A219=\"\",\"\",IF(ISNA(VLOOKUP($A219,'PFA Direct'!$A$2:$J$96,1,FALSE)),\"\",\"On PFA Direct Import\"))","v":""}]
["66463","Magnetic Roach 2PK","NEW",2025,30,36,1.1499999999999999,0.9,0.9,"762543664636",{"$f":"IF($A220=\"\",\"\",IF(ISNA(VLOOKUP($A220,'PFA Direct'!$A$2:$J$96,1,FALSE)),\"\",\"On PFA Direct Import\"))","v":"On PFA Direct Import"}]
["66465","5\" Magnetic Black Widow Spider","NEW",2025,30,36,1.25,1,1,"762543664650",{"$f":"IF($A221=\"\",\"\",IF(ISNA(VLOOKUP($A221,'PFA Direct'!$A$2:$J$96,1,FALSE)),\"\",\"On PFA Direct Import\"))","v":"On PFA Direct Import"}]
["66759","Magnetic Flies 3PK","NEW",2025,30,36,1.8,1.55,1.55,"762543667590",{"$f":"IF($A222=\"\",\"\",IF(ISNA(VLOOKUP($A222,'PFA Direct'!$A$2:$J$96,1,FALSE)),\"\",\"On PFA Direct Import\"))","v":"On PFA Direct Import"}]
["94849","8\" Metal Sign A/5",null,2025,30,15,2.4,2,{"$f":"H223","v":2},"762543948491",{"$f":"IF($A223=\"\",\"\",IF(ISNA(VLOOKUP($A223,'PFA Direct'!$A$2:$J$96,1,FALSE)),\"\",\"On PFA Direct Import\"))","v":""}]
["95292","17\" Metal Sign Cats - A/3 ",null,2025,30,12,4,3.4,3.4,"762543952924",{"$f":"IF($A224=\"\",\"\",IF(ISNA(VLOOKUP($A224,'PFA Direct'!$A$2:$J$96,1,FALSE)),\"\",\"On PFA Direct Import\"))","v":""}]
["95596","Vintage Halloween Canvas A3 ",null,2025,30,12,6.3,5.35,5.35,"762543955963",{"$f":"IF($A225=\"\",\"\",IF(ISNA(VLOOKUP($A225,'PFA Direct'!$A$2:$J$96,1,FALSE)),\"\",\"On PFA Direct Import\"))","v":""}]
["95662","17in Metal Sign A4",null,2025,30,12,4,3.4,3.4,"762543956625",{"$f":"IF($A226=\"\",\"\",IF(ISNA(VLOOKUP($A226,'PFA Direct'!$A$2:$J$96,1,FALSE)),\"\",\"On PFA Direct Import\"))","v":""}]
["48739","7\" Faux Latex Heart","NEW",2025,31,12,4.1500000000000004,3.55,3.55,"762543487396",{"$f":"IF($A227=\"\",\"\",IF(ISNA(VLOOKUP($A227,'PFA Direct'!$A$2:$J$96,1,FALSE)),\"\",\"On PFA Direct Import\"))","v":""}]
["48838","5pc Faux Silicon Finger Set","NEW",2025,31,12,6.4,5.45,5.45,"762543488386",{"$f":"IF($A228=\"\",\"\",IF(ISNA(VLOOKUP($A228,'PFA Direct'!$A$2:$J$96,1,FALSE)),\"\",\"On PFA Direct Import\"))","v":""}]
["48853","4.7\" Faux Latex Brain","NEW",2025,31,12,4.2,3.55,3.55,"762543488539",{"$f":"IF($A229=\"\",\"\",IF(ISNA(VLOOKUP($A229,'PFA Direct'!$A$2:$J$96,1,FALSE)),\"\",\"On PFA Direct Import\"))","v":""}]
["48858","2pc Faux Silicon Eyeball Set","NEW",2025,31,12,3.1,2.65,2.65,"762543488584",{"$f":"IF($A230=\"\",\"\",IF(ISNA(VLOOKUP($A230,'PFA Direct'!$A$2:$J$96,1,FALSE)),\"\",\"On PFA Direct Import\"))","v":""}]
["48859","2pc Faux Silicon Ear Set","NEW",2025,31,12,3.45,2.95,2.95,"762543488591",{"$f":"IF($A231=\"\",\"\",IF(ISNA(VLOOKUP($A231,'PFA Direct'!$A$2:$J$96,1,FALSE)),\"\",\"On PFA Direct Import\"))","v":""}]
["61355","5pc Faux Silicone Toe Set","NEW",2025,31,12,5.5,4.7,4.7,"762543613559",{"$f":"IF($A232=\"\",\"\",IF(ISNA(VLOOKUP($A232,'PFA Direct'!$A$2:$J$96,1,FALSE)),\"\",\"On PFA Direct Import\"))","v":""}]
["66632","6\" Martini w/Faux Body Parts","NEW",2025,31,12,4.3499999999999996,3.7,3.7,"762543666326",{"$f":"IF($A233=\"\",\"\",IF(ISNA(VLOOKUP($A233,'PFA Direct'!$A$2:$J$96,1,FALSE)),\"\",\"On PFA Direct Import\"))","v":""}]
["66633","6\" Dessert Cup w/Faux Body Parts","NEW",2025,31,12,4.2,3.55,3.55,"762543666333",{"$f":"IF($A234=\"\",\"\",IF(ISNA(VLOOKUP($A234,'PFA Direct'!$A$2:$J$96,1,FALSE)),\"\",\"On PFA Direct Import\"))","v":""}]
["95650","Iron Hook - Hand/Foot A2 ",null,2025,31,6,7.6,6.45,6.45,"762543956502",{"$f":"IF($A235=\"\",\"\",IF(ISNA(VLOOKUP($A235,'PFA Direct'!$A$2:$J$96,1,FALSE)),\"\",\"On PFA Direct Import\"))","v":""}]
["95652","23.5\" Butcher Shop Sign w/Severed Hand/Foot A2",null,2025,31,6,8.4,7.15,7.15,"762543956526",{"$f":"IF($A236=\"\",\"\",IF(ISNA(VLOOKUP($A236,'PFA Direct'!$A$2:$J$96,1,FALSE)),\"\",\"On PFA Direct Import\"))","v":""}]
["95653","8\" Barbed Wire Foot/Hand A2",null,2025,31,12,3.8,3.2,3.2,"762543956533",{"$f":"IF($A237=\"\",\"\",IF(ISNA(VLOOKUP($A237,'PFA Direct'!$A$2:$J$96,1,FALSE)),\"\",\"On PFA Direct Import\"))","v":""}]
["95658","Meat Tray w/Faux Body Parts A2",null,2025,31,12,7.8,6.65,6.65,"762543956588",{"$f":"IF($A238=\"\",\"\",IF(ISNA(VLOOKUP($A238,'PFA Direct'!$A$2:$J$96,1,FALSE)),\"\",\"On PFA Direct Import\"))","v":"On PFA Direct Import"}]
["95727","Faux Body Parts in Bowl A2","NEW",2025,31,12,3.85,3.25,3.25,"762543957271",{"$f":"IF($A239=\"\",\"\",IF(ISNA(VLOOKUP($A239,'PFA Direct'!$A$2:$J$96,1,FALSE)),\"\",\"On PFA Direct Import\"))","v":""}]
["01584","25\" Black Spider",null,2025,32,8,4.3,3.65,3.65,"762543015841",{"$f":"IF($A240=\"\",\"\",IF(ISNA(VLOOKUP($A240,'PFA Direct'!$A$2:$J$96,1,FALSE)),\"\",\"On PFA Direct Import\"))","v":""}]
["01585","Black Spider-Medium",null,2025,32,6,6.3,5.35,5.35,"762543015858",{"$f":"IF($A241=\"\",\"\",IF(ISNA(VLOOKUP($A241,'PFA Direct'!$A$2:$J$96,1,FALSE)),\"\",\"On PFA Direct Import\"))","v":""}]
["05461","Giant Hairy Spider-Black",null,2025,32,6,16.350000000000001,13.9,13.9,"762543054611",{"$f":"IF($A242=\"\",\"\",IF(ISNA(VLOOKUP($A242,'PFA Direct'!$A$2:$J$96,1,FALSE)),\"\",\"On PFA Direct Import\"))","v":""}]
["45879","80\" Furry Spider-Black",null,2025,32,4,16.649999999999999,14.15,14.15,"762543458792",{"$f":"IF($A243=\"\",\"\",IF(ISNA(VLOOKUP($A243,'PFA Direct'!$A$2:$J$96,1,FALSE)),\"\",\"On PFA Direct Import\"))","v":""}]
["62731","23.62\" Baby Head Spider",null,2025,32,8,5.4,4.5999999999999996,4.5999999999999996,"762543627310",{"$f":"IF($A244=\"\",\"\",IF(ISNA(VLOOKUP($A244,'PFA Direct'!$A$2:$J$96,1,FALSE)),\"\",\"On PFA Direct Import\"))","v":""}]
["65669","Faux Eyeball Spider","NEW",2025,32,6,5.7,4.8499999999999996,4.8499999999999996,"762543656693",{"$f":"IF($A245=\"\",\"\",IF(ISNA(VLOOKUP($A245,'PFA Direct'!$A$2:$J$96,1,FALSE)),\"\",\"On PFA Direct Import\"))","v":""}]
["65967","LU Spider - Purple Light","NEW",2025,32,6,16.149999999999999,11.3,11.3,"762543659670",{"$f":"IF($A246=\"\",\"\",IF(ISNA(VLOOKUP($A246,'PFA Direct'!$A$2:$J$96,1,FALSE)),\"\",\"On PFA Direct Import\"))","v":"On PFA Direct Import"}]
["66640","35\" Sonic Doll Spider","NEW",2025,32,6,11.2,7.8,7.8,"762543666401",{"$f":"IF($A247=\"\",\"\",IF(ISNA(VLOOKUP($A247,'PFA Direct'!$A$2:$J$96,1,FALSE)),\"\",\"On PFA Direct Import\"))","v":""}]
["87234","63\" LU Spider",null,2025,32,4,13.6,10.25,10.25,"762543872345",{"$f":"IF($A248=\"\",\"\",IF(ISNA(VLOOKUP($A248,'PFA Direct'!$A$2:$J$96,1,FALSE)),\"\",\"On PFA Direct Import\"))","v":""}]
["95702","8\" Creepy Spider A3","NEW",2025,32,12,2.2000000000000002,1.85,1.85,"762543957028",{"$f":"IF($A249=\"\",\"\",IF(ISNA(VLOOKUP($A249,'PFA Direct'!$A$2:$J$96,1,FALSE)),\"\",\"On PFA Direct Import\"))","v":""}]
["47875","36\" Grey, White & Black Spider",null,2025,33,6,5.3,4.5,4.5,"762543478752",{"$f":"IF($A250=\"\",\"\",IF(ISNA(VLOOKUP($A250,'PFA Direct'!$A$2:$J$96,1,FALSE)),\"\",\"On PFA Direct Import\"))","v":""}]
["65316","51\" Skull Spider",null,2025,33,4,15.35,13.05,13.05,"762543653166",{"$f":"IF($A251=\"\",\"\",IF(ISNA(VLOOKUP($A251,'PFA Direct'!$A$2:$J$96,1,FALSE)),\"\",\"On PFA Direct Import\"))","v":""}]
["65684","39.4\" Spider",null,2025,33,8,6.05,5.15,5.15,"762543656846",{"$f":"IF($A252=\"\",\"\",IF(ISNA(VLOOKUP($A252,'PFA Direct'!$A$2:$J$96,1,FALSE)),\"\",\"On PFA Direct Import\"))","v":""}]
["65759","28\" Brown Hairy Spider",null,2025,33,4,8.3000000000000007,7.05,7.05,"762543657591",{"$f":"IF($A253=\"\",\"\",IF(ISNA(VLOOKUP($A253,'PFA Direct'!$A$2:$J$96,1,FALSE)),\"\",\"On PFA Direct Import\"))","v":"On PFA Direct Import"}]
["66140","24\" Disco Fabric Spider","NEW",2025,33,12,5.6,4.75,4.75,"762543661406",{"$f":"IF($A254=\"\",\"\",IF(ISNA(VLOOKUP($A254,'PFA Direct'!$A$2:$J$96,1,FALSE)),\"\",\"On PFA Direct Import\"))","v":""}]
["66509","47\" Spider - Pink/Black","NEW",2025,33,6,9.8000000000000007,8.35,{"$f":"H255","v":8.35},"762543665091",{"$f":"IF($A255=\"\",\"\",IF(ISNA(VLOOKUP($A255,'PFA Direct'!$A$2:$J$96,1,FALSE)),\"\",\"On PFA Direct Import\"))","v":""}]
["66638","91\" Spider","NEW",2025,33,6,13.85,11.75,11.75,"762543666388",{"$f":"IF($A256=\"\",\"\",IF(ISNA(VLOOKUP($A256,'PFA Direct'!$A$2:$J$96,1,FALSE)),\"\",\"On PFA Direct Import\"))","v":""}]
["75064","90\" Giant Gray Spider",null,2025,33,6,12.2,10.35,10.35,"762543750643",{"$f":"IF($A257=\"\",\"\",IF(ISNA(VLOOKUP($A257,'PFA Direct'!$A$2:$J$96,1,FALSE)),\"\",\"On PFA Direct Import\"))","v":"On PFA Direct Import"}]
["91391","Furry Neon Spider - Asst",null,2025,33,24,4.75,4,4,"762543913918",{"$f":"IF($A258=\"\",\"\",IF(ISNA(VLOOKUP($A258,'PFA Direct'!$A$2:$J$96,1,FALSE)),\"\",\"On PFA Direct Import\"))","v":""}]
["92748","48\" Hairy Spider A/3 ",null,2025,33,6,6.6,5.6,5.6,"762543927489",{"$f":"IF($A259=\"\",\"\",IF(ISNA(VLOOKUP($A259,'PFA Direct'!$A$2:$J$96,1,FALSE)),\"\",\"On PFA Direct Import\"))","v":"On PFA Direct Import"}]
["06501","5\" Furry Rat",null,2025,34,12,3.9,3.3,3.3,"762543065013",{"$f":"IF($A260=\"\",\"\",IF(ISNA(VLOOKUP($A260,'PFA Direct'!$A$2:$J$96,1,FALSE)),\"\",\"On PFA Direct Import\"))","v":"On PFA Direct Import"}]
["48003","275\" Web w/34\" Spider 12 Plastic Spiders",null,2025,34,4,14.05,11.95,11.95,"762543480038",{"$f":"IF($A261=\"\",\"\",IF(ISNA(VLOOKUP($A261,'PFA Direct'!$A$2:$J$96,1,FALSE)),\"\",\"On PFA Direct Import\"))","v":""}]
["64727","197\" Elastic Webbing",null,2025,34,12,3.15,2.7,2.7,"762543647271",{"$f":"IF($A262=\"\",\"\",IF(ISNA(VLOOKUP($A262,'PFA Direct'!$A$2:$J$96,1,FALSE)),\"\",\"On PFA Direct Import\"))","v":"On PFA Direct Import"}]
["79107","24' Gigantic Rope Web - White",null,2025,34,6,9.9499999999999993,8.4,8.4,"762543791073",{"$f":"IF($A263=\"\",\"\",IF(ISNA(VLOOKUP($A263,'PFA Direct'!$A$2:$J$96,1,FALSE)),\"\",\"On PFA Direct Import\"))","v":""}]
["82857","95\" White Web w/Black Spider",null,2025,34,6,9.65,8.1999999999999993,8.1999999999999993,"762543828571",{"$f":"IF($A264=\"\",\"\",IF(ISNA(VLOOKUP($A264,'PFA Direct'!$A$2:$J$96,1,FALSE)),\"\",\"On PFA Direct Import\"))","v":""}]
["48453","10\" Metal Standing Owl","NEW",2025,35,6,11.6,9.85,9.85,"762543484531",{"$f":"IF($A265=\"\",\"\",IF(ISNA(VLOOKUP($A265,'PFA Direct'!$A$2:$J$96,1,FALSE)),\"\",\"On PFA Direct Import\"))","v":""}]
["48503","13\" Metal Standing Crow","NEW",2025,35,4,12.25,10.4,10.4,"762543485033",{"$f":"IF($A266=\"\",\"\",IF(ISNA(VLOOKUP($A266,'PFA Direct'!$A$2:$J$96,1,FALSE)),\"\",\"On PFA Direct Import\"))","v":""}]
["65317","19.7\" Hanging Black Bat",null,2025,35,6,6.2,5.25,5.25,"762543653173",{"$f":"IF($A267=\"\",\"\",IF(ISNA(VLOOKUP($A267,'PFA Direct'!$A$2:$J$96,1,FALSE)),\"\",\"On PFA Direct Import\"))","v":"On PFA Direct Import"}]
["65783","8\" Rotten Skeleton Rat","NEW",2025,35,12,1.45,1.1499999999999999,1.1499999999999999,"762543657836",{"$f":"IF($A268=\"\",\"\",IF(ISNA(VLOOKUP($A268,'PFA Direct'!$A$2:$J$96,1,FALSE)),\"\",\"On PFA Direct Import\"))","v":""}]
["65784","12\" Rotten Skeleton Bat","NEW",2025,35,12,1.8,1.4,1.4,"762543657843",{"$f":"IF($A269=\"\",\"\",IF(ISNA(VLOOKUP($A269,'PFA Direct'!$A$2:$J$96,1,FALSE)),\"\",\"On PFA Direct Import\"))","v":""}]
["65825","7\" Rotten Skeleton Spider","NEW",2025,35,12,2.2999999999999998,1.8,1.8,"762543658253",{"$f":"IF($A270=\"\",\"\",IF(ISNA(VLOOKUP($A270,'PFA Direct'!$A$2:$J$96,1,FALSE)),\"\",\"On PFA Direct Import\"))","v":""}]
["65850","7\" Rotten Skeleton Snake","NEW",2025,35,12,1.75,1.4,1.4,"762543658505",{"$f":"IF($A271=\"\",\"\",IF(ISNA(VLOOKUP($A271,'PFA Direct'!$A$2:$J$96,1,FALSE)),\"\",\"On PFA Direct Import\"))","v":""}]
["66034","21\" Disco Fabric Bat","NEW",2025,35,12,5.0999999999999996,4.3499999999999996,4.3499999999999996,"762543660348",{"$f":"IF($A272=\"\",\"\",IF(ISNA(VLOOKUP($A272,'PFA Direct'!$A$2:$J$96,1,FALSE)),\"\",\"On PFA Direct Import\"))","v":""}]
["66350","7\" Owl","NEW",2025,35,6,4.7,4,4,"762543663509",{"$f":"IF($A273=\"\",\"\",IF(ISNA(VLOOKUP($A273,'PFA Direct'!$A$2:$J$96,1,FALSE)),\"\",\"On PFA Direct Import\"))","v":""}]
["66773","10\" Latex Rat","NEW",2025,35,12,3.1,2.65,2.65,"762543667736",{"$f":"IF($A274=\"\",\"\",IF(ISNA(VLOOKUP($A274,'PFA Direct'!$A$2:$J$96,1,FALSE)),\"\",\"On PFA Direct Import\"))","v":""}]
["66798","5.75' PU Crocodile","NEW",2025,35,2,115.45,80,80,"762543667989",{"$f":"IF($A275=\"\",\"\",IF(ISNA(VLOOKUP($A275,'PFA Direct'!$A$2:$J$96,1,FALSE)),\"\",\"On PFA Direct Import\"))","v":""}]
["81025","21\" Mesh Bat - Black",null,2025,35,12,4.05,3.45,3.45,"762543810255",{"$f":"IF($A276=\"\",\"\",IF(ISNA(VLOOKUP($A276,'PFA Direct'!$A$2:$J$96,1,FALSE)),\"\",\"On PFA Direct Import\"))","v":""}]
["95741","4 Crow Asst","NEW",2025,35,12,6.05,5.0999999999999996,5.0999999999999996,"762543957417",{"$f":"IF($A277=\"\",\"\",IF(ISNA(VLOOKUP($A277,'PFA Direct'!$A$2:$J$96,1,FALSE)),\"\",\"On PFA Direct Import\"))","v":""}]
["48844","Animal Mask - Chimpanzee","NEW",2025,36,6,6.7,5.7,5.7,"762543488447",{"$f":"IF($A278=\"\",\"\",IF(ISNA(VLOOKUP($A278,'PFA Direct'!$A$2:$J$96,1,FALSE)),\"\",\"On PFA Direct Import\"))","v":""}]
["48846","Animal Mask - Happy Cat","NEW",2025,36,6,6.7,5.7,5.7,"762543488461",{"$f":"IF($A279=\"\",\"\",IF(ISNA(VLOOKUP($A279,'PFA Direct'!$A$2:$J$96,1,FALSE)),\"\",\"On PFA Direct Import\"))","v":""}]
["48847","Animal Mask - Smiling Dog","NEW",2025,36,6,6.7,5.7,5.7,"762543488478",{"$f":"IF($A280=\"\",\"\",IF(ISNA(VLOOKUP($A280,'PFA Direct'!$A$2:$J$96,1,FALSE)),\"\",\"On PFA Direct Import\"))","v":""}]
["48869","Rainbow Wig - Adult","NEW",2025,36,24,2,1.7,1.7,"762543488690",{"$f":"IF($A281=\"\",\"\",IF(ISNA(VLOOKUP($A281,'PFA Direct'!$A$2:$J$96,1,FALSE)),\"\",\"On PFA Direct Import\"))","v":""}]
["48870","Rainbow Wig - Child","NEW",2025,36,24,1.9,1.6,1.6,"762543488706",{"$f":"IF($A282=\"\",\"\",IF(ISNA(VLOOKUP($A282,'PFA Direct'!$A$2:$J$96,1,FALSE)),\"\",\"On PFA Direct Import\"))","v":""}]
["65838","16.5\"  Bird Skull Hairpin","NEW",2025,36,12,4.5,3.85,3.85,"762543658383",{"$f":"IF($A283=\"\",\"\",IF(ISNA(VLOOKUP($A283,'PFA Direct'!$A$2:$J$96,1,FALSE)),\"\",\"On PFA Direct Import\"))","v":""}]
["66712","7.5\" Cauldron","NEW",2025,36,12,3.9,3.3,3.3,"762543667125",{"$f":"IF($A284=\"\",\"\",IF(ISNA(VLOOKUP($A284,'PFA Direct'!$A$2:$J$96,1,FALSE)),\"\",\"On PFA Direct Import\"))","v":""}]
["94102","Chopper Hairband A/4",null,2025,36,12,3.05,2.6,2.6,"762543941027",{"$f":"IF($A285=\"\",\"\",IF(ISNA(VLOOKUP($A285,'PFA Direct'!$A$2:$J$96,1,FALSE)),\"\",\"On PFA Direct Import\"))","v":""}]
["66565","Body Parts Keychains - 36pk","NEW",2025,37,3,28.95,24.6,24.6,"762543665657",{"$f":"IF($A286=\"\",\"\",IF(ISNA(VLOOKUP($A286,'PFA Direct'!$A$2:$J$96,1,FALSE)),\"\",\"On PFA Direct Import\"))","v":""}]
["93627","Deluxe Necklace & Bracelet Combo-Skulls & Bones A/3",null,2025,37,12,3.8,3.2,{"$f":"H287","v":3.2},"762543936276",{"$f":"IF($A287=\"\",\"\",IF(ISNA(VLOOKUP($A287,'PFA Direct'!$A$2:$J$96,1,FALSE)),\"\",\"On PFA Direct Import\"))","v":""}]
["94089","Witch Hat A/2",null,2025,37,6,6.8,5.8,5.8,"762543940891",{"$f":"IF($A288=\"\",\"\",IF(ISNA(VLOOKUP($A288,'PFA Direct'!$A$2:$J$96,1,FALSE)),\"\",\"On PFA Direct Import\"))","v":""}]
["94104","Witch Hat w/Spiderweb Pattern A/3",null,2025,37,48,3.2,2.7,2.7,"762543941041",{"$f":"IF($A289=\"\",\"\",IF(ISNA(VLOOKUP($A289,'PFA Direct'!$A$2:$J$96,1,FALSE)),\"\",\"On PFA Direct Import\"))","v":""}]
["95724","Halloween Hairband A2 ","NEW",2025,37,12,4.95,4.2,4.2,"762543957240",{"$f":"IF($A290=\"\",\"\",IF(ISNA(VLOOKUP($A290,'PFA Direct'!$A$2:$J$96,1,FALSE)),\"\",\"On PFA Direct Import\"))","v":""}]
["95742","10\" Creepy Plush Dolls A3","NEW",2025,37,12,4.8,4,4,"762543957424",{"$f":"IF($A291=\"\",\"\",IF(ISNA(VLOOKUP($A291,'PFA Direct'!$A$2:$J$96,1,FALSE)),\"\",\"On PFA Direct Import\"))","v":""}]
["48266","7\" 3-Skull Succulent Pot",null,2025,38,6,10.3,8.6999999999999993,8.6999999999999993,"762543482667",{"$f":"IF($A292=\"\",\"\",IF(ISNA(VLOOKUP($A292,'PFA Direct'!$A$2:$J$96,1,FALSE)),\"\",\"On PFA Direct Import\"))","v":""}]
["48715","7\" Resin Zombie Hand w/Succulent","NEW",2025,38,6,7.75,6.6,6.6,"762543487150",{"$f":"IF($A293=\"\",\"\",IF(ISNA(VLOOKUP($A293,'PFA Direct'!$A$2:$J$96,1,FALSE)),\"\",\"On PFA Direct Import\"))","v":""}]
["92848","3\" Faux Jack O’Lantern Asst",null,2025,38,12,2.0499999999999998,1.75,1.75,"762543928486",{"$f":"IF($A294=\"\",\"\",IF(ISNA(VLOOKUP($A294,'PFA Direct'!$A$2:$J$96,1,FALSE)),\"\",\"On PFA Direct Import\"))","v":""}]
["95470","Creepy Doll Succulent A/2 ",null,2025,38,12,2.2000000000000002,1.85,1.85,"762543954706",{"$f":"IF($A295=\"\",\"\",IF(ISNA(VLOOKUP($A295,'PFA Direct'!$A$2:$J$96,1,FALSE)),\"\",\"On PFA Direct Import\"))","v":""}]
["95561","3\" Resin Creepy Head A3 ",null,2025,38,12,2.7,2.2999999999999998,2.2999999999999998,"762543955611",{"$f":"IF($A296=\"\",\"\",IF(ISNA(VLOOKUP($A296,'PFA Direct'!$A$2:$J$96,1,FALSE)),\"\",\"On PFA Direct Import\"))","v":""}]
["95562","Resin Pumpkin Head A2",null,2025,38,12,2.2999999999999998,1.95,1.95,"762543955628",{"$f":"IF($A297=\"\",\"\",IF(ISNA(VLOOKUP($A297,'PFA Direct'!$A$2:$J$96,1,FALSE)),\"\",\"On PFA Direct Import\"))","v":""}]
["95641","8.5\" Skeleton Succulent  A2",null,2025,38,6,10.4,8.8000000000000007,8.8000000000000007,"762543956410",{"$f":"IF($A298=\"\",\"\",IF(ISNA(VLOOKUP($A298,'PFA Direct'!$A$2:$J$96,1,FALSE)),\"\",\"On PFA Direct Import\"))","v":""}]
["95642","4\" Halloween Succulent Planter A3",null,2025,38,12,3.1,2.65,2.65,"762543956427",{"$f":"IF($A299=\"\",\"\",IF(ISNA(VLOOKUP($A299,'PFA Direct'!$A$2:$J$96,1,FALSE)),\"\",\"On PFA Direct Import\"))","v":""}]
["95703","3.9\" Creepy Cracked Doll A3","NEW",2025,38,12,1.95,1.65,1.65,"762543957035",{"$f":"IF($A300=\"\",\"\",IF(ISNA(VLOOKUP($A300,'PFA Direct'!$A$2:$J$96,1,FALSE)),\"\",\"On PFA Direct Import\"))","v":""}]
["48436","8\" Resin Skeleton Bottle Holder","NEW",2025,39,4,9.85,8.35,8.35,"762543484364",{"$f":"IF($A301=\"\",\"\",IF(ISNA(VLOOKUP($A301,'PFA Direct'!$A$2:$J$96,1,FALSE)),\"\",\"On PFA Direct Import\"))","v":""}]
["48463","9\" Resin Black Eyes Cat","NEW",2025,39,4,7.2,6.1,6.1,"762543484630",{"$f":"IF($A302=\"\",\"\",IF(ISNA(VLOOKUP($A302,'PFA Direct'!$A$2:$J$96,1,FALSE)),\"\",\"On PFA Direct Import\"))","v":""}]
["48655","Skull Pile MGO LED","NEW",2025,39,2,28.75,24,24,"762543486559",{"$f":"IF($A303=\"\",\"\",IF(ISNA(VLOOKUP($A303,'PFA Direct'!$A$2:$J$96,1,FALSE)),\"\",\"On PFA Direct Import\"))","v":""}]
["66090","21\" Skull Flower Pot","NEW",2025,39,12,4.0999999999999996,3.5,3.5,"762543660904",{"$f":"IF($A304=\"\",\"\",IF(ISNA(VLOOKUP($A304,'PFA Direct'!$A$2:$J$96,1,FALSE)),\"\",\"On PFA Direct Import\"))","v":""}]
["66376","Halloween Black Roses w/ Skulls","NEW",2025,39,12,2.7,2.2999999999999998,2.2999999999999998,"762543663769",{"$f":"IF($A305=\"\",\"\",IF(ISNA(VLOOKUP($A305,'PFA Direct'!$A$2:$J$96,1,FALSE)),\"\",\"On PFA Direct Import\"))","v":""}]
["66623","10\" Fake Rose Bouquet with Spider","NEW",2025,39,12,3.25,2.75,2.75,"762543666234",{"$f":"IF($A306=\"\",\"\",IF(ISNA(VLOOKUP($A306,'PFA Direct'!$A$2:$J$96,1,FALSE)),\"\",\"On PFA Direct Import\"))","v":""}]
["66625","Black Branch w/3pcs Skull","NEW",2025,39,12,2.65,2.25,2.25,"762543666258",{"$f":"IF($A307=\"\",\"\",IF(ISNA(VLOOKUP($A307,'PFA Direct'!$A$2:$J$96,1,FALSE)),\"\",\"On PFA Direct Import\"))","v":""}]
["66626","Black Branch w/5 Pcs Skull","NEW",2025,39,12,3.85,3.25,3.25,"762543666265",{"$f":"IF($A308=\"\",\"\",IF(ISNA(VLOOKUP($A308,'PFA Direct'!$A$2:$J$96,1,FALSE)),\"\",\"On PFA Direct Import\"))","v":""}]
["80190","Bloody White Rose",null,2025,39,24,1.3,1.1000000000000001,1.1000000000000001,"762543801901",{"$f":"IF($A309=\"\",\"\",IF(ISNA(VLOOKUP($A309,'PFA Direct'!$A$2:$J$96,1,FALSE)),\"\",\"On PFA Direct Import\"))","v":""}]
["80390","Black Rose w/Black Stem",null,2025,39,24,1.05,0.9,0.9,"762543803905",{"$f":"IF($A310=\"\",\"\",IF(ISNA(VLOOKUP($A310,'PFA Direct'!$A$2:$J$96,1,FALSE)),\"\",\"On PFA Direct Import\"))","v":"On PFA Direct Import"}]
["81568","Dark Red Rose w/Silver Glitter",null,2025,39,24,1,0.9,0.9,"762543815687",{"$f":"IF($A311=\"\",\"\",IF(ISNA(VLOOKUP($A311,'PFA Direct'!$A$2:$J$96,1,FALSE)),\"\",\"On PFA Direct Import\"))","v":"On PFA Direct Import"}]
["87143","Black Rose w/Skeleton Hand",null,2025,39,24,1.4,1.1000000000000001,1.1000000000000001,"762543871430",{"$f":"IF($A312=\"\",\"\",IF(ISNA(VLOOKUP($A312,'PFA Direct'!$A$2:$J$96,1,FALSE)),\"\",\"On PFA Direct Import\"))","v":""}]
["66922","66.9\" Animated Standing Scarecrow","NEW",2025,40,1,49,41.7,41.7,"762543669228",{"$f":"IF($A313=\"\",\"\",IF(ISNA(VLOOKUP($A313,'PFA Direct'!$A$2:$J$96,1,FALSE)),\"\",\"On PFA Direct Import\"))","v":""}]
["65606","72\" Hanging Witch with Crystal Ball",null,2025,40,2,24.5,20.9,20.9,"762543656068",{"$f":"IF($A314=\"\",\"\",IF(ISNA(VLOOKUP($A314,'PFA Direct'!$A$2:$J$96,1,FALSE)),\"\",\"On PFA Direct Import\"))","v":""}]
["65948","35.4\" Animated Hanging Reaper w/Chains","NEW",2025,40,12,10.199999999999999,8.6999999999999993,8.6999999999999993,"762543659489",{"$f":"IF($A315=\"\",\"\",IF(ISNA(VLOOKUP($A315,'PFA Direct'!$A$2:$J$96,1,FALSE)),\"\",\"On PFA Direct Import\"))","v":""}]
["66699","39.4\" Hanging Animated Black Reaper","NEW",2025,40,4,13.8,11.8,11.8,"762543666999",{"$f":"IF($A316=\"\",\"\",IF(ISNA(VLOOKUP($A316,'PFA Direct'!$A$2:$J$96,1,FALSE)),\"\",\"On PFA Direct Import\"))","v":""}]
["63566","23.5\" Hanging Ghost w/Witch Hat","NEW",2025,40,12,3.8,3.3,3.3,"762543635667",{"$f":"IF($A317=\"\",\"\",IF(ISNA(VLOOKUP($A317,'PFA Direct'!$A$2:$J$96,1,FALSE)),\"\",\"On PFA Direct Import\"))","v":""}]
["66701","90.6\" Black Reaper Curtain","NEW",2025,40,4,17.600000000000001,15,15,"762543667019",{"$f":"IF($A318=\"\",\"\",IF(ISNA(VLOOKUP($A318,'PFA Direct'!$A$2:$J$96,1,FALSE)),\"\",\"On PFA Direct Import\"))","v":"On PFA Direct Import"}]
["66579","82.7\" Standing Animated Wings Reaper","NEW",2025,41,1,88,74.7,{"$f":"H319","v":74.7},"762543665794",{"$f":"IF($A319=\"\",\"\",IF(ISNA(VLOOKUP($A319,'PFA Direct'!$A$2:$J$96,1,FALSE)),\"\",\"On PFA Direct Import\"))","v":"On PFA Direct Import"}]
["66618","61\" Animated Standing Grim Red Reaper","NEW",2025,41,1,47.6,40.4,40.4,"762543666180",{"$f":"IF($A320=\"\",\"\",IF(ISNA(VLOOKUP($A320,'PFA Direct'!$A$2:$J$96,1,FALSE)),\"\",\"On PFA Direct Import\"))","v":""}]
["66630","65\" Standing Animated Reaper - White","NEW",2025,41,4,33.799999999999997,28.8,28.8,"762543666302",{"$f":"IF($A321=\"\",\"\",IF(ISNA(VLOOKUP($A321,'PFA Direct'!$A$2:$J$96,1,FALSE)),\"\",\"On PFA Direct Import\"))","v":""}]
["66921","98.4\" Standing Animated Scarecrow","NEW",2025,41,1,87.9,65,65,"762543669211",{"$f":"IF($A322=\"\",\"\",IF(ISNA(VLOOKUP($A322,'PFA Direct'!$A$2:$J$96,1,FALSE)),\"\",\"On PFA Direct Import\"))","v":""}]
["66689","51.2\" Animated Reaper","NEW",2025,41,4,18,15.3,15.3,"762543666890",{"$f":"IF($A323=\"\",\"\",IF(ISNA(VLOOKUP($A323,'PFA Direct'!$A$2:$J$96,1,FALSE)),\"\",\"On PFA Direct Import\"))","v":""}]
["66663","90.6\" Hanging Skull - Black","NEW",2025,42,4,11.2,9.5,9.5,"762543666630",{"$f":"IF($A324=\"\",\"\",IF(ISNA(VLOOKUP($A324,'PFA Direct'!$A$2:$J$96,1,FALSE)),\"\",\"On PFA Direct Import\"))","v":""}]
["66664","63\" Hanging Black Hair Ghoul ","NEW",2025,42,6,7.9,6.7,6.7,"762543666647",{"$f":"IF($A325=\"\",\"\",IF(ISNA(VLOOKUP($A325,'PFA Direct'!$A$2:$J$96,1,FALSE)),\"\",\"On PFA Direct Import\"))","v":""}]
["66665","63\" Hanging Red Hair Skull","NEW",2025,42,6,7.9,6.7,6.7,"762543666654",{"$f":"IF($A326=\"\",\"\",IF(ISNA(VLOOKUP($A326,'PFA Direct'!$A$2:$J$96,1,FALSE)),\"\",\"On PFA Direct Import\"))","v":""}]
["66016","89\" Grey Spider","NEW",2025,42,4,10.9,9.1999999999999993,9.1999999999999993,"762543660164",{"$f":"IF($A327=\"\",\"\",IF(ISNA(VLOOKUP($A327,'PFA Direct'!$A$2:$J$96,1,FALSE)),\"\",\"On PFA Direct Import\"))","v":""}]
["66011","30.7\" Black Spider","NEW",2025,42,4,3.3,2.8,2.8,"762543660119",{"$f":"IF($A328=\"\",\"\",IF(ISNA(VLOOKUP($A328,'PFA Direct'!$A$2:$J$96,1,FALSE)),\"\",\"On PFA Direct Import\"))","v":""}]
["66747","16.1\" Flower And Skull Wreath","NEW",2025,42,6,11.6,9.8000000000000007,9.8000000000000007,"762543667477",{"$f":"IF($A329=\"\",\"\",IF(ISNA(VLOOKUP($A329,'PFA Direct'!$A$2:$J$96,1,FALSE)),\"\",\"On PFA Direct Import\"))","v":""}]
["66637","3.1\" Eyeball","NEW",2025,43,12,6.5,5.6,5.6,"762543666371",{"$f":"IF($A330=\"\",\"\",IF(ISNA(VLOOKUP($A330,'PFA Direct'!$A$2:$J$96,1,FALSE)),\"\",\"On PFA Direct Import\"))","v":""}]
["95745","7.1\" Eyeball Bag A2","NEW",2025,43,12,4.7,4,4,"762543957455",{"$f":"IF($A331=\"\",\"\",IF(ISNA(VLOOKUP($A331,'PFA Direct'!$A$2:$J$96,1,FALSE)),\"\",\"On PFA Direct Import\"))","v":""}]
["66737","13.6\" Sonic Death Car","NEW",2025,43,6,16.2,13.8,13.8,"762543667378",{"$f":"IF($A332=\"\",\"\",IF(ISNA(VLOOKUP($A332,'PFA Direct'!$A$2:$J$96,1,FALSE)),\"\",\"On PFA Direct Import\"))","v":""}]
["66745","Bag of 6in Skull-3pcs","NEW",2025,43,6,9.3000000000000007,7.9,7.9,"762543667453",{"$f":"IF($A333=\"\",\"\",IF(ISNA(VLOOKUP($A333,'PFA Direct'!$A$2:$J$96,1,FALSE)),\"\",\"On PFA Direct Import\"))","v":""}]
["48182","9.3\" Dragon Eye Spellbook","NEW",2025,43,6,9.6999999999999993,8.3000000000000007,8.3000000000000007,"762543481820",{"$f":"IF($A334=\"\",\"\",IF(ISNA(VLOOKUP($A334,'PFA Direct'!$A$2:$J$96,1,FALSE)),\"\",\"On PFA Direct Import\"))","v":""}]
["48812","Sunglass for 10ft skeleton","NEW",2025,43,20,3.9,3.3,3.3,"762543488126",{"$f":"IF($A335=\"\",\"\",IF(ISNA(VLOOKUP($A335,'PFA Direct'!$A$2:$J$96,1,FALSE)),\"\",\"On PFA Direct Import\"))","v":""}]
["48113","11\" Poly Skeleton",null,2025,43,4,16,13.7,13.7,"762543481134",{"$f":"IF($A336=\"\",\"\",IF(ISNA(VLOOKUP($A336,'PFA Direct'!$A$2:$J$96,1,FALSE)),\"\",\"On PFA Direct Import\"))","v":""}]
["118655G","4' Animated KD-Grinch-Dr. Seuss","NEW",2025,44,1,147.1,105,105,"191245186557",{"$f":"IF($A337=\"\",\"\",IF(ISNA(VLOOKUP($A337,'PFA Direct'!$A$2:$J$96,1,FALSE)),\"\",\"On PFA Direct Import\"))","v":"On PFA Direct Import"}]
["224991G","Airblown-Stylized Chucky-SM-Universal","NEW",2025,44,6,39,28,28,"191245249917",{"$f":"IF($A338=\"\",\"\",IF(ISNA(VLOOKUP($A338,'PFA Direct'!$A$2:$J$96,1,FALSE)),\"\",\"On PFA Direct Import\"))","v":""}]
["225112G","Airblown-Dave as Skeleton-SM-Universal","NEW",2025,44,6,39,28,28,"191245251125",{"$f":"IF($A339=\"\",\"\",IF(ISNA(VLOOKUP($A339,'PFA Direct'!$A$2:$J$96,1,FALSE)),\"\",\"On PFA Direct Import\"))","v":"On PFA Direct Import"}]
["225884G","Airblown-Stylized Pennywise-SM-WB","NEW",2025,44,6,39,28,28,"191245258841",{"$f":"IF($A340=\"\",\"\",IF(ISNA(VLOOKUP($A340,'PFA Direct'!$A$2:$J$96,1,FALSE)),\"\",\"On PFA Direct Import\"))","v":""}]
["550424G","Animated Airblown-Reaching-Pennywise-Giant","NEW",2025,44,2,185.7,130,130,"191245504245",{"$f":"IF($A341=\"\",\"\",IF(ISNA(VLOOKUP($A341,'PFA Direct'!$A$2:$J$96,1,FALSE)),\"\",\"On PFA Direct Import\"))","v":""}]
["550702G","Airblown-Hello Kitty Neon Skeleton-SM-Sanrio",null,2025,44,6,39,27.5,27.5,"191245507024",{"$f":"IF($A342=\"\",\"\",IF(ISNA(VLOOKUP($A342,'PFA Direct'!$A$2:$J$96,1,FALSE)),\"\",\"On PFA Direct Import\"))","v":""}]
["551042G","Airblown-Stylized Leatherface-SM-Radar","NEW",2025,44,6,39,28,28,"191245510420",{"$f":"IF($A343=\"\",\"\",IF(ISNA(VLOOKUP($A343,'PFA Direct'!$A$2:$J$96,1,FALSE)),\"\",\"On PFA Direct Import\"))","v":""}]
["65923","63\" Halloween Banner - Spooky Ghosts","NEW",2025,44,12,4,3.4,3.4,"762543659236",{"$f":"IF($A344=\"\",\"\",IF(ISNA(VLOOKUP($A344,'PFA Direct'!$A$2:$J$96,1,FALSE)),\"\",\"On PFA Direct Import\"))","v":""}]
["65926","63\" Halloween Banner - Black Skulls","NEW",2025,44,12,3.8,3.25,3.25,"762543659267",{"$f":"IF($A345=\"\",\"\",IF(ISNA(VLOOKUP($A345,'PFA Direct'!$A$2:$J$96,1,FALSE)),\"\",\"On PFA Direct Import\"))","v":""}]
["66562","63\" Halloween Banner - Pink Skulls","NEW",2025,44,12,3.8,3.25,3.25,"762543665626",{"$f":"IF($A346=\"\",\"\",IF(ISNA(VLOOKUP($A346,'PFA Direct'!$A$2:$J$96,1,FALSE)),\"\",\"On PFA Direct Import\"))","v":""}]
["65921","63\" Halloween Banner - Black Cat Faces","NEW",2025,44,12,4.05,3.4,3.4,"762543659212",{"$f":"IF($A347=\"\",\"\",IF(ISNA(VLOOKUP($A347,'PFA Direct'!$A$2:$J$96,1,FALSE)),\"\",\"On PFA Direct Import\"))","v":""}]
["66688","35.4\" Floating Reaper in Creepy Pumpkin Head","NEW",2025,null,6,19.100000000000001,16.25,{"$f":"H348","v":16.25},"762543666883",{"$f":"IF($A348=\"\",\"\",IF(ISNA(VLOOKUP($A348,'PFA Direct'!$A$2:$J$96,1,FALSE)),\"\",\"On PFA Direct Import\"))","v":""}]
["66611","74.4\" Animated Standing Scarecrow","NEW",2025,null,1,125,89,89,"762543666111",{"$f":"IF($A349=\"\",\"\",IF(ISNA(VLOOKUP($A349,'PFA Direct'!$A$2:$J$96,1,FALSE)),\"\",\"On PFA Direct Import\"))","v":""}]
["66612","72\" Animated Standing Zombie","NEW",2025,null,1,121.7,85,85,"762543666128",{"$f":"IF($A350=\"\",\"\",IF(ISNA(VLOOKUP($A350,'PFA Direct'!$A$2:$J$96,1,FALSE)),\"\",\"On PFA Direct Import\"))","v":""}]
["66613","82.7\" Animated Standing Clown","NEW",2025,null,1,122.30000000000001,87,87,"762543666135",{"$f":"IF($A351=\"\",\"\",IF(ISNA(VLOOKUP($A351,'PFA Direct'!$A$2:$J$96,1,FALSE)),\"\",\"On PFA Direct Import\"))","v":""}]
["66621","98.4\" Animated Haunted Tree","NEW",2025,null,1,156.10000000000002,110,110,"762543666210",{"$f":"IF($A352=\"\",\"\",IF(ISNA(VLOOKUP($A352,'PFA Direct'!$A$2:$J$96,1,FALSE)),\"\",\"On PFA Direct Import\"))","v":""}]
["48317","LU Titan Groundbreaker Skeleton","NEW",2025,null,1,136.94999999999999,95,95,"762543483176",{"$f":"IF($A353=\"\",\"\",IF(ISNA(VLOOKUP($A353,'PFA Direct'!$A$2:$J$96,1,FALSE)),\"\",\"On PFA Direct Import\"))","v":""}]
[null,null,null,null,null,null,null,null,null,null,{"$f":"IF($A354=\"\",\"\",IF(ISNA(VLOOKUP($A354,'PFA Direct'!$A$2:$J$96,1,FALSE)),\"\",\"On PFA Direct Import\"))","v":""}]

{"sheet":"PFA Direct","index":2,"n_rows":80,"n_cols":7,"rows_kept":80,"cut":false,"hidden":false,"merged":[]}
["Item #","display sort","Category","Item","Sample?","Image"]
["65466",null,"Deco","7in Crawling Hand Flesh Color"]
["114463G",null,"Deco","Christmas Grinch Hng Inflatable 4' Gemmy"]
["92748",null,"Spider","48in Hairy Spider A/3 (24 PFA)"]
["45726",null,"Spider","5FT LARGE BLACK SPIDER"]
["48258",null,"Skeleton","3Pk 4in Skulls"]
["48310",null,"Skeleton","10ft Standing Titan Skeleton w/Multicolor Lights"]
["61709",null,"Deco","20\" Bloody Hand & Foot"]
["64821",null,"Deco","33.5\" Peek-a-boo Witch Ghost"]
["65296",null,"Deco","78.7\" X 39in Halloween Burlap Decor","Y"]
["65317",null,"Deco","19.7\" Hanging Black Bat"]
["65745",null,"Accessory","Faux Eyeballs In Mesh Bag - Set of 8"]
["65759",null,"Spider","Brown Spider"]
["75384",null,"Tombstone","22\" CEMETERY MARKERS"]
["92747",null,"Hng Deco","21\" Hanging Zombie A/2 (24 PFA)"]
["95608",null,"Deco","Fake Door Curtain A2 Printed Non-Woven","Crypt Door Only"]
["95629",null,"Hng Deco","30in Hanging Reaper A/2 (24 PFA)"]
["95630",null,"Tombstone","21.5'' tombstone"]
["95631",null,"Tombstone","16.5\" Tombstone"]
["06501",null,"Deco","5in Realistic Rat"]
["94847",null,"Hng Prop","Hanging Reaper Assortment 18\" A3"]
["48026",null,"Deco","8.8FT Huge Giant Bat"]
["64727",null,"Spider Web","197\" Stretch Web Material"]
["39280",null,"Deco","35in Reailstic Skeleton"]
["39293",null,"Hanging Deco","20in Skeleton"]
["46609",null,"Spider","73in Grey Trim Black Spider (Add sls from 45879)"]
["46804",null,"Skeleton","60in Posable Skeleton"]
["62372",null,"Bag of","2\" Glow In Dark Eyeballs in Mesh Bag"]
["75064",null,"Spider","90IN GIANT GRAY SPIDER"]
["78216",null,"Hng Prop","32in Hanging Ghost"]
["94443",null,"Hng Prop","18\" Hanging Ghost - Spooky"]
["94851",null,"Hng Prop","28in Hng Ghost with Hat A/4 (19)"]
["94859",null,"Deco","Creepy Cloth"]
["95454",null,"Accessory","17in Witch Hat A2"]
["95695",null,"Accessory","NEW: 10'' Creepy Animals (A3 PFA)"]
["73640",null,"Deco","NEW: 13\" Neon Skeleton 4pk"]
["66465",null,"Accessory","NEW: Magnetic Black Widow Spider 4.9\""]
["66759",null,"Accessory","NEW: Magnetic Flies 3PK 0.98x1.18x0.20 inches"]
["66463",null,"Accessory","NEW: Magnetic Roach 2PK 2.36x1.26x0.16 inches"]
["48643",null,"Deco","NEW: 9.7\" Cast Iron Spider Bowl","Y"]
["48338",null,"Tombstone","NEW: 22\" Tombstone - Reaper Skeleton","Y"]
["45768",null,"Deco","NEW: 6\" Ceramic Retro Cat Cookie Jar","Y"]
["48408",null,"Deco","NEW: 7.1\" Glass DOD Skull LED","Y"]
["47741",null,"Accessory","NEW: 17.5\" Spider Web 2-Tier Cake Stand","Y"]
["48792",null,"Deco","NEW: Cemetery Metal Archway 7'-8'Tall (Update from 48280)"]
["48454",null,"Deco","NEW: 12.2\" Metal Birdcage S/3 8.27x8.27x12.20 inches"]
["48474",null,"Skeleton","NEW: 5ft Skeleton W/Whole Body light Strings","Will hand carry to Vegas"]
["48330",null,"Deco","NEW: 27.4\" LU Plastic Bone Skull (Relaces 47265)"]
["48475",null,"Deco","NEW: 6ft Chain Plastic"]
["66336",null,"Tombstone","NEW: 16.5\" Skull Tombstone SET - 4pcs"]
["66436",null,"Tombstone","NEW: 36\" Angel Tombstone Foam"]
["95691",null,"Tombstone","NEW: 26\" Tombstone Skull RIP A2 (25 PFA) "]
["95737",null,"Deco","NEW: 3.9\" Creepy Cracked Doll Head Black & White Asst","Y"]
["66476",null,"Tombstone","NEW: 67.7\" KD Angel Statue Plastic"]
["66505",null,"Deco","NEW: 66.93”Animated Standing Pumpkin Scarecrow (Update to 65622)","Y"]
["66502",null,"Deco","NEW:98.4\" Animated Standing Clown Black/Red/Wht","Y"]
["95738",null,"Deco","NEW: 15.7\" Hanging Girl With Black Dress & Floral Skirt","Y"]
["95692",null,"Deco","NEW: 20\" Creepy Dolls A2 (25 PFA) Update to 95606","Y"]
["65964",null,"Deco","NEW: 27.6\" Hanging Bloody Doll","Y"]
["65970",null,"Deco","NEW: 39.4\" Hanging Doll with Sounds And Lights","Y"]
["95739",null,"Deco","NEW: 15.5\" Hanging Skeleton and Hng Clown ","Y"]
["66033",null,"Deco","NEW: 9Ft Hanging LU White Reaper ","Y"]
["95693",null,"Deco","NEW: Halloween Wreath  Snake Theme A2 (25 PFA) Update from 95627","Y"]
["95694",null,"Deco","NEW: Halloween Hairband w/Veil  A2 (25 PFA)"]
["95658",null,"Accessory","NEW: BODY PARTS A2","Brain version only"]
["80390",null,"Accessory","NEW: 17in Black Rose"]
["81568",null,"Accessory","NEW: 17in Rose-Red w/Glitter","y"]
["118655G",null,"Deco","NEW: 48in Animated Standing Grinch","Hand Carry to Vegas"]
["225112G",null,"Deco","NEW: 36in Airblown Minion"]
["66701",null,"Deco","NEW: 8' Hanging Black Reaper (VALUE)","Will pull",null,"x"]
["66652",null,"Deco","NEW: 5' Hanging Black Reaper (VALUE)"]
["66579",null,"Deco","NEW: 7' Reaper Black with Moving Wings"]
["66722",null,"Deco","NEW: Rising  Ground Reaper with Hair Grows from 4' to 6'"]
["65967",null,"Deco","NEW: 60\" Big Light Up Spider","Will hand carry to Vegas"]
["95740",null,"Deco","\tFood And Body Parts in Goblet A4","Will hand carry to Vegas"]
["48871",null,"Deco","10.2\" Animated Crawling Foot"]
["48872",null,"Deco","7.5\" Haunted Phone"]
["48873",null,"Deco","11\" Squeaking Rat"]
["48874",null,"Deco","9.1\" Eyeballs Cauldron"]
["48875",null,"Deco","7.9\" Talking Skull Bust"]