{"text_format":"1","workbook":"xlsx","n_sheets":3,"sheets":["2025 Order Form","Data","PFA Direct"],"not_rendered":{"charts":0,"images":80,"macros":0,"external_links":0,"defined_names":3,"comments":0,"pivot_tables":0},"unopened":[],"bounds":{"document_bytes":16777216,"sheet_cells":100000,"rows_first":2000,"rows_last":500,"rows_between":2000,"halvings":0,"cell_chars":16384,"cell_head_chars":4096},"cells_cut":0,"cells_raw":0,"read":"whole","date_system":"1900"}

{"sheet":"2025 Order Form","index":0,"n_rows":601,"n_cols":15,"rows_kept":601,"cut":false,"hidden":false,"merged":[[15,6,15,10],[16,1,16,10],[17,0,17,10],[18,0,18,10],[14,0,14,2],[14,3,14,5],[14,6,14,7],[14,8,14,9],[15,0,15,1],[15,3,15,5],[7,0,7,2],[8,0,8,3],[8,4,8,10],[9,0,9,3],[9,4,9,10],[13,0,13,2],[13,3,13,5],[13,6,13,7],[13,8,13,9],[10,0,10,3],[10,4,10,10],[11,0,11,3],[11,4,11,10],[12,0,12,2],[12,3,12,7],[12,8,12,10]]}
[null,null,"Sunstar Industries"]
[null,null,"PO Box 3037"]
[null,null,"Cerritos, CA  90703"]
[null,null,"Ph: (657) 239-0196"]
[null,null,"order@sunstargifts.com"]
[]
[]
[" "]
[]
[]
[]
[]
[]
[]
[null,null,null,null,null,null,"PFA",null,"show",null,20]
[]
[]
[null,null,null,null,null,null,null,null,null,null,null,null,null,null,"Running Total:"]
[null,null,null,null,null,null,null,null,null,null,null,null,null,null,{"$f":"K601","v":0}]
[]
["Qty","Item #","Description","UPC #","Ct","Pg","Whsl","DC","PRG","Cost","TOTAL","PRG","Case Qty","Total Cases","Status"]
[null,null,{"$f":"IF($B22=\"\",\"\",VLOOKUP($B22,Data!$A$4:$T$727,2,FALSE))","v":""},{"$f":"IF($B22=\"\",\"\",VLOOKUP($B22,Data!$A$4:$T$727,10,FALSE))","v":""},{"$f":"IF($B22=\"\",\"\",VLOOKUP($B22,Data!$A$4:$T$727,4,FALSE))","v":""},{"$f":"IF($B22=\"\",\"\",VLOOKUP($B22,Data!$A$4:$T$727,5,FALSE))","v":""},{"$f":"IF($B22=\"\",\"\",VLOOKUP($B22,Data!$A$4:$T$727,7,FALSE))","v":""},{"$f":"IF($B22=\"\",\"\",IF($K$15=\"\",\"\",ROUND($G22*(1-($K$15*0.01)),2)))","v":""},{"$f":"IF($B22=\"\",\"\",IF($G22=$L22,\"\",L22))","v":""},{"$f":"IF($B22=\"\",\"\",IF($H22<$L22,$H22,$L22))","v":""},{"$f":"IF(A22=\"\",\"\",J22*A22)","v":""},{"$f":"IF($I$15=\"Show\",VLOOKUP($B22,Data!$A$4:$T$727,9,FALSE),VLOOKUP($B22,Data!$A$4:$T$727,7,FALSE))","v":{"$error":"#N/A"}},{"$f":"IF($B22=\"\",\"\",VLOOKUP($B22,Data!$A$4:$T$727,6,FALSE))","v":""},{"$f":"IF($A22=\"\",\"\",$A22/$M22)","v":""},{"$f":"IF($B22=\"\",\"\",IF(VLOOKUP($B22,Data!$A$4:$T$727,11,FALSE)<1,\"\",VLOOKUP(B22,Data!$A$4:$T$727,11,FALSE)))","v":""}]
[null,null,{"$f":"IF($B23=\"\",\"\",VLOOKUP($B23,Data!$A$4:$T$727,2,FALSE))","v":""},{"$f":"IF($B23=\"\",\"\",VLOOKUP($B23,Data!$A$4:$T$727,10,FALSE))","v":""},{"$f":"IF($B23=\"\",\"\",VLOOKUP($B23,Data!$A$4:$T$727,4,FALSE))","v":""},{"$f":"IF($B23=\"\",\"\",VLOOKUP($B23,Data!$A$4:$T$727,5,FALSE))","v":""},{"$f":"IF($B23=\"\",\"\",VLOOKUP($B23,Data!$A$4:$T$727,7,FALSE))","v":""},{"$f":"IF($B23=\"\",\"\",IF($K$15=\"\",\"\",ROUND($G23*(1-($K$15*0.01)),2)))","v":""},{"$f":"IF($B23=\"\",\"\",IF($G23=$L23,\"\",L23))","v":""},{"$f":"IF($B23=\"\",\"\",IF($H23<$L23,$H23,$L23))","v":""},"",{"$f":"IF($I$15=\"Show\",VLOOKUP($B23,Data!$A$4:$T$727,9,FALSE),VLOOKUP($B23,Data!$A$4:$T$727,7,FALSE))","v":{"$error":"#N/A"}},{"$f":"IF($B23=\"\",\"\",VLOOKUP($B23,Data!$A$4:$T$727,6,FALSE))","v":""},"",{"$f":"IF($B23=\"\",\"\",IF(VLOOKUP($B23,Data!$A$4:$T$727,11,FALSE)<1,\"\",VLOOKUP(B23,Data!$A$4:$T$727,11,FALSE)))","v":""}]
[null,null,{"$f":"IF($B24=\"\",\"\",VLOOKUP($B24,Data!$A$4:$T$727,2,FALSE))","v":""},{"$f":"IF($B24=\"\",\"\",VLOOKUP($B24,Data!$A$4:$T$727,10,FALSE))","v":""},{"$f":"IF($B24=\"\",\"\",VLOOKUP($B24,Data!$A$4:$T$727,4,FALSE))","v":""},{"$f":"IF($B24=\"\",\"\",VLOOKUP($B24,Data!$A$4:$T$727,5,FALSE))","v":""},{"$f":"IF($B24=\"\",\"\",VLOOKUP($B24,Data!$A$4:$T$727,7,FALSE))","v":""},{"$f":"IF($B24=\"\",\"\",IF($K$15=\"\",\"\",ROUND($G24*(1-($K$15*0.01)),2)))","v":""},{"$f":"IF($B24=\"\",\"\",IF($G24=$L24,\"\",L24))","v":""},{"$f":"IF($B24=\"\",\"\",IF($H24<$L24,$H24,$L24))","v":""},"",{"$f":"IF($I$15=\"Show\",VLOOKUP($B24,Data!$A$4:$T$727,9,FALSE),VLOOKUP($B24,Data!$A$4:$T$727,7,FALSE))","v":{"$error":"#N/A"}},{"$f":"IF($B24=\"\",\"\",VLOOKUP($B24,Data!$A$4:$T$727,6,FALSE))","v":""},"",{"$f":"IF($B24=\"\",\"\",IF(VLOOKUP($B24,Data!$A$4:$T$727,11,FALSE)<1,\"\",VLOOKUP(B24,Data!$A$4:$T$727,11,FALSE)))","v":""}]
[null,null,{"$f":"IF($B25=\"\",\"\",VLOOKUP($B25,Data!$A$4:$T$727,2,FALSE))","v":""},{"$f":"IF($B25=\"\",\"\",VLOOKUP($B25,Data!$A$4:$T$727,10,FALSE))","v":""},{"$f":"IF($B25=\"\",\"\",VLOOKUP($B25,Data!$A$4:$T$727,4,FALSE))","v":""},{"$f":"IF($B25=\"\",\"\",VLOOKUP($B25,Data!$A$4:$T$727,5,FALSE))","v":""},{"$f":"IF($B25=\"\",\"\",VLOOKUP($B25,Data!$A$4:$T$727,7,FALSE))","v":""},"","","","",{"$f":"IF($I$15=\"Show\",VLOOKUP($B25,Data!$A$4:$T$727,9,FALSE),VLOOKUP($B25,Data!$A$4:$T$727,7,FALSE))","v":{"$error":"#N/A"}},{"$f":"IF($B25=\"\",\"\",VLOOKUP($B25,Data!$A$4:$T$727,6,FALSE))","v":""},"",{"$f":"IF($B25=\"\",\"\",IF(VLOOKUP($B25,Data!$A$4:$T$727,11,FALSE)<1,\"\",VLOOKUP(B25,Data!$A$4:$T$727,11,FALSE)))","v":""}]
[null,null,{"$f":"IF($B26=\"\",\"\",VLOOKUP($B26,Data!$A$4:$T$727,2,FALSE))","v":""},{"$f":"IF($B26=\"\",\"\",VLOOKUP($B26,Data!$A$4:$T$727,10,FALSE))","v":""},{"$f":"IF($B26=\"\",\"\",VLOOKUP($B26,Data!$A$4:$T$727,4,FALSE))","v":""},{"$f":"IF($B26=\"\",\"\",VLOOKUP($B26,Data!$A$4:$T$727,5,FALSE))","v":""},{"$f":"IF($B26=\"\",\"\",VLOOKUP($B26,Data!$A$4:$T$727,7,FALSE))","v":""},"","","","",{"$f":"IF($I$15=\"Show\",VLOOKUP($B26,Data!$A$4:$T$727,9,FALSE),VLOOKUP($B26,Data!$A$4:$T$727,7,FALSE))","v":{"$error":"#N/A"}},{"$f":"IF($B26=\"\",\"\",VLOOKUP($B26,Data!$A$4:$T$727,6,FALSE))","v":""},"",{"$f":"IF($B26=\"\",\"\",IF(VLOOKUP($B26,Data!$A$4:$T$727,11,FALSE)<1,\"\",VLOOKUP(B26,Data!$A$4:$T$727,11,FALSE)))","v":""}]
[null,null,{"$f":"IF($B27=\"\",\"\",VLOOKUP($B27,Data!$A$4:$T$727,2,FALSE))","v":""},{"$f":"IF($B27=\"\",\"\",VLOOKUP($B27,Data!$A$4:$T$727,10,FALSE))","v":""},{"$f":"IF($B27=\"\",\"\",VLOOKUP($B27,Data!$A$4:$T$727,4,FALSE))","v":""},{"$f":"IF($B27=\"\",\"\",VLOOKUP($B27,Data!$A$4:$T$727,5,FALSE))","v":""},{"$f":"IF($B27=\"\",\"\",VLOOKUP($B27,Data!$A$4:$T$727,7,FALSE))","v":""},"","","","",{"$f":"IF($I$15=\"Show\",VLOOKUP($B27,Data!$A$4:$T$727,9,FALSE),VLOOKUP($B27,Data!$A$4:$T$727,7,FALSE))","v":{"$error":"#N/A"}},{"$f":"IF($B27=\"\",\"\",VLOOKUP($B27,Data!$A$4:$T$727,6,FALSE))","v":""},"",{"$f":"IF($B27=\"\",\"\",IF(VLOOKUP($B27,Data!$A$4:$T$727,11,FALSE)<1,\"\",VLOOKUP(B27,Data!$A$4:$T$727,11,FALSE)))","v":""}]
[null,null,{"$f":"IF($B28=\"\",\"\",VLOOKUP($B28,Data!$A$4:$T$727,2,FALSE))","v":""},{"$f":"IF($B28=\"\",\"\",VLOOKUP($B28,Data!$A$4:$T$727,10,FALSE))","v":""},{"$f":"IF($B28=\"\",\"\",VLOOKUP($B28,Data!$A$4:$T$727,4,FALSE))","v":""},{"$f":"IF($B28=\"\",\"\",VLOOKUP($B28,Data!$A$4:$T$727,5,FALSE))","v":""},{"$f":"IF($B28=\"\",\"\",VLOOKUP($B28,Data!$A$4:$T$727,7,FALSE))","v":""},"","","","",{"$f":"IF($I$15=\"Show\",VLOOKUP($B28,Data!$A$4:$T$727,9,FALSE),VLOOKUP($B28,Data!$A$4:$T$727,7,FALSE))","v":{"$error":"#N/A"}},{"$f":"IF($B28=\"\",\"\",VLOOKUP($B28,Data!$A$4:$T$727,6,FALSE))","v":""},"",{"$f":"IF($B28=\"\",\"\",IF(VLOOKUP($B28,Data!$A$4:$T$727,11,FALSE)<1,\"\",VLOOKUP(B28,Data!$A$4:$T$727,11,FALSE)))","v":""}]
[null,null,{"$f":"IF($B29=\"\",\"\",VLOOKUP($B29,Data!$A$4:$T$727,2,FALSE))","v":""},{"$f":"IF($B29=\"\",\"\",VLOOKUP($B29,Data!$A$4:$T$727,10,FALSE))","v":""},{"$f":"IF($B29=\"\",\"\",VLOOKUP($B29,Data!$A$4:$T$727,4,FALSE))","v":""},{"$f":"IF($B29=\"\",\"\",VLOOKUP($B29,Data!$A$4:$T$727,5,FALSE))","v":""},{"$f":"IF($B29=\"\",\"\",VLOOKUP($B29,Data!$A$4:$T$727,7,FALSE))","v":""},"","","","",{"$f":"IF($I$15=\"Show\",VLOOKUP($B29,Data!$A$4:$T$727,9,FALSE),VLOOKUP($B29,Data!$A$4:$T$727,7,FALSE))","v":{"$error":"#N/A"}},{"$f":"IF($B29=\"\",\"\",VLOOKUP($B29,Data!$A$4:$T$727,6,FALSE))","v":""},"",{"$f":"IF($B29=\"\",\"\",IF(VLOOKUP($B29,Data!$A$4:$T$727,11,FALSE)<1,\"\",VLOOKUP(B29,Data!$A$4:$T$727,11,FALSE)))","v":""}]
[null,null,{"$f":"IF($B30=\"\",\"\",VLOOKUP($B30,Data!$A$4:$T$727,2,FALSE))","v":""},{"$f":"IF($B30=\"\",\"\",VLOOKUP($B30,Data!$A$4:$T$727,10,FALSE))","v":""},{"$f":"IF($B30=\"\",\"\",VLOOKUP($B30,Data!$A$4:$T$727,4,FALSE))","v":""},{"$f":"IF($B30=\"\",\"\",VLOOKUP($B30,Data!$A$4:$T$727,5,FALSE))","v":""},{"$f":"IF($B30=\"\",\"\",VLOOKUP($B30,Data!$A$4:$T$727,7,FALSE))","v":""},"","","","",{"$f":"IF($I$15=\"Show\",VLOOKUP($B30,Data!$A$4:$T$727,9,FALSE),VLOOKUP($B30,Data!$A$4:$T$727,7,FALSE))","v":{"$error":"#N/A"}},{"$f":"IF($B30=\"\",\"\",VLOOKUP($B30,Data!$A$4:$T$727,6,FALSE))","v":""},"",{"$f":"IF($B30=\"\",\"\",IF(VLOOKUP($B30,Data!$A$4:$T$727,11,FALSE)<1,\"\",VLOOKUP(B30,Data!$A$4:$T$727,11,FALSE)))","v":""}]
{"$rows_left_out":572}
{"sheet":"Data","index":1,"n_rows":354,"n_cols":11,"rows_kept":354,"cut":false,"hidden":false,"merged":[]}
["1",2,3,4,5,6,7,8,9,10,11]
[]
["Item","Description ",null,"Catalog","Pg","CS PK","2025 WP","2025 SS","Check","UPC Code","Status"]
["222216G","Life-Size Animated KD-Freddy Krueger","NEW",2025,2,1,253.25,175,{"$f":"H4","v":175},"191245222163",{"$f":"IF($A4=\"\",\"\",IF(ISNA(VLOOKUP($A4,'PFA Direct'!$A$2:$J$96,1,FALSE)),\"\",\"On PFA Direct Import\"))","v":""}]
["222218G","Life-Size Animated KD-Jason Voorhees","NEW",2025,2,1,261.14999999999998,175,175,"191245222187",{"$f":"IF($A5=\"\",\"\",IF(ISNA(VLOOKUP($A5,'PFA Direct'!$A$2:$J$96,1,FALSE)),\"\",\"On PFA Direct Import\"))","v":""}]
["552068G","12' Life Size Animated KD-Poseable-ShortCircuit-Mummy (RGBC)",null,2025,2,1,380,250,250,"191245520689",{"$f":"IF($A6=\"\",\"\",IF(ISNA(VLOOKUP($A6,'PFA Direct'!$A$2:$J$96,1,FALSE)),\"\",\"On PFA Direct Import\"))","v":""}]
["66267","5' Animated Faux Chomp Plant","NEW",2025,2,1,86.95,65,65,"762543662670",{"$f":"IF($A7=\"\",\"\",IF(ISNA(VLOOKUP($A7,'PFA Direct'!$A$2:$J$96,1,FALSE)),\"\",\"On PFA Direct Import\"))","v":""}]
["66724","5.5' Standing Pop Up Creepy Lady","NEW",2025,2,1,58.1,42,42,"762543667248",{"$f":"IF($A8=\"\",\"\",IF(ISNA(VLOOKUP($A8,'PFA Direct'!$A$2:$J$96,1,FALSE)),\"\",\"On PFA Direct Import\"))","v":""}]
["66468","8.5' Animated Standing Up & Down Reaper","NEW",2025,3,1,82.15,65,65,"762543664681",{"$f":"IF($A9=\"\",\"\",IF(ISNA(VLOOKUP($A9,'PFA Direct'!$A$2:$J$96,1,FALSE)),\"\",\"On PFA Direct Import\"))","v":""}]
["66502","8' Animated Standing Clown","NEW",2025,3,1,96.9,74.5,74.5,"762543665022",{"$f":"IF($A10=\"\",\"\",IF(ISNA(VLOOKUP($A10,'PFA Direct'!$A$2:$J$96,1,FALSE)),\"\",\"On PFA Direct Import\"))","v":"On PFA Direct Import"}]
["66720","6' Standing Pop Up Pumpkin Man","NEW",2025,3,1,66.8,50,50,"762543667200",{"$f":"IF($A11=\"\",\"\",IF(ISNA(VLOOKUP($A11,'PFA Direct'!$A$2:$J$96,1,FALSE)),\"\",\"On PFA Direct Import\"))","v":""}]
["66721","5.5' Standing Animated Wings Reaper","NEW",2025,3,1,90.55,65,65,"762543667217",{"$f":"IF($A12=\"\",\"\",IF(ISNA(VLOOKUP($A12,'PFA Direct'!$A$2:$J$96,1,FALSE)),\"\",\"On PFA Direct Import\"))","v":""}]
["66782","6' Animated Werewolf","NEW",2025,3,1,178.1,130,130,"762543667828",{"$f":"IF($A13=\"\",\"\",IF(ISNA(VLOOKUP($A13,'PFA Direct'!$A$2:$J$96,1,FALSE)),\"\",\"On PFA Direct Import\"))","v":""}]
["64869","31.5\" Floating Girl",null,2025,4,4,21.3,18.100000000000001,18.100000000000001,"762543648698",{"$f":"IF($A14=\"\",\"\",IF(ISNA(VLOOKUP($A14,'PFA Direct'!$A$2:$J$96,1,FALSE)),\"\",\"On PFA Direct Import\"))","v":""}]
["66181","5.5' Standing Animated Creepy JOL Doll","NEW",2025,4,1,46.95,35,35,"762543661819",{"$f":"IF($A15=\"\",\"\",IF(ISNA(VLOOKUP($A15,'PFA Direct'!$A$2:$J$96,1,FALSE)),\"\",\"On PFA Direct Import\"))","v":""}]
["66622","Animated Standing Clown/Leather Shoes","NEW",2025,4,2,34.5,24.25,24.25,"762543666227",{"$f":"IF($A16=\"\",\"\",IF(ISNA(VLOOKUP($A16,'PFA Direct'!$A$2:$J$96,1,FALSE)),\"\",\"On PFA Direct Import\"))","v":""}]
["66631","Animated Mummy Groundbreaker","NEW",2025,4,2,33.799999999999997,28.75,28.75,"762543666319",{"$f":"IF($A17=\"\",\"\",IF(ISNA(VLOOKUP($A17,'PFA Direct'!$A$2:$J$96,1,FALSE)),\"\",\"On PFA Direct Import\"))","v":""}]
["66717","3' Standing Animated Leather Shoes Girl","NEW",2025,4,2,31.1,21.5,21.5,"762543667170",{"$f":"IF($A18=\"\",\"\",IF(ISNA(VLOOKUP($A18,'PFA Direct'!$A$2:$J$96,1,FALSE)),\"\",\"On PFA Direct Import\"))","v":""}]
["66723","5.7' Standing Animated Clown w/Balloon","NEW",2025,4,1,61.75,44,44,"762543667231",{"$f":"IF($A19=\"\",\"\",IF(ISNA(VLOOKUP($A19,'PFA Direct'!$A$2:$J$96,1,FALSE)),\"\",\"On PFA Direct Import\"))","v":""}]
["66736","5' Animated Talking Skeleton","NEW",2025,4,1,90.85,65,65,"762543667361",{"$f":"IF($A20=\"\",\"\",IF(ISNA(VLOOKUP($A20,'PFA Direct'!$A$2:$J$96,1,FALSE)),\"\",\"On PFA Direct Import\"))","v":""}]
["66766","5.6' Animated Standing Witch","NEW",2025,4,1,40.200000000000003,34.15,34.15,"762543667668",{"$f":"IF($A21=\"\",\"\",IF(ISNA(VLOOKUP($A21,'PFA Direct'!$A$2:$J$96,1,FALSE)),\"\",\"On PFA Direct Import\"))","v":""}]
["64934","35\" Peek-a-Boo Ghost",null,2025,5,4,19.2,16.3,16.3,"762543649343",{"$f":"IF($A22=\"\",\"\",IF(ISNA(VLOOKUP($A22,'PFA Direct'!$A$2:$J$96,1,FALSE)),\"\",\"On PFA Direct Import\"))","v":""}]
["65626","6' Hanging Shaking Bloody Reaper","NEW",2025,5,2,29.45,25,25,"762543656266",{"$f":"IF($A23=\"\",\"\",IF(ISNA(VLOOKUP($A23,'PFA Direct'!$A$2:$J$96,1,FALSE)),\"\",\"On PFA Direct Import\"))","v":""}]
["65947","35\" Animated Hanging White Girl","NEW",2025,5,6,10.1,8.6,8.6,"762543659472",{"$f":"IF($A24=\"\",\"\",IF(ISNA(VLOOKUP($A24,'PFA Direct'!$A$2:$J$96,1,FALSE)),\"\",\"On PFA Direct Import\"))","v":""}]
["66561","Hanging Animated Burlap Scarecrow","NEW",2025,5,2,35.549999999999997,30.2,30.2,"762543665619",{"$f":"IF($A25=\"\",\"\",IF(ISNA(VLOOKUP($A25,'PFA Direct'!$A$2:$J$96,1,FALSE)),\"\",\"On PFA Direct Import\"))","v":""}]
["66690","3' Hanging Animated Clown","NEW",2025,5,6,17.55,14.9,14.9,"762543666906",{"$f":"IF($A26=\"\",\"\",IF(ISNA(VLOOKUP($A26,'PFA Direct'!$A$2:$J$96,1,FALSE)),\"\",\"On PFA Direct Import\"))","v":""}]
["66700","5' Hanging Shaking Scarecrow","NEW",2025,5,2,29.25,24.85,24.85,"762543667002",{"$f":"IF($A27=\"\",\"\",IF(ISNA(VLOOKUP($A27,'PFA Direct'!$A$2:$J$96,1,FALSE)),\"\",\"On PFA Direct Import\"))","v":""}]
["66702","5' Hanging Animated Reaper","NEW",2025,5,4,25.05,21.3,21.3,"762543667026",{"$f":"IF($A28=\"\",\"\",IF(ISNA(VLOOKUP($A28,'PFA Direct'!$A$2:$J$96,1,FALSE)),\"\",\"On PFA Direct Import\"))","v":""}]
["82327","Small Faceless Spectre in Chains",null,2025,5,6,16.3,13.85,13.85,"762543823279",{"$f":"IF($A29=\"\",\"\",IF(ISNA(VLOOKUP($A29,'PFA Direct'!$A$2:$J$96,1,FALSE)),\"\",\"On PFA Direct Import\"))","v":""}]
["62886","31.5\" Animated Walking Spider w/Web",null,2025,6,6,13,11.05,11.05,"762543628867",{"$f":"IF($A30=\"\",\"\",IF(ISNA(VLOOKUP($A30,'PFA Direct'!$A$2:$J$96,1,FALSE)),\"\",\"On PFA Direct Import\"))","v":""}]
{"$rows_left_out":325}
{"sheet":"PFA Direct","index":2,"n_rows":80,"n_cols":7,"rows_kept":80,"cut":false,"hidden":false,"merged":[]}
["Item #","display sort","Category","Item","Sample?","Image"]
["65466",null,"Deco","7in Crawling Hand Flesh Color"]
["114463G",null,"Deco","Christmas Grinch Hng Inflatable 4' Gemmy"]
["92748",null,"Spider","48in Hairy Spider A/3 (24 PFA)"]
["45726",null,"Spider","5FT LARGE BLACK SPIDER"]
["48258",null,"Skeleton","3Pk 4in Skulls"]
["48310",null,"Skeleton","10ft Standing Titan Skeleton w/Multicolor Lights"]
["61709",null,"Deco","20\" Bloody Hand & Foot"]
["64821",null,"Deco","33.5\" Peek-a-boo Witch Ghost"]
["65296",null,"Deco","78.7\" X 39in Halloween Burlap Decor","Y"]
["65317",null,"Deco","19.7\" Hanging Black Bat"]
["65745",null,"Accessory","Faux Eyeballs In Mesh Bag - Set of 8"]
["65759",null,"Spider","Brown Spider"]
["75384",null,"Tombstone","22\" CEMETERY MARKERS"]
["92747",null,"Hng Deco","21\" Hanging Zombie A/2 (24 PFA)"]
["95608",null,"Deco","Fake Door Curtain A2 Printed Non-Woven","Crypt Door Only"]
["95629",null,"Hng Deco","30in Hanging Reaper A/2 (24 PFA)"]
["95630",null,"Tombstone","21.5'' tombstone"]
["95631",null,"Tombstone","16.5\" Tombstone"]
["06501",null,"Deco","5in Realistic Rat"]
["94847",null,"Hng Prop","Hanging Reaper Assortment 18\" A3"]
["48026",null,"Deco","8.8FT Huge Giant Bat"]
["64727",null,"Spider Web","197\" Stretch Web Material"]
["39280",null,"Deco","35in Reailstic Skeleton"]
["39293",null,"Hanging Deco","20in Skeleton"]
["46609",null,"Spider","73in Grey Trim Black Spider (Add sls from 45879)"]
["46804",null,"Skeleton","60in Posable Skeleton"]
["62372",null,"Bag of","2\" Glow In Dark Eyeballs in Mesh Bag"]
["75064",null,"Spider","90IN GIANT GRAY SPIDER"]
["78216",null,"Hng Prop","32in Hanging Ghost"]
{"$rows_left_out":50}